automatic DPDK test reports
 help / color / Atom feed
* [dpdk-test-report] |FAILURE| pw60867[v2] net/bonding: fix selection logic
@ 2019-10-10  9:11 sys_stv
  0 siblings, 0 replies; only message in thread
From: sys_stv @ 2019-10-10  9:11 UTC (permalink / raw)
  To: test-report

[-- Attachment #1: Type: text/plain, Size: 20654 bytes --]

Test-Label: Intel-compilation
Test-Status: FAILURE
http://dpdk.org/patch/60867

_Compilation issues_

Submitter: Krzysztof Kanas <kkanas@marvell.com>
Date: 2019-10-10 08:27:04
Reply_mail: 20191010082705.22109-1-kkanas@marvell.com
DPDK git baseline: Repo:dpdk-next-net, CommitID: ba718080c23485f1f35a7fdafd9bc6d693e8e2a8

Makefile build Summary: 22 Builds Done, 22 Successful, 0 Failures

Meson build Summary: 7 Builds Done, 2 Successful, 5 Failures

               +==============================================+===========+==========+
               |                   Makefile                   |   Meson   | Document |
+--------------+------+-------+------+------------+-----------+-----------+----------+
| os           | gcc  | clang | icc  | gcc+shared | gcc+debug | gcc/clang | pdf/html |
+--------------+------+-------+------+------------+-----------+-----------+----------+
| RHEL76-64    | pass |       |      |            |           |           |          |
| CENTOS76-64  | pass | pass  | pass | pass       | pass      |           |          |
| UB1804-64    | pass | pass  | pass |            |           | FAIL      | pass     |
| UB1604-32    | pass |       |      |            |           | FAIL      |          |
| UB1904-64    | pass |       |      |            |           |           |          |
| UB1604-64    | pass | pass  |      |            |           |           |          |
| FC30-64      | pass | pass  |      |            |           | FAIL      |          |
| WIN10-64     |      |       |      |            |           | pass      |          |
| FreeBSD12-64 | pass | pass  |      | pass       | pass      | FAIL      |          |
| RHEL80-64    | pass |       |      |            |           |           |          |
| SUSE15-64    | pass | pass  |      |            |           | FAIL      |          |
+--------------+------+-------+------+------------+-----------+-----------+----------+

Test environment and configuration as below:

** Makefile build **


OS: RHEL76-64
	Kernel Version: 3.10.0-957.el7.x86_64
	CPU info: Intel(R) Xeon(R) CPU E5-2699 v4 @ 2.20GHz
	GCC Version: gcc (GCC) 4.8.5 20150623 (Red Hat 4.8.5-36)
	Clang Version: NA
	x86_64-native-linuxapp-gcc


OS: CENTOS76-64
	Kernel Version: 3.10.0-957.27.2.el7.x86_64
	CPU info: Intel(R) Xeon(R) CPU E5-2699 v4 @ 2.20GHz
	GCC Version: gcc (GCC) 4.8.5 20150623 (Red Hat 4.8.5-36)
	Clang Version: 3.4.2 (tags/RELEASE_34/dot2-final)
	x86_64-native-linuxapp-clang
	x86_64-native-linuxapp-gcc+debug
	x86_64-native-linuxapp-gcc
	x86_64-native-linuxapp-gcc+shared
	x86_64-native-linuxapp-icc


OS: UB1804-64
	Kernel Version: 4.15.0-20-generic
	CPU info: Intel(R) Xeon(R) CPU E5-2699 v3 @ 2.30GHz
	GCC Version: gcc (Ubuntu 7.3.0-16ubuntu3) 7.3.0
	Clang Version: 6.0.0-1ubuntu2 (tags/RELEASE_600/final)
	x86_64-native-linuxapp-clang
	x86_64-native-linuxapp-icc
	x86_64-native-linuxapp-gcc


OS: UB1904-64
	Kernel Version: 5.0.0-13-generic
	CPU info: Intel(R) Xeon(R) CPU E5-2699 v3 @ 2.30GHz
	GCC Version: gcc (Ubuntu 8.3.0-6ubuntu1) 8.3.0
	Clang Version: 8.0.0-3 (tags/RELEASE_800/final)
	x86_64-native-linuxapp-gcc


OS: UB1604-32
	Kernel Version: 4.4.0-131-generic
	CPU info: Intel(R) Xeon(R) CPU E5-2699 v3 @ 2.30GHz
	GCC Version: gcc (Ubuntu 5.4.0-6ubuntu1~16.04.11) 5.4.0 20160609
	Clang Version: 3.8.0-2ubuntu4 (tags/RELEASE_380/final)
	i686-native-linuxapp-gcc


OS: UB1604-64
	Kernel Version: 4.4.0-47-generic
	CPU info: Intel(R) Xeon(R) CPU E5-2699 v3 @ 2.30GHz
	GCC Version: gcc (Ubuntu 5.4.0-6ubuntu1~16.04.10) 5.4.0 20160609
	Clang Version: 3.8.0-2ubuntu4 (tags/RELEASE_380/final)
	x86_64-native-linuxapp-clang
	x86_64-native-linuxapp-gcc


OS: FC30-64
	Kernel Version: 5.1.7-300.fc30.x86_64
	CPU info: Intel(R) Xeon(R) CPU E5-2699 v4 @ 2.20GHz
	GCC Version: gcc (GCC) 9.1.1 20190503 (Red Hat 9.1.1-1)
	Clang Version: 8.0.0 (Fedora 8.0.0-1.fc30)
	x86_64-native-linuxapp-gcc
	x86_64-native-linuxapp-clang


OS: FreeBSD12-64
	Kernel Version: 12.0-RC3
	CPU info: Intel(R) Xeon(R) CPU E5-2699 v4 @ 2.20GHz (2194.98-MHz K8-class CPU)
	GCC Version: gcc (FreeBSD Ports Collection) 7.3.0
	Clang Version: 6.0.1 (tags/RELEASE_601/final 335540) (based on LLVM 6.0.1)
	x86_64-native-bsdapp-clang
	x86_64-native-bsdapp-gcc+shared
	x86_64-native-bsdapp-gcc+debug
	x86_64-native-bsdapp-gcc


OS: RHEL80-64
	Kernel Version: 4.18.0-80.el8.x86_64
	CPU info: Intel(R) Xeon(R) CPU E5-2699 v4 @ 2.20GHz
	GCC Version: gcc (GCC) 8.2.1 20180905 (Red Hat 8.2.1-3)
	Clang Version: 6.0.1 (tags/RELEASE_601/final)
	x86_64-native-linuxapp-gcc


OS: SUSE15-64
	Kernel Version: 4.12.14-lp150.11-default
	CPU info: Intel(R) Xeon(R) CPU E5-2699 v4 @ 2.20GHz
	GCC Version: gcc (SUSE Linux) 7.3.1 20180323 [gcc-7-branch revision 258812]
	Clang Version: 5.0.1 (tags/RELEASE_501/final 312548)
	x86_64-native-linuxapp-gcc
	x86_64-native-linuxapp-clang


** Meson build **


OS: UB1804-64
	Kernel Version: 4.15.0-20-generic
	CPU info: Intel(R) Xeon(R) CPU E5-2699 v4 @ 2.20GHz
	GCC Version: gcc (Ubuntu 7.3.0-27ubuntu1~18.04) 7.3.0
	Clang Version: 6.0.0-1ubuntu2 (tags/RELEASE_600/final)
	x86_64-native-linuxapp-doc
	build-gcc-static
	build-gcc-shared
	build-clang-static
	build-clang-shared
	build-x86-default


OS: UB1604-32
	Kernel Version: 4.4.0-131-generic
	CPU info: Intel(R) Xeon(R) CPU E5-2699 v4 @ 2.20GHz
	GCC Version: gcc (Ubuntu 5.4.0-6ubuntu1~16.04.11) 5.4.0 20160609
	Clang Version: 3.8.0-2ubuntu4 (tags/RELEASE_380/final)
	build-gcc-static
	build-gcc-shared
	build-clang-static
	build-clang-shared
	build-x86-default


OS: FC30-64
	Kernel Version: 5.0.9-301.fc30.x86_64
	CPU info: Intel(R) Xeon(R) CPU E5-2699 v4 @ 2.20GHz
	GCC Version: gcc (GCC) 9.1.1 20190503 (Red Hat 9.1.1-1)
	Clang Version: 8.0.0 (Fedora 8.0.0-1.fc30)
	build-gcc-static
	build-gcc-shared
	build-clang-static
	build-clang-shared
	build-x86-default


OS: WIN10-64
	Kernel Version: N/A
	CPU info: N/A
	GCC Version: N/A
	Clang Version: Clang 8.0.0
	x86_64-windows-clang


OS: FreeBSD12-64
	Kernel Version: 12.0-RC3
	CPU info: Intel(R) Xeon(R) CPU E5-2699 v4 @ 2.20GHz (2194.97-MHz K8-class CPU)
	GCC Version: gcc (FreeBSD Ports Collection) 7.3.0
	Clang Version: 6.0.1 (tags/RELEASE_601/final 335540) (based on LLVM 6.0.1)
	build-gcc-static
	build-gcc-shared
	build-clang-static
	build-clang-shared
	build-x86-default


OS: SUSE15-64
	Kernel Version: 4.12.14-lp150.11-default
	CPU info: Intel(R) Xeon(R) CPU E5-2699 v4 @ 2.20GHz
	GCC Version: gcc (SUSE Linux) 7.3.1 20180323 [gcc-7-branch revision 258812]
	Clang Version: 5.0.1 (tags/RELEASE_501/final 312548)
	build-gcc-static
	build-gcc-shared
	build-clang-static
	build-clang-shared
	build-x86-default


*Meson Build Failed #1:
OS: SUSE15-64
Target:build-gcc-static
FAILED: drivers/a715181@@tmp_rte_pmd_bond@sta/net_bonding_rte_eth_bond_8023ad.c.o 
gcc -Idrivers/a715181@@tmp_rte_pmd_bond@sta -Idrivers -I../drivers -Idrivers/net/bonding -I../drivers/net/bonding -Ilib/librte_ethdev -I../lib/librte_ethdev -I. -I../ -Iconfig -I../config -Ilib/librte_eal/common/include -I../lib/librte_eal/common/include -I../lib/librte_eal/linux/eal/include -Ilib/librte_eal/common -I../lib/librte_eal/common -Ilib/librte_eal/common/include/arch/x86 -I../lib/librte_eal/common/include/arch/x86 -Ilib/librte_eal -I../lib/librte_eal -Ilib/librte_kvargs -I../lib/librte_kvargs -Ilib/librte_net -I../lib/librte_net -Ilib/librte_mbuf -I../lib/librte_mbuf -Ilib/librte_mempool -I../lib/librte_mempool -Ilib/librte_ring -I../lib/librte_ring -Ilib/librte_meter -I../lib/librte_meter -Idrivers/bus/pci -I../drivers/bus/pci -I../drivers/bus/pci/linux -Ilib/librte_pci -I../lib/librte_pci -Idrivers/bus/vdev -I../drivers/bus/vdev -Ilib/librte_sched -I../lib/librte_sched -Ilib/librte_ip_frag -I../lib/librte_ip_frag -Ilib/librte_hash -I../lib/librte_hash -fdiagnostics-color=always -pipe -D_FILE_OFFSET_BITS=64 -Wall -Winvalid-pch -Werror -O3 -include rte_config.h -Wunused-parameter -Wsign-compare -Wcast-qual -D_GNU_SOURCE -fPIC -march=native -Wno-format-truncation -DALLOW_EXPERIMENTAL_API -MD -MQ 'drivers/a715181@@tmp_rte_pmd_bond@sta/net_bonding_rte_eth_bond_8023ad.c.o' -MF 'drivers/a715181@@tmp_rte_pmd_bond@sta/net_bonding_rte_eth_bond_8023ad.c.o.d' -o 'drivers/a715181@@tmp_rte_pmd_bond@sta/net_bonding_rte_eth_bond_8023ad.c.o' -c ../drivers/net/bonding/rte_eth_bond_8023ad.c
../drivers/net/bonding/rte_eth_bond_8023ad.c: In function ‘selection_logic’:
../drivers/net/bonding/rte_eth_bond_8023ad.c:719:17: error: statement will never be executed [-Werror=switch-unreachable]
   agg_new_idx = max_index(agg_count, slaves_count);
                 ^~~~~~~~~~~~~~~~~~~~~~~~~~~~~~~~~~
../drivers/net/bonding/rte_eth_bond_8023ad.c:742:28: error: ‘new_agg_id’ may be used uninitialized in this function [-Werror=maybe-uninitialized]
   port->aggregator_port_id = new_agg_id;
   ~~~~~~~~~~~~~~~~~~~~~~~~~^~~~~~~~~~~~
cc1: all warnings being treated as errors
[601/1876] Compiling C object 'drivers/a715181@@tmp_rte_pmd_bond@sta/net_bonding_rte_eth_bond_pmd.c.o'.
[602/1876] Compiling C object 'drivers/a715181@@tmp_rte_pmd_bnx2x@sta/net_bnx2x_bnx2x_rxtx.c.o'.
[603/1876] Compiling C object 'drivers/a715181@@tmp_rte_pmd_bnx2x@sta/net_bnx2x_ecore_sp.c.o'.
[604/1876] Compiling C object 'drivers/a715181@@tmp_rte_pmd_bnx2x@sta/net_bnx2x_bnx2x_stats.c.o'.
[605/1876] Compiling C object 'drivers/a715181@@tmp_rte_pmd_bnx2x@sta/net_bnx2x_bnx2x.c.o'.
[606/1876] Compiling C object 'lib/76b5a35@@rte_pipeline@sta/librte_pipeline_rte_table_action.c.o'.
[607/1876] Compiling C object 'drivers/a715181@@tmp_rte_pmd_bnx2x@sta/net_bnx2x_elink.c.o'.
ninja: build stopped: subcommand failed




*Meson Build Failed #2:
OS: FC30-64
Target:build-gcc-static
FAILED: drivers/a715181@@tmp_rte_pmd_bond@sta/net_bonding_rte_eth_bond_8023ad.c.o 
gcc -Idrivers/a715181@@tmp_rte_pmd_bond@sta -Idrivers -I../drivers -Idrivers/net/bonding -I../drivers/net/bonding -Ilib/librte_ethdev -I../lib/librte_ethdev -I. -I../ -Iconfig -I../config -Ilib/librte_eal/common/include -I../lib/librte_eal/common/include -I../lib/librte_eal/linux/eal/include -Ilib/librte_eal/common -I../lib/librte_eal/common -Ilib/librte_eal/common/include/arch/x86 -I../lib/librte_eal/common/include/arch/x86 -Ilib/librte_eal -I../lib/librte_eal -Ilib/librte_kvargs -I../lib/librte_kvargs -Ilib/librte_net -I../lib/librte_net -Ilib/librte_mbuf -I../lib/librte_mbuf -Ilib/librte_mempool -I../lib/librte_mempool -Ilib/librte_ring -I../lib/librte_ring -Ilib/librte_meter -I../lib/librte_meter -Idrivers/bus/pci -I../drivers/bus/pci -I../drivers/bus/pci/linux -Ilib/librte_pci -I../lib/librte_pci -Idrivers/bus/vdev -I../drivers/bus/vdev -Ilib/librte_sched -I../lib/librte_sched -Ilib/librte_ip_frag -I../lib/librte_ip_frag -Ilib/librte_hash -I../lib/librte_hash -fdiagnostics-color=always -pipe -D_FILE_OFFSET_BITS=64 -Wall -Winvalid-pch -Werror -O3 -include rte_config.h -Wunused-parameter -Wsign-compare -Wcast-qual -Wno-address-of-packed-member -D_GNU_SOURCE -fPIC -march=native -mno-avx512f -Wno-format-truncation -DALLOW_EXPERIMENTAL_API -MD -MQ 'drivers/a715181@@tmp_rte_pmd_bond@sta/net_bonding_rte_eth_bond_8023ad.c.o' -MF 'drivers/a715181@@tmp_rte_pmd_bond@sta/net_bonding_rte_eth_bond_8023ad.c.o.d' -o 'drivers/a715181@@tmp_rte_pmd_bond@sta/net_bonding_rte_eth_bond_8023ad.c.o' -c ../drivers/net/bonding/rte_eth_bond_8023ad.c
../drivers/net/bonding/rte_eth_bond_8023ad.c: In function ‘selection_logic’:
../drivers/net/bonding/rte_eth_bond_8023ad.c:719:17: error: statement will never be executed [-Werror=switch-unreachable]
  719 |   agg_new_idx = max_index(agg_count, slaves_count);
      |                 ^~~~~~~~~~~~~~~~~~~~~~~~~~~~~~~~~~
../drivers/net/bonding/rte_eth_bond_8023ad.c:742:28: error: ‘new_agg_id’ may be used uninitialized in this function [-Werror=maybe-uninitialized]
  742 |   port->aggregator_port_id = new_agg_id;
      |   ~~~~~~~~~~~~~~~~~~~~~~~~~^~~~~~~~~~~~
cc1: all warnings being treated as errors
[606/1829] Compiling C object 'drivers/a715181@@tmp_rte_pmd_bnxt@sta/net_bnxt_bnxt_ring.c.o'.
[607/1829] Compiling C object 'drivers/a715181@@tmp_rte_pmd_bnxt@sta/net_bnxt_bnxt_stats.c.o'.
[608/1829] Compiling C object 'drivers/a715181@@tmp_rte_pmd_bnxt@sta/net_bnxt_bnxt_rxr.c.o'.
[609/1829] Compiling C object 'drivers/a715181@@tmp_rte_pmd_bnxt@sta/net_bnxt_bnxt_rxq.c.o'.
[610/1829] Compiling C object 'drivers/a715181@@tmp_rte_pmd_bnxt@sta/net_bnxt_bnxt_ethdev.c.o'.
[611/1829] Compiling C object 'drivers/a715181@@tmp_rte_pmd_bnxt@sta/net_bnxt_bnxt_hwrm.c.o'.
[612/1829] Compiling C object 'lib/76b5a35@@rte_pipeline@sta/librte_pipeline_rte_table_action.c.o'.
ninja: build stopped: subcommand failed




*Meson Build Failed #3:
OS: UB1604-32
Target:build-gcc-static
FAILED: drivers/a715181@@tmp_rte_pmd_bond@sta/net_bonding_rte_eth_bond_8023ad.c.o 
gcc -Idrivers/a715181@@tmp_rte_pmd_bond@sta -Idrivers -I../drivers -Idrivers/net/bonding -I../drivers/net/bonding -Ilib/librte_ethdev -I../lib/librte_ethdev -I. -I../ -Iconfig -I../config -Ilib/librte_eal/common/include -I../lib/librte_eal/common/include -I../lib/librte_eal/linux/eal/include -Ilib/librte_eal/common -I../lib/librte_eal/common -Ilib/librte_eal/common/include/arch/x86 -I../lib/librte_eal/common/include/arch/x86 -Ilib/librte_eal -I../lib/librte_eal -Ilib/librte_kvargs -I../lib/librte_kvargs -Ilib/librte_net -I../lib/librte_net -Ilib/librte_mbuf -I../lib/librte_mbuf -Ilib/librte_mempool -I../lib/librte_mempool -Ilib/librte_ring -I../lib/librte_ring -Ilib/librte_meter -I../lib/librte_meter -Idrivers/bus/pci -I../drivers/bus/pci -I../drivers/bus/pci/linux -Ilib/librte_pci -I../lib/librte_pci -Idrivers/bus/vdev -I../drivers/bus/vdev -Ilib/librte_sched -I../lib/librte_sched -Ilib/librte_ip_frag -I../lib/librte_ip_frag -Ilib/librte_hash -I../lib/librte_hash -fdiagnostics-color=always -pipe -D_FILE_OFFSET_BITS=64 -Wall -Winvalid-pch -Werror -O3 -include rte_config.h -Wunused-parameter -Wsign-compare -Wcast-qual -Wno-pointer-to-int-cast -D_GNU_SOURCE -fPIC -march=native -DALLOW_EXPERIMENTAL_API -MD -MQ 'drivers/a715181@@tmp_rte_pmd_bond@sta/net_bonding_rte_eth_bond_8023ad.c.o' -MF 'drivers/a715181@@tmp_rte_pmd_bond@sta/net_bonding_rte_eth_bond_8023ad.c.o.d' -o 'drivers/a715181@@tmp_rte_pmd_bond@sta/net_bonding_rte_eth_bond_8023ad.c.o' -c ../drivers/net/bonding/rte_eth_bond_8023ad.c
../drivers/net/bonding/rte_eth_bond_8023ad.c: In function ‘selection_logic’:
../drivers/net/bonding/rte_eth_bond_8023ad.c:742:28: error: ‘new_agg_id’ may be used uninitialized in this function [-Werror=maybe-uninitialized]
   port->aggregator_port_id = new_agg_id;
                            ^
cc1: all warnings being treated as errors
[604/1682] Compiling C object 'drivers/a715181@@tmp_rte_pmd_bnxt@sta/net_bnxt_bnxt_rxq.c.o'.
[605/1682] Compiling C object 'drivers/a715181@@tmp_rte_pmd_bnxt@sta/net_bnxt_bnxt_rxr.c.o'.
[606/1682] Compiling C object 'drivers/a715181@@tmp_rte_pmd_bnxt@sta/net_bnxt_bnxt_stats.c.o'.
[607/1682] Compiling C object 'drivers/a715181@@tmp_rte_pmd_bnxt@sta/net_bnxt_bnxt_txq.c.o'.
[608/1682] Compiling C object 'drivers/a715181@@tmp_rte_pmd_bnxt@sta/net_bnxt_bnxt_hwrm.c.o'.
ninja: build stopped: subcommand failed




*Meson Build Failed #4:
OS: UB1804-64
Target:build-gcc-static
FAILED: drivers/a715181@@tmp_rte_pmd_bond@sta/net_bonding_rte_eth_bond_8023ad.c.o 
gcc -Idrivers/a715181@@tmp_rte_pmd_bond@sta -Idrivers -I../drivers -Idrivers/net/bonding -I../drivers/net/bonding -Ilib/librte_ethdev -I../lib/librte_ethdev -I. -I../ -Iconfig -I../config -Ilib/librte_eal/common/include -I../lib/librte_eal/common/include -I../lib/librte_eal/linux/eal/include -Ilib/librte_eal/common -I../lib/librte_eal/common -Ilib/librte_eal/common/include/arch/x86 -I../lib/librte_eal/common/include/arch/x86 -Ilib/librte_eal -I../lib/librte_eal -Ilib/librte_kvargs -I../lib/librte_kvargs -Ilib/librte_net -I../lib/librte_net -Ilib/librte_mbuf -I../lib/librte_mbuf -Ilib/librte_mempool -I../lib/librte_mempool -Ilib/librte_ring -I../lib/librte_ring -Ilib/librte_meter -I../lib/librte_meter -Idrivers/bus/pci -I../drivers/bus/pci -I../drivers/bus/pci/linux -Ilib/librte_pci -I../lib/librte_pci -Idrivers/bus/vdev -I../drivers/bus/vdev -Ilib/librte_sched -I../lib/librte_sched -Ilib/librte_ip_frag -I../lib/librte_ip_frag -Ilib/librte_hash -I../lib/librte_hash -fdiagnostics-color=always -pipe -D_FILE_OFFSET_BITS=64 -Wall -Winvalid-pch -Werror -O3 -include rte_config.h -Wunused-parameter -Wsign-compare -Wcast-qual -D_GNU_SOURCE -fPIC -march=native -mno-avx512f -Wno-format-truncation -DALLOW_EXPERIMENTAL_API -MD -MQ 'drivers/a715181@@tmp_rte_pmd_bond@sta/net_bonding_rte_eth_bond_8023ad.c.o' -MF 'drivers/a715181@@tmp_rte_pmd_bond@sta/net_bonding_rte_eth_bond_8023ad.c.o.d' -o 'drivers/a715181@@tmp_rte_pmd_bond@sta/net_bonding_rte_eth_bond_8023ad.c.o' -c ../drivers/net/bonding/rte_eth_bond_8023ad.c
../drivers/net/bonding/rte_eth_bond_8023ad.c: In function ‘selection_logic’:
../drivers/net/bonding/rte_eth_bond_8023ad.c:719:17: error: statement will never be executed [-Werror=switch-unreachable]
   agg_new_idx = max_index(agg_count, slaves_count);
                 ^~~~~~~~~~~~~~~~~~~~~~~~~~~~~~~~~~
../drivers/net/bonding/rte_eth_bond_8023ad.c:742:28: error: ‘new_agg_id’ may be used uninitialized in this function [-Werror=maybe-uninitialized]
   port->aggregator_port_id = new_agg_id;
   ~~~~~~~~~~~~~~~~~~~~~~~~~^~~~~~~~~~~~
cc1: all warnings being treated as errors
[608/1836] Compiling C object 'drivers/a715181@@tmp_rte_pmd_bond@sta/net_bonding_rte_eth_bond_pmd.c.o'.
[609/1836] Compiling C object 'drivers/a715181@@tmp_rte_pmd_bnx2x@sta/net_bnx2x_bnx2x_rxtx.c.o'.
[610/1836] Compiling C object 'drivers/a715181@@tmp_rte_pmd_bnx2x@sta/net_bnx2x_bnx2x_vfpf.c.o'.
[611/1836] Compiling C object 'drivers/a715181@@tmp_rte_pmd_bnx2x@sta/net_bnx2x_bnx2x_stats.c.o'.
[612/1836] Compiling C object 'drivers/a715181@@tmp_rte_pmd_bnx2x@sta/net_bnx2x_bnx2x.c.o'.
ninja: build stopped: subcommand failed




*Meson Build Failed #5:
OS: FreeBSD12-64
Target:build-gcc-static
FAILED: drivers/a715181@@tmp_rte_pmd_bond@sta/net_bonding_rte_eth_bond_8023ad.c.o 
ccache gcc -Idrivers/a715181@@tmp_rte_pmd_bond@sta -Idrivers -I../drivers -Idrivers/net/bonding -I../drivers/net/bonding -Ilib/librte_ethdev -I../lib/librte_ethdev -I. -I../ -Iconfig -I../config -Ilib/librte_eal/common/include -I../lib/librte_eal/common/include -I../lib/librte_eal/freebsd/eal/include -Ilib/librte_eal/common -I../lib/librte_eal/common -Ilib/librte_eal/common/include/arch/x86 -I../lib/librte_eal/common/include/arch/x86 -Ilib/librte_eal -I../lib/librte_eal -Ilib/librte_kvargs -I../lib/librte_kvargs -Ilib/librte_net -I../lib/librte_net -Ilib/librte_mbuf -I../lib/librte_mbuf -Ilib/librte_mempool -I../lib/librte_mempool -Ilib/librte_ring -I../lib/librte_ring -Ilib/librte_meter -I../lib/librte_meter -Idrivers/bus/pci -I../drivers/bus/pci -I../drivers/bus/pci/bsd -Ilib/librte_pci -I../lib/librte_pci -Idrivers/bus/vdev -I../drivers/bus/vdev -Ilib/librte_sched -I../lib/librte_sched -Ilib/librte_ip_frag -I../lib/librte_ip_frag -Ilib/librte_hash -I../lib/librte_hash -fdiagnostics-color=always -pipe -D_FILE_OFFSET_BITS=64 -Wall -Winvalid-pch -Werror -O3 -include rte_config.h -Wunused-parameter -Wsign-compare -Wcast-qual -D_GNU_SOURCE -D__BSD_VISIBLE -fPIC -march=native -Wno-format-truncation -DALLOW_EXPERIMENTAL_API -MD -MQ 'drivers/a715181@@tmp_rte_pmd_bond@sta/net_bonding_rte_eth_bond_8023ad.c.o' -MF 'drivers/a715181@@tmp_rte_pmd_bond@sta/net_bonding_rte_eth_bond_8023ad.c.o.d' -o 'drivers/a715181@@tmp_rte_pmd_bond@sta/net_bonding_rte_eth_bond_8023ad.c.o' -c ../drivers/net/bonding/rte_eth_bond_8023ad.c
../drivers/net/bonding/rte_eth_bond_8023ad.c: In function 'selection_logic':
../drivers/net/bonding/rte_eth_bond_8023ad.c:719:17: error: statement will never be executed [-Werror=switch-unreachable]
   agg_new_idx = max_index(agg_count, slaves_count);
                 ^~~~~~~~~~~~~~~~~~~~~~~~~~~~~~~~~~
../drivers/net/bonding/rte_eth_bond_8023ad.c:742:28: error: 'new_agg_id' may be used uninitialized in this function [-Werror=maybe-uninitialized]
   port->aggregator_port_id = new_agg_id;
   ~~~~~~~~~~~~~~~~~~~~~~~~~^~~~~~~~~~~~
cc1: all warnings being treated as errors
[247/1438] Compiling C object 'lib/76b5a35@@rte_port@sta/librte_port_rte_port_sched.c.o'.
[248/1438] Compiling C object 'lib/76b5a35@@rte_port@sta/librte_port_rte_port_ring.c.o'.
[249/1438] Generating symbol file 'lib/76b5a35@@rte_mempool@sha/librte_mempool.so.5.1.symbols'.
[250/1438] Generating symbol file 'lib/76b5a35@@rte_rawdev@sha/librte_rawdev.so.1.1.symbols'.
[251/1438] Generating symbol file 'lib/76b5a35@@rte_stack@sha/librte_stack.so.1.1.symbols'.
ninja: build stopped: subcommand failed



DPDK STV team

^ permalink raw reply	[flat|nested] only message in thread

only message in thread, back to index

Thread overview: (only message) (download: mbox.gz / follow: Atom feed)
-- links below jump to the message on this page --
2019-10-10  9:11 [dpdk-test-report] |FAILURE| pw60867[v2] net/bonding: fix selection logic sys_stv

automatic DPDK test reports

Archives are clonable:
	git clone --mirror http://inbox.dpdk.org/test-report/0 test-report/git/0.git

	# If you have public-inbox 1.1+ installed, you may
	# initialize and index your mirror using the following commands:
	public-inbox-init -V2 test-report test-report/ http://inbox.dpdk.org/test-report \
		test-report@dpdk.org
	public-inbox-index test-report


Newsgroup available over NNTP:
	nntp://inbox.dpdk.org/inbox.dpdk.test-report


AGPL code for this site: git clone https://public-inbox.org/ public-inbox