automatic DPDK test reports
 help / color / Atom feed
* [dpdk-test-report]  |FAILURE| pw61531[v11, 07/19] raw/ifpga/base: add sensor support
@ 2019-10-21  8:10 sys_stv
  0 siblings, 0 replies; only message in thread
From: sys_stv @ 2019-10-21  8:10 UTC (permalink / raw)
  To: test-report

[-- Attachment #1: Type: text/plain, Size: 32098 bytes --]

Test-Label: Intel-compilation
Test-Status: FAILURE
http://dpdk.org/patch/61531

_Compilation issues_

Submitter: Andy Pei <andy.pei@intel.com>
Date: 2019-10-21 06:56:52
Reply_mail: 1571641024-114601-8-git-send-email-andy.pei@intel.com
DPDK git baseline: Repo:dpdk-next-net-intel, CommitID: 1a2742759d547d630d3a134ec0feee45f5455ca1

Makefile build Summary: 22 Builds Done, 22 Successful, 0 Failures

Meson build Summary: 7 Builds Done, 2 Successful, 5 Failures

               +==============================================+===========+==========+
               |                   Makefile                   |   Meson   | Document |
+--------------+------+-------+------+------------+-----------+-----------+----------+
| os           | gcc  | clang | icc  | gcc+shared | gcc+debug | gcc/clang | pdf/html |
+--------------+------+-------+------+------------+-----------+-----------+----------+
| RHEL76-64    | pass |       |      |            |           |           |          |
| CENTOS76-64  | pass | pass  | pass | pass       | pass      |           |          |
| UB1804-64    | pass | pass  | pass |            |           | FAIL      | pass     |
| UB1604-32    | pass |       |      |            |           | FAIL      |          |
| UB1904-64    | pass |       |      |            |           |           |          |
| UB1604-64    | pass | pass  |      |            |           |           |          |
| FC30-64      | pass | pass  |      |            |           | FAIL      |          |
| WIN10-64     |      |       |      |            |           | pass      |          |
| FreeBSD12-64 | pass | pass  |      | pass       | pass      | FAIL      |          |
| RHEL80-64    | pass |       |      |            |           |           |          |
| SUSE15-64    | pass | pass  |      |            |           | FAIL      |          |
+--------------+------+-------+------+------------+-----------+-----------+----------+

Test environment and configuration as below:

** Makefile build **


OS: RHEL76-64
	Kernel Version: 3.10.0-957.el7.x86_64
	CPU info: Intel(R) Xeon(R) CPU E5-2699 v4 @ 2.20GHz
	GCC Version: gcc (GCC) 4.8.5 20150623 (Red Hat 4.8.5-36)
	Clang Version: NA
	x86_64-native-linuxapp-gcc


OS: CENTOS76-64
	Kernel Version: 3.10.0-957.27.2.el7.x86_64
	CPU info: Intel(R) Xeon(R) CPU E5-2699 v4 @ 2.20GHz
	GCC Version: gcc (GCC) 4.8.5 20150623 (Red Hat 4.8.5-36)
	Clang Version: 3.4.2 (tags/RELEASE_34/dot2-final)
	x86_64-native-linuxapp-clang
	x86_64-native-linuxapp-gcc+debug
	x86_64-native-linuxapp-gcc
	x86_64-native-linuxapp-gcc+shared
	x86_64-native-linuxapp-icc


OS: UB1804-64
	Kernel Version: 4.15.0-20-generic
	CPU info: Intel(R) Xeon(R) CPU E5-2699 v3 @ 2.30GHz
	GCC Version: gcc (Ubuntu 7.3.0-16ubuntu3) 7.3.0
	Clang Version: 6.0.0-1ubuntu2 (tags/RELEASE_600/final)
	x86_64-native-linuxapp-clang
	x86_64-native-linuxapp-icc
	x86_64-native-linuxapp-gcc


OS: UB1904-64
	Kernel Version: 5.0.0-13-generic
	CPU info: Intel(R) Xeon(R) CPU E5-2699 v3 @ 2.30GHz
	GCC Version: gcc (Ubuntu 8.3.0-6ubuntu1) 8.3.0
	Clang Version: 8.0.0-3 (tags/RELEASE_800/final)
	x86_64-native-linuxapp-gcc


OS: UB1604-32
	Kernel Version: 4.4.0-131-generic
	CPU info: Intel(R) Xeon(R) CPU E5-2699 v3 @ 2.30GHz
	GCC Version: gcc (Ubuntu 5.4.0-6ubuntu1~16.04.11) 5.4.0 20160609
	Clang Version: 3.8.0-2ubuntu4 (tags/RELEASE_380/final)
	i686-native-linuxapp-gcc


OS: UB1604-64
	Kernel Version: 4.4.0-47-generic
	CPU info: Intel(R) Xeon(R) CPU E5-2699 v3 @ 2.30GHz
	GCC Version: gcc (Ubuntu 5.4.0-6ubuntu1~16.04.10) 5.4.0 20160609
	Clang Version: 3.8.0-2ubuntu4 (tags/RELEASE_380/final)
	x86_64-native-linuxapp-clang
	x86_64-native-linuxapp-gcc


OS: FC30-64
	Kernel Version: 5.1.7-300.fc30.x86_64
	CPU info: Intel(R) Xeon(R) CPU E5-2699 v4 @ 2.20GHz
	GCC Version: gcc (GCC) 9.1.1 20190503 (Red Hat 9.1.1-1)
	Clang Version: 8.0.0 (Fedora 8.0.0-1.fc30)
	x86_64-native-linuxapp-gcc
	x86_64-native-linuxapp-clang


OS: FreeBSD12-64
	Kernel Version: 12.0-RC3
	CPU info: Intel(R) Xeon(R) CPU E5-2699 v4 @ 2.20GHz (2194.98-MHz K8-class CPU)
	GCC Version: gcc (FreeBSD Ports Collection) 7.3.0
	Clang Version: 6.0.1 (tags/RELEASE_601/final 335540) (based on LLVM 6.0.1)
	x86_64-native-bsdapp-clang
	x86_64-native-bsdapp-gcc
	x86_64-native-bsdapp-gcc+shared
	x86_64-native-bsdapp-gcc+debug


OS: RHEL80-64
	Kernel Version: 4.18.0-80.el8.x86_64
	CPU info: Intel(R) Xeon(R) CPU E5-2699 v4 @ 2.20GHz
	GCC Version: gcc (GCC) 8.2.1 20180905 (Red Hat 8.2.1-3)
	Clang Version: 6.0.1 (tags/RELEASE_601/final)
	x86_64-native-linuxapp-gcc


OS: SUSE15-64
	Kernel Version: 4.12.14-lp150.11-default
	CPU info: Intel(R) Xeon(R) CPU E5-2699 v4 @ 2.20GHz
	GCC Version: gcc (SUSE Linux) 7.3.1 20180323 [gcc-7-branch revision 258812]
	Clang Version: 5.0.1 (tags/RELEASE_501/final 312548)
	x86_64-native-linuxapp-gcc
	x86_64-native-linuxapp-clang


** Meson build **


OS: UB1804-64
	Kernel Version: 4.15.0-20-generic
	CPU info: Intel(R) Xeon(R) CPU E5-2699 v4 @ 2.20GHz
	GCC Version: gcc (Ubuntu 7.3.0-27ubuntu1~18.04) 7.3.0
	Clang Version: 6.0.0-1ubuntu2 (tags/RELEASE_600/final)
	build-gcc-static
	build-gcc-shared
	build-clang-static
	build-clang-shared
	build-x86-default
	x86_64-native-linuxapp-doc


OS: UB1604-32
	Kernel Version: 4.4.0-131-generic
	CPU info: Intel(R) Xeon(R) CPU E5-2699 v4 @ 2.20GHz
	GCC Version: gcc (Ubuntu 5.4.0-6ubuntu1~16.04.11) 5.4.0 20160609
	Clang Version: 3.8.0-2ubuntu4 (tags/RELEASE_380/final)
	build-gcc-static
	build-gcc-shared
	build-clang-static
	build-clang-shared
	build-x86-default


OS: FC30-64
	Kernel Version: 5.0.9-301.fc30.x86_64
	CPU info: Intel(R) Xeon(R) CPU E5-2699 v4 @ 2.20GHz
	GCC Version: gcc (GCC) 9.1.1 20190503 (Red Hat 9.1.1-1)
	Clang Version: 8.0.0 (Fedora 8.0.0-1.fc30)
	build-gcc-static
	build-gcc-shared
	build-clang-static
	build-clang-shared
	build-x86-default


OS: WIN10-64
	Kernel Version: N/A
	CPU info: N/A
	GCC Version: N/A
	Clang Version: Clang 8.0.0
	x86_64-windows-clang


OS: FreeBSD12-64
	Kernel Version: 12.0-RC3
	CPU info: Intel(R) Xeon(R) CPU E5-2699 v4 @ 2.20GHz (2194.97-MHz K8-class CPU)
	GCC Version: gcc (FreeBSD Ports Collection) 7.3.0
	Clang Version: 6.0.1 (tags/RELEASE_601/final 335540) (based on LLVM 6.0.1)
	build-gcc-static
	build-gcc-shared
	build-clang-static
	build-clang-shared
	build-x86-default


OS: SUSE15-64
	Kernel Version: 4.12.14-lp150.11-default
	CPU info: Intel(R) Xeon(R) CPU E5-2699 v4 @ 2.20GHz
	GCC Version: gcc (SUSE Linux) 7.3.1 20180323 [gcc-7-branch revision 258812]
	Clang Version: 5.0.1 (tags/RELEASE_501/final 312548)
	build-gcc-static
	build-gcc-shared
	build-clang-static
	build-clang-shared
	build-x86-default


*Meson Build Failed #1:
OS: FC30-64
Target:build-gcc-static
Compiler for C supports arguments -Wno-unused-variable -Wunused-variable: YES
Compiler for C supports arguments -Wno-unused-parameter -Wunused-parameter: YES
Message: drivers/net/ice: Defining dependency "pmd_ice"
Message: drivers/net/ifc: Defining dependency "pmd_ifc"

drivers/meson.build:86:5: ERROR: Problem encountered: Missing dependency rawdev_ifpga for driver rte_pmd_ipn3ke

A full log can be found at /tmp/FC30-64_K4.20_GCC9.1.1/x86_64-native-linuxapp-gcc/2e864ff867324b33bca6584d379b76dd/dpdk/build-gcc-static/meson-logs/meson-log.txt
ninja -C build-gcc-static
ninja: Entering directory `build-gcc-static'
ninja: error: loading 'build.ninja': No such file or directory
--
Compiler for C supports arguments -Wno-unused-variable -Wunused-variable: YES
Compiler for C supports arguments -Wno-unused-parameter -Wunused-parameter: YES
Message: drivers/net/ice: Defining dependency "pmd_ice"
Message: drivers/net/ifc: Defining dependency "pmd_ifc"

drivers/meson.build:86:5: ERROR: Problem encountered: Missing dependency rawdev_ifpga for driver rte_pmd_ipn3ke

A full log can be found at /tmp/FC30-64_K4.20_GCC9.1.1/x86_64-native-linuxapp-gcc/2e864ff867324b33bca6584d379b76dd/dpdk/build-gcc-shared/meson-logs/meson-log.txt
ninja -C build-gcc-shared
ninja: Entering directory `build-gcc-shared'
ninja: error: loading 'build.ninja': No such file or directory
--
Compiler for C supports arguments -Wno-unused-variable: YES
Compiler for C supports arguments -Wno-unused-parameter: YES
Message: drivers/net/ice: Defining dependency "pmd_ice"
Message: drivers/net/ifc: Defining dependency "pmd_ifc"

drivers/meson.build:86:5: ERROR: Problem encountered: Missing dependency rawdev_ifpga for driver rte_pmd_ipn3ke

A full log can be found at /tmp/FC30-64_K4.20_GCC9.1.1/x86_64-native-linuxapp-gcc/2e864ff867324b33bca6584d379b76dd/dpdk/build-clang-static/meson-logs/meson-log.txt
ninja -C build-clang-static
ninja: Entering directory `build-clang-static'
ninja: error: loading 'build.ninja': No such file or directory
--
Compiler for C supports arguments -Wno-unused-variable: YES
Compiler for C supports arguments -Wno-unused-parameter: YES
Message: drivers/net/ice: Defining dependency "pmd_ice"
Message: drivers/net/ifc: Defining dependency "pmd_ifc"

drivers/meson.build:86:5: ERROR: Problem encountered: Missing dependency rawdev_ifpga for driver rte_pmd_ipn3ke

A full log can be found at /tmp/FC30-64_K4.20_GCC9.1.1/x86_64-native-linuxapp-gcc/2e864ff867324b33bca6584d379b76dd/dpdk/build-clang-shared/meson-logs/meson-log.txt
ninja -C build-clang-shared
ninja: Entering directory `build-clang-shared'
ninja: error: loading 'build.ninja': No such file or directory
--
Compiler for C supports arguments -Wno-unused-parameter -Wunused-parameter: YES
Compiler for C supports arguments -mavx2: YES
Message: drivers/net/ice: Defining dependency "pmd_ice"
Message: drivers/net/ifc: Defining dependency "pmd_ifc"

drivers/meson.build:86:5: ERROR: Problem encountered: Missing dependency rawdev_ifpga for driver rte_pmd_ipn3ke

A full log can be found at /tmp/FC30-64_K4.20_GCC9.1.1/x86_64-native-linuxapp-gcc/2e864ff867324b33bca6584d379b76dd/dpdk/build-x86-default/meson-logs/meson-log.txt
ninja -C build-x86-default
ninja: Entering directory `build-x86-default'
ninja: error: loading 'build.ninja': No such file or directory
--
ninja: error: loading 'build.ninja': No such file or directory
find: ‘/tmp/FC30-64_K4.20_GCC9.1.1/x86_64-native-linuxapp-gcc/2e864ff867324b33bca6584d379b76dd/dpdk/build-x86-default/install-root’: No such file or directory
dirname: missing operand
Try 'dirname --help' for more information.
## Building cmdline
gmake: *** /tmp/FC30-64_K4.20_GCC9.1.1/x86_64-native-linuxapp-gcc/2e864ff867324b33bca6584d379b76dd/dpdk/build-x86-default/install-root/usr/local/share/dpdk/examples/cmdline: No such file or directory.  Stop.
## Building helloworld
gmake: *** /tmp/FC30-64_K4.20_GCC9.1.1/x86_64-native-linuxapp-gcc/2e864ff867324b33bca6584d379b76dd/dpdk/build-x86-default/install-root/usr/local/share/dpdk/examples/helloworld: No such file or directory.  Stop.
## Building l2fwd
gmake: *** /tmp/FC30-64_K4.20_GCC9.1.1/x86_64-native-linuxapp-gcc/2e864ff867324b33bca6584d379b76dd/dpdk/build-x86-default/install-root/usr/local/share/dpdk/examples/l2fwd: No such file or directory.  Stop.
## Building l3fwd
gmake: *** /tmp/FC30-64_K4.20_GCC9.1.1/x86_64-native-linuxapp-gcc/2e864ff867324b33bca6584d379b76dd/dpdk/build-x86-default/install-root/usr/local/share/dpdk/examples/l3fwd: No such file or directory.  Stop.
## Building skeleton
gmake: *** /tmp/FC30-64_K4.20_GCC9.1.1/x86_64-native-linuxapp-gcc/2e864ff867324b33bca6584d379b76dd/dpdk/build-x86-default/install-root/usr/local/share/dpdk/examples/skeleton: No such file or directory.  Stop.
## Building timer
gmake: *** /tmp/FC30-64_K4.20_GCC9.1.1/x86_64-native-linuxapp-gcc/2e864ff867324b33bca6584d379b76dd/dpdk/build-x86-default/install-root/usr/local/share/dpdk/examples/timer: No such file or directory.  Stop.


*Meson Build Failed #2:
OS: SUSE15-64
Target:build-gcc-static
Compiler for C supports arguments -Wno-unused-variable -Wunused-variable: YES
Compiler for C supports arguments -Wno-unused-parameter -Wunused-parameter: YES
Message: drivers/net/ice: Defining dependency "pmd_ice"
Message: drivers/net/ifc: Defining dependency "pmd_ifc"

drivers/meson.build:86:5: ERROR: Problem encountered: Missing dependency rawdev_ifpga for driver rte_pmd_ipn3ke

A full log can be found at /tmp/SUSE15-64_K4.12.14_GCC7.3.1/x86_64-native-linuxapp-gcc/2e864ff867324b33bca6584d379b76dd/dpdk/build-gcc-static/meson-logs/meson-log.txt
ninja -C build-gcc-static
ninja: Entering directory `build-gcc-static'
ninja: error: loading 'build.ninja': No such file or directory
--
Compiler for C supports arguments -Wno-unused-variable -Wunused-variable: YES
Compiler for C supports arguments -Wno-unused-parameter -Wunused-parameter: YES
Message: drivers/net/ice: Defining dependency "pmd_ice"
Message: drivers/net/ifc: Defining dependency "pmd_ifc"

drivers/meson.build:86:5: ERROR: Problem encountered: Missing dependency rawdev_ifpga for driver rte_pmd_ipn3ke

A full log can be found at /tmp/SUSE15-64_K4.12.14_GCC7.3.1/x86_64-native-linuxapp-gcc/2e864ff867324b33bca6584d379b76dd/dpdk/build-gcc-shared/meson-logs/meson-log.txt
ninja -C build-gcc-shared
ninja: Entering directory `build-gcc-shared'
ninja: error: loading 'build.ninja': No such file or directory
--
Compiler for C supports arguments -Wno-unused-variable: YES
Compiler for C supports arguments -Wno-unused-parameter: YES
Message: drivers/net/ice: Defining dependency "pmd_ice"
Message: drivers/net/ifc: Defining dependency "pmd_ifc"

drivers/meson.build:86:5: ERROR: Problem encountered: Missing dependency rawdev_ifpga for driver rte_pmd_ipn3ke

A full log can be found at /tmp/SUSE15-64_K4.12.14_GCC7.3.1/x86_64-native-linuxapp-gcc/2e864ff867324b33bca6584d379b76dd/dpdk/build-clang-static/meson-logs/meson-log.txt
ninja -C build-clang-static
ninja: Entering directory `build-clang-static'
ninja: error: loading 'build.ninja': No such file or directory
--
Compiler for C supports arguments -Wno-unused-variable: YES
Compiler for C supports arguments -Wno-unused-parameter: YES
Message: drivers/net/ice: Defining dependency "pmd_ice"
Message: drivers/net/ifc: Defining dependency "pmd_ifc"

drivers/meson.build:86:5: ERROR: Problem encountered: Missing dependency rawdev_ifpga for driver rte_pmd_ipn3ke

A full log can be found at /tmp/SUSE15-64_K4.12.14_GCC7.3.1/x86_64-native-linuxapp-gcc/2e864ff867324b33bca6584d379b76dd/dpdk/build-clang-shared/meson-logs/meson-log.txt
ninja -C build-clang-shared
ninja: Entering directory `build-clang-shared'
ninja: error: loading 'build.ninja': No such file or directory
--
Compiler for C supports arguments -Wno-unused-parameter -Wunused-parameter: YES
Compiler for C supports arguments -mavx2: YES
Message: drivers/net/ice: Defining dependency "pmd_ice"
Message: drivers/net/ifc: Defining dependency "pmd_ifc"

drivers/meson.build:86:5: ERROR: Problem encountered: Missing dependency rawdev_ifpga for driver rte_pmd_ipn3ke

A full log can be found at /tmp/SUSE15-64_K4.12.14_GCC7.3.1/x86_64-native-linuxapp-gcc/2e864ff867324b33bca6584d379b76dd/dpdk/build-x86-default/meson-logs/meson-log.txt
ninja -C build-x86-default
ninja: Entering directory `build-x86-default'
ninja: error: loading 'build.ninja': No such file or directory
--
ninja: error: loading 'build.ninja': No such file or directory
find: ‘/tmp/SUSE15-64_K4.12.14_GCC7.3.1/x86_64-native-linuxapp-gcc/2e864ff867324b33bca6584d379b76dd/dpdk/build-x86-default/install-root’: No such file or directory
dirname: missing operand
Try 'dirname --help' for more information.
## Building cmdline
gmake: *** /tmp/SUSE15-64_K4.12.14_GCC7.3.1/x86_64-native-linuxapp-gcc/2e864ff867324b33bca6584d379b76dd/dpdk/build-x86-default/install-root/usr/local/share/dpdk/examples/cmdline: No such file or directory.  Stop.
## Building helloworld
gmake: *** /tmp/SUSE15-64_K4.12.14_GCC7.3.1/x86_64-native-linuxapp-gcc/2e864ff867324b33bca6584d379b76dd/dpdk/build-x86-default/install-root/usr/local/share/dpdk/examples/helloworld: No such file or directory.  Stop.
## Building l2fwd
gmake: *** /tmp/SUSE15-64_K4.12.14_GCC7.3.1/x86_64-native-linuxapp-gcc/2e864ff867324b33bca6584d379b76dd/dpdk/build-x86-default/install-root/usr/local/share/dpdk/examples/l2fwd: No such file or directory.  Stop.
## Building l3fwd
gmake: *** /tmp/SUSE15-64_K4.12.14_GCC7.3.1/x86_64-native-linuxapp-gcc/2e864ff867324b33bca6584d379b76dd/dpdk/build-x86-default/install-root/usr/local/share/dpdk/examples/l3fwd: No such file or directory.  Stop.
## Building skeleton
gmake: *** /tmp/SUSE15-64_K4.12.14_GCC7.3.1/x86_64-native-linuxapp-gcc/2e864ff867324b33bca6584d379b76dd/dpdk/build-x86-default/install-root/usr/local/share/dpdk/examples/skeleton: No such file or directory.  Stop.
## Building timer
gmake: *** /tmp/SUSE15-64_K4.12.14_GCC7.3.1/x86_64-native-linuxapp-gcc/2e864ff867324b33bca6584d379b76dd/dpdk/build-x86-default/install-root/usr/local/share/dpdk/examples/timer: No such file or directory.  Stop.


*Meson Build Failed #3:
OS: UB1604-32
Target:build-gcc-static
Compiler for C supports arguments -Wno-unused-variable -Wunused-variable: YES
Compiler for C supports arguments -Wno-unused-parameter -Wunused-parameter: YES
Message: drivers/net/ice: Defining dependency "pmd_ice"
Message: drivers/net/ifc: Defining dependency "pmd_ifc"

drivers/meson.build:86:5: ERROR: Problem encountered: Missing dependency rawdev_ifpga for driver rte_pmd_ipn3ke

A full log can be found at /tmp/UB1604-32_K4.4.0_GCC5.4.0/i686-native-linuxapp-gcc/2e864ff867324b33bca6584d379b76dd/dpdk/build-gcc-static/meson-logs/meson-log.txt
ninja -C build-gcc-static
ninja: Entering directory `build-gcc-static'
ninja: error: loading 'build.ninja': No such file or directory
--
Compiler for C supports arguments -Wno-unused-variable -Wunused-variable: YES
Compiler for C supports arguments -Wno-unused-parameter -Wunused-parameter: YES
Message: drivers/net/ice: Defining dependency "pmd_ice"
Message: drivers/net/ifc: Defining dependency "pmd_ifc"

drivers/meson.build:86:5: ERROR: Problem encountered: Missing dependency rawdev_ifpga for driver rte_pmd_ipn3ke

A full log can be found at /tmp/UB1604-32_K4.4.0_GCC5.4.0/i686-native-linuxapp-gcc/2e864ff867324b33bca6584d379b76dd/dpdk/build-gcc-shared/meson-logs/meson-log.txt
ninja -C build-gcc-shared
ninja: Entering directory `build-gcc-shared'
ninja: error: loading 'build.ninja': No such file or directory
--
Compiler for C supports arguments -Wno-unused-variable: YES
Compiler for C supports arguments -Wno-unused-parameter: YES
Message: drivers/net/ice: Defining dependency "pmd_ice"
Message: drivers/net/ifc: Defining dependency "pmd_ifc"

drivers/meson.build:86:5: ERROR: Problem encountered: Missing dependency rawdev_ifpga for driver rte_pmd_ipn3ke

A full log can be found at /tmp/UB1604-32_K4.4.0_GCC5.4.0/i686-native-linuxapp-gcc/2e864ff867324b33bca6584d379b76dd/dpdk/build-clang-static/meson-logs/meson-log.txt
ninja -C build-clang-static
ninja: Entering directory `build-clang-static'
ninja: error: loading 'build.ninja': No such file or directory
--
Compiler for C supports arguments -Wno-unused-variable: YES
Compiler for C supports arguments -Wno-unused-parameter: YES
Message: drivers/net/ice: Defining dependency "pmd_ice"
Message: drivers/net/ifc: Defining dependency "pmd_ifc"

drivers/meson.build:86:5: ERROR: Problem encountered: Missing dependency rawdev_ifpga for driver rte_pmd_ipn3ke

A full log can be found at /tmp/UB1604-32_K4.4.0_GCC5.4.0/i686-native-linuxapp-gcc/2e864ff867324b33bca6584d379b76dd/dpdk/build-clang-shared/meson-logs/meson-log.txt
ninja -C build-clang-shared
ninja: Entering directory `build-clang-shared'
ninja: error: loading 'build.ninja': No such file or directory
--
Compiler for C supports arguments -Wno-unused-parameter -Wunused-parameter: YES
Compiler for C supports arguments -mavx2: YES
Message: drivers/net/ice: Defining dependency "pmd_ice"
Message: drivers/net/ifc: Defining dependency "pmd_ifc"

drivers/meson.build:86:5: ERROR: Problem encountered: Missing dependency rawdev_ifpga for driver rte_pmd_ipn3ke

A full log can be found at /tmp/UB1604-32_K4.4.0_GCC5.4.0/i686-native-linuxapp-gcc/2e864ff867324b33bca6584d379b76dd/dpdk/build-x86-default/meson-logs/meson-log.txt
ninja -C build-x86-default
ninja: Entering directory `build-x86-default'
ninja: error: loading 'build.ninja': No such file or directory
--
ninja: error: loading 'build.ninja': No such file or directory
find: ‘/tmp/UB1604-32_K4.4.0_GCC5.4.0/i686-native-linuxapp-gcc/2e864ff867324b33bca6584d379b76dd/dpdk/build-x86-default/install-root’: No such file or directory
dirname: missing operand
Try 'dirname --help' for more information.
## Building cmdline
make: *** /tmp/UB1604-32_K4.4.0_GCC5.4.0/i686-native-linuxapp-gcc/2e864ff867324b33bca6584d379b76dd/dpdk/build-x86-default/install-root/usr/local/share/dpdk/examples/cmdline: No such file or directory.  Stop.
## Building helloworld
make: *** /tmp/UB1604-32_K4.4.0_GCC5.4.0/i686-native-linuxapp-gcc/2e864ff867324b33bca6584d379b76dd/dpdk/build-x86-default/install-root/usr/local/share/dpdk/examples/helloworld: No such file or directory.  Stop.
## Building l2fwd
make: *** /tmp/UB1604-32_K4.4.0_GCC5.4.0/i686-native-linuxapp-gcc/2e864ff867324b33bca6584d379b76dd/dpdk/build-x86-default/install-root/usr/local/share/dpdk/examples/l2fwd: No such file or directory.  Stop.
## Building l3fwd
make: *** /tmp/UB1604-32_K4.4.0_GCC5.4.0/i686-native-linuxapp-gcc/2e864ff867324b33bca6584d379b76dd/dpdk/build-x86-default/install-root/usr/local/share/dpdk/examples/l3fwd: No such file or directory.  Stop.
## Building skeleton
make: *** /tmp/UB1604-32_K4.4.0_GCC5.4.0/i686-native-linuxapp-gcc/2e864ff867324b33bca6584d379b76dd/dpdk/build-x86-default/install-root/usr/local/share/dpdk/examples/skeleton: No such file or directory.  Stop.
## Building timer
make: *** /tmp/UB1604-32_K4.4.0_GCC5.4.0/i686-native-linuxapp-gcc/2e864ff867324b33bca6584d379b76dd/dpdk/build-x86-default/install-root/usr/local/share/dpdk/examples/timer: No such file or directory.  Stop.


*Meson Build Failed #4:
OS: UB1804-64
Target:build-gcc-static
Compiler for C supports arguments -Wno-unused-variable -Wunused-variable: YES
Compiler for C supports arguments -Wno-unused-parameter -Wunused-parameter: YES
Message: drivers/net/ice: Defining dependency "pmd_ice"
Message: drivers/net/ifc: Defining dependency "pmd_ifc"

drivers/meson.build:86:5: ERROR: Problem encountered: Missing dependency rawdev_ifpga for driver rte_pmd_ipn3ke

A full log can be found at /tmp/UB1804-64_K4.15.0_GCC7.3.0/x86_64-native-linuxapp-gcc/2e864ff867324b33bca6584d379b76dd/dpdk/build-gcc-static/meson-logs/meson-log.txt
ninja -C build-gcc-static
ninja: Entering directory `build-gcc-static'
ninja: error: loading 'build.ninja': No such file or directory
--
Compiler for C supports arguments -Wno-unused-variable -Wunused-variable: YES
Compiler for C supports arguments -Wno-unused-parameter -Wunused-parameter: YES
Message: drivers/net/ice: Defining dependency "pmd_ice"
Message: drivers/net/ifc: Defining dependency "pmd_ifc"

drivers/meson.build:86:5: ERROR: Problem encountered: Missing dependency rawdev_ifpga for driver rte_pmd_ipn3ke

A full log can be found at /tmp/UB1804-64_K4.15.0_GCC7.3.0/x86_64-native-linuxapp-gcc/2e864ff867324b33bca6584d379b76dd/dpdk/build-gcc-shared/meson-logs/meson-log.txt
ninja -C build-gcc-shared
ninja: Entering directory `build-gcc-shared'
ninja: error: loading 'build.ninja': No such file or directory
--
Compiler for C supports arguments -Wno-unused-variable: YES
Compiler for C supports arguments -Wno-unused-parameter: YES
Message: drivers/net/ice: Defining dependency "pmd_ice"
Message: drivers/net/ifc: Defining dependency "pmd_ifc"

drivers/meson.build:86:5: ERROR: Problem encountered: Missing dependency rawdev_ifpga for driver rte_pmd_ipn3ke

A full log can be found at /tmp/UB1804-64_K4.15.0_GCC7.3.0/x86_64-native-linuxapp-gcc/2e864ff867324b33bca6584d379b76dd/dpdk/build-clang-static/meson-logs/meson-log.txt
ninja -C build-clang-static
ninja: Entering directory `build-clang-static'
ninja: error: loading 'build.ninja': No such file or directory
--
Compiler for C supports arguments -Wno-unused-variable: YES
Compiler for C supports arguments -Wno-unused-parameter: YES
Message: drivers/net/ice: Defining dependency "pmd_ice"
Message: drivers/net/ifc: Defining dependency "pmd_ifc"

drivers/meson.build:86:5: ERROR: Problem encountered: Missing dependency rawdev_ifpga for driver rte_pmd_ipn3ke

A full log can be found at /tmp/UB1804-64_K4.15.0_GCC7.3.0/x86_64-native-linuxapp-gcc/2e864ff867324b33bca6584d379b76dd/dpdk/build-clang-shared/meson-logs/meson-log.txt
ninja -C build-clang-shared
ninja: Entering directory `build-clang-shared'
ninja: error: loading 'build.ninja': No such file or directory
--
Compiler for C supports arguments -Wno-unused-parameter -Wunused-parameter: YES
Compiler for C supports arguments -mavx2: YES
Message: drivers/net/ice: Defining dependency "pmd_ice"
Message: drivers/net/ifc: Defining dependency "pmd_ifc"

drivers/meson.build:86:5: ERROR: Problem encountered: Missing dependency rawdev_ifpga for driver rte_pmd_ipn3ke

A full log can be found at /tmp/UB1804-64_K4.15.0_GCC7.3.0/x86_64-native-linuxapp-gcc/2e864ff867324b33bca6584d379b76dd/dpdk/build-x86-default/meson-logs/meson-log.txt
ninja -C build-x86-default
ninja: Entering directory `build-x86-default'
ninja: error: loading 'build.ninja': No such file or directory
--
ninja: error: loading 'build.ninja': No such file or directory
find: ‘/tmp/UB1804-64_K4.15.0_GCC7.3.0/x86_64-native-linuxapp-gcc/2e864ff867324b33bca6584d379b76dd/dpdk/build-x86-default/install-root’: No such file or directory
dirname: missing operand
Try 'dirname --help' for more information.
## Building cmdline
make: *** /tmp/UB1804-64_K4.15.0_GCC7.3.0/x86_64-native-linuxapp-gcc/2e864ff867324b33bca6584d379b76dd/dpdk/build-x86-default/install-root/usr/local/share/dpdk/examples/cmdline: No such file or directory.  Stop.
## Building helloworld
make: *** /tmp/UB1804-64_K4.15.0_GCC7.3.0/x86_64-native-linuxapp-gcc/2e864ff867324b33bca6584d379b76dd/dpdk/build-x86-default/install-root/usr/local/share/dpdk/examples/helloworld: No such file or directory.  Stop.
## Building l2fwd
make: *** /tmp/UB1804-64_K4.15.0_GCC7.3.0/x86_64-native-linuxapp-gcc/2e864ff867324b33bca6584d379b76dd/dpdk/build-x86-default/install-root/usr/local/share/dpdk/examples/l2fwd: No such file or directory.  Stop.
## Building l3fwd
make: *** /tmp/UB1804-64_K4.15.0_GCC7.3.0/x86_64-native-linuxapp-gcc/2e864ff867324b33bca6584d379b76dd/dpdk/build-x86-default/install-root/usr/local/share/dpdk/examples/l3fwd: No such file or directory.  Stop.
## Building skeleton
make: *** /tmp/UB1804-64_K4.15.0_GCC7.3.0/x86_64-native-linuxapp-gcc/2e864ff867324b33bca6584d379b76dd/dpdk/build-x86-default/install-root/usr/local/share/dpdk/examples/skeleton: No such file or directory.  Stop.
## Building timer
make: *** /tmp/UB1804-64_K4.15.0_GCC7.3.0/x86_64-native-linuxapp-gcc/2e864ff867324b33bca6584d379b76dd/dpdk/build-x86-default/install-root/usr/local/share/dpdk/examples/timer: No such file or directory.  Stop.


*Meson Build Failed #5:
OS: FreeBSD12-64
Target:build-gcc-static
Compiler for C supports arguments -Wno-unused-but-set-variable -Wunused-but-set-variable: YES
Compiler for C supports arguments -Wno-unused-variable -Wunused-variable: YES
Compiler for C supports arguments -Wno-unused-parameter -Wunused-parameter: YES
Message: drivers/net/ice: Defining dependency "pmd_ice"

drivers/meson.build:86:5: ERROR: Problem encountered: Missing dependency rawdev_ifpga for driver rte_pmd_ipn3ke

A full log can be found at /tmp/FreeBSD12-64_K19.02_GCC7.3.0/x86_64-native-bsdapp-gcc/2e864ff867324b33bca6584d379b76dd/dpdk/build-gcc-static/meson-logs/meson-log.txt
ninja -C build-gcc-static
ninja: Entering directory `build-gcc-static'
ninja: error: loading 'build.ninja': No such file or directory
--
Compiler for C supports arguments -Wno-unused-but-set-variable -Wunused-but-set-variable: YES
Compiler for C supports arguments -Wno-unused-variable -Wunused-variable: YES
Compiler for C supports arguments -Wno-unused-parameter -Wunused-parameter: YES
Message: drivers/net/ice: Defining dependency "pmd_ice"

drivers/meson.build:86:5: ERROR: Problem encountered: Missing dependency rawdev_ifpga for driver rte_pmd_ipn3ke

A full log can be found at /tmp/FreeBSD12-64_K19.02_GCC7.3.0/x86_64-native-bsdapp-gcc/2e864ff867324b33bca6584d379b76dd/dpdk/build-gcc-shared/meson-logs/meson-log.txt
ninja -C build-gcc-shared
ninja: Entering directory `build-gcc-shared'
ninja: error: loading 'build.ninja': No such file or directory
--
Compiler for C supports arguments -Wno-unused-but-set-variable: NO
Compiler for C supports arguments -Wno-unused-variable: YES
Compiler for C supports arguments -Wno-unused-parameter: YES
Message: drivers/net/ice: Defining dependency "pmd_ice"

drivers/meson.build:86:5: ERROR: Problem encountered: Missing dependency rawdev_ifpga for driver rte_pmd_ipn3ke

A full log can be found at /tmp/FreeBSD12-64_K19.02_GCC7.3.0/x86_64-native-bsdapp-gcc/2e864ff867324b33bca6584d379b76dd/dpdk/build-clang-static/meson-logs/meson-log.txt
ninja -C build-clang-static
ninja: Entering directory `build-clang-static'
ninja: error: loading 'build.ninja': No such file or directory
--
Compiler for C supports arguments -Wno-unused-but-set-variable: NO
Compiler for C supports arguments -Wno-unused-variable: YES
Compiler for C supports arguments -Wno-unused-parameter: YES
Message: drivers/net/ice: Defining dependency "pmd_ice"

drivers/meson.build:86:5: ERROR: Problem encountered: Missing dependency rawdev_ifpga for driver rte_pmd_ipn3ke

A full log can be found at /tmp/FreeBSD12-64_K19.02_GCC7.3.0/x86_64-native-bsdapp-gcc/2e864ff867324b33bca6584d379b76dd/dpdk/build-clang-shared/meson-logs/meson-log.txt
ninja -C build-clang-shared
ninja: Entering directory `build-clang-shared'
ninja: error: loading 'build.ninja': No such file or directory
--
Compiler for C supports arguments -Wno-unused-variable: YES
Compiler for C supports arguments -Wno-unused-parameter: YES
Compiler for C supports arguments -mavx2: YES
Message: drivers/net/ice: Defining dependency "pmd_ice"

drivers/meson.build:86:5: ERROR: Problem encountered: Missing dependency rawdev_ifpga for driver rte_pmd_ipn3ke

A full log can be found at /tmp/FreeBSD12-64_K19.02_GCC7.3.0/x86_64-native-bsdapp-gcc/2e864ff867324b33bca6584d379b76dd/dpdk/build-x86-default/meson-logs/meson-log.txt
ninja -C build-x86-default
ninja: Entering directory `build-x86-default'
ninja: error: loading 'build.ninja': No such file or directory
ninja: Entering directory `build-x86-default'
ninja: error: loading 'build.ninja': No such file or directory
find: /tmp/FreeBSD12-64_K19.02_GCC7.3.0/x86_64-native-bsdapp-gcc/2e864ff867324b33bca6584d379b76dd/dpdk/build-x86-default/install-root: No such file or directory
usage: dirname string [...]
## Building cmdline
gmake: *** /tmp/FreeBSD12-64_K19.02_GCC7.3.0/x86_64-native-bsdapp-gcc/2e864ff867324b33bca6584d379b76dd/dpdk/build-x86-default/install-root/usr/local/share/dpdk/examples/cmdline: No such file or directory.  Stop.
## Building helloworld
gmake: *** /tmp/FreeBSD12-64_K19.02_GCC7.3.0/x86_64-native-bsdapp-gcc/2e864ff867324b33bca6584d379b76dd/dpdk/build-x86-default/install-root/usr/local/share/dpdk/examples/helloworld: No such file or directory.  Stop.
## Building l2fwd
gmake: *** /tmp/FreeBSD12-64_K19.02_GCC7.3.0/x86_64-native-bsdapp-gcc/2e864ff867324b33bca6584d379b76dd/dpdk/build-x86-default/install-root/usr/local/share/dpdk/examples/l2fwd: No such file or directory.  Stop.
## Building l3fwd
gmake: *** /tmp/FreeBSD12-64_K19.02_GCC7.3.0/x86_64-native-bsdapp-gcc/2e864ff867324b33bca6584d379b76dd/dpdk/build-x86-default/install-root/usr/local/share/dpdk/examples/l3fwd: No such file or directory.  Stop.
## Building skeleton
gmake: *** /tmp/FreeBSD12-64_K19.02_GCC7.3.0/x86_64-native-bsdapp-gcc/2e864ff867324b33bca6584d379b76dd/dpdk/build-x86-default/install-root/usr/local/share/dpdk/examples/skeleton: No such file or directory.  Stop.
## Building timer
gmake: *** /tmp/FreeBSD12-64_K19.02_GCC7.3.0/x86_64-native-bsdapp-gcc/2e864ff867324b33bca6584d379b76dd/dpdk/build-x86-default/install-root/usr/local/share/dpdk/examples/timer: No such file or directory.  Stop.

DPDK STV team

^ permalink raw reply	[flat|nested] only message in thread

only message in thread, back to index

Thread overview: (only message) (download: mbox.gz / follow: Atom feed)
-- links below jump to the message on this page --
2019-10-21  8:10 [dpdk-test-report] |FAILURE| pw61531[v11, 07/19] raw/ifpga/base: add sensor support sys_stv

automatic DPDK test reports

Archives are clonable:
	git clone --mirror http://inbox.dpdk.org/test-report/0 test-report/git/0.git

	# If you have public-inbox 1.1+ installed, you may
	# initialize and index your mirror using the following commands:
	public-inbox-init -V2 test-report test-report/ http://inbox.dpdk.org/test-report \
		test-report@dpdk.org
	public-inbox-index test-report


Newsgroup available over NNTP:
	nntp://inbox.dpdk.org/inbox.dpdk.test-report


AGPL code for this site: git clone https://public-inbox.org/ public-inbox