automatic DPDK test reports
 help / color / Atom feed
* [dpdk-test-report]  |FAILURE| pw61561[v11, 3/4] kni: add IOVA=VA support
@ 2019-10-21  8:43 sys_stv
  0 siblings, 0 replies; only message in thread
From: sys_stv @ 2019-10-21  8:43 UTC (permalink / raw)
  To: test-report

[-- Attachment #1: Type: text/plain, Size: 30293 bytes --]

Test-Label: Intel-compilation
Test-Status: FAILURE
http://dpdk.org/patch/61561

_Compilation issues_

Submitter: Vamsi Krishna Attunuru <vattunuru@marvell.com>
Date: 2019-10-21 08:03:23
Reply_mail: 20191021080324.10659-4-vattunuru@marvell.com
DPDK git baseline: Repo:dpdk-next-net, CommitID: 7bef76e5f840b6222c2b6bee6d9a5e54dfe8b167

Makefile build Summary: 22 Builds Done, 14 Successful, 8 Failures

Meson build Summary: 7 Builds Done, 6 Successful, 1 Failures

               +==============================================+===========+==========+
               |                   Makefile                   |   Meson   | Document |
+--------------+------+-------+------+------------+-----------+-----------+----------+
| os           | gcc  | clang | icc  | gcc+shared | gcc+debug | gcc/clang | pdf/html |
+--------------+------+-------+------+------------+-----------+-----------+----------+
| RHEL76-64    | FAIL |       |      |            |           |           |          |
| CENTOS76-64  | FAIL | FAIL  | FAIL | FAIL       | FAIL      |           |          |
| UB1804-64    | pass | pass  | pass |            |           | pass      | pass     |
| UB1604-32    | FAIL |       |      |            |           | FAIL      |          |
| UB1904-64    | pass |       |      |            |           |           |          |
| UB1604-64    | pass | FAIL  |      |            |           |           |          |
| FC30-64      | pass | pass  |      |            |           | pass      |          |
| WIN10-64     |      |       |      |            |           | pass      |          |
| FreeBSD12-64 | pass | pass  |      | pass       | pass      | pass      |          |
| RHEL80-64    | pass |       |      |            |           |           |          |
| SUSE15-64    | pass | pass  |      |            |           | pass      |          |
+--------------+------+-------+------+------------+-----------+-----------+----------+

Test environment and configuration as below:

** Makefile build **


OS: RHEL76-64
	Kernel Version: 3.10.0-957.el7.x86_64
	CPU info: Intel(R) Xeon(R) CPU E5-2699 v4 @ 2.20GHz
	GCC Version: gcc (GCC) 4.8.5 20150623 (Red Hat 4.8.5-36)
	Clang Version: NA
	x86_64-native-linuxapp-gcc


OS: CENTOS76-64
	Kernel Version: 3.10.0-957.27.2.el7.x86_64
	CPU info: Intel(R) Xeon(R) CPU E5-2699 v4 @ 2.20GHz
	GCC Version: gcc (GCC) 4.8.5 20150623 (Red Hat 4.8.5-36)
	Clang Version: 3.4.2 (tags/RELEASE_34/dot2-final)
	x86_64-native-linuxapp-clang
	x86_64-native-linuxapp-gcc+debug
	x86_64-native-linuxapp-gcc
	x86_64-native-linuxapp-gcc+shared
	x86_64-native-linuxapp-icc


OS: UB1804-64
	Kernel Version: 4.15.0-20-generic
	CPU info: Intel(R) Xeon(R) CPU E5-2699 v3 @ 2.30GHz
	GCC Version: gcc (Ubuntu 7.3.0-16ubuntu3) 7.3.0
	Clang Version: 6.0.0-1ubuntu2 (tags/RELEASE_600/final)
	x86_64-native-linuxapp-clang
	x86_64-native-linuxapp-icc
	x86_64-native-linuxapp-gcc


OS: UB1904-64
	Kernel Version: 5.0.0-13-generic
	CPU info: Intel(R) Xeon(R) CPU E5-2699 v3 @ 2.30GHz
	GCC Version: gcc (Ubuntu 8.3.0-6ubuntu1) 8.3.0
	Clang Version: 8.0.0-3 (tags/RELEASE_800/final)
	x86_64-native-linuxapp-gcc


OS: UB1604-32
	Kernel Version: 4.4.0-131-generic
	CPU info: Intel(R) Xeon(R) CPU E5-2699 v3 @ 2.30GHz
	GCC Version: gcc (Ubuntu 5.4.0-6ubuntu1~16.04.11) 5.4.0 20160609
	Clang Version: 3.8.0-2ubuntu4 (tags/RELEASE_380/final)
	i686-native-linuxapp-gcc


OS: UB1604-64
	Kernel Version: 4.4.0-47-generic
	CPU info: Intel(R) Xeon(R) CPU E5-2699 v3 @ 2.30GHz
	GCC Version: gcc (Ubuntu 5.4.0-6ubuntu1~16.04.10) 5.4.0 20160609
	Clang Version: 3.8.0-2ubuntu4 (tags/RELEASE_380/final)
	x86_64-native-linuxapp-clang
	x86_64-native-linuxapp-gcc


OS: FC30-64
	Kernel Version: 5.1.7-300.fc30.x86_64
	CPU info: Intel(R) Xeon(R) CPU E5-2699 v4 @ 2.20GHz
	GCC Version: gcc (GCC) 9.1.1 20190503 (Red Hat 9.1.1-1)
	Clang Version: 8.0.0 (Fedora 8.0.0-1.fc30)
	x86_64-native-linuxapp-gcc
	x86_64-native-linuxapp-clang


OS: FreeBSD12-64
	Kernel Version: 12.0-RC3
	CPU info: Intel(R) Xeon(R) CPU E5-2699 v4 @ 2.20GHz (2194.98-MHz K8-class CPU)
	GCC Version: gcc (FreeBSD Ports Collection) 7.3.0
	Clang Version: 6.0.1 (tags/RELEASE_601/final 335540) (based on LLVM 6.0.1)
	x86_64-native-bsdapp-clang
	x86_64-native-bsdapp-gcc+shared
	x86_64-native-bsdapp-gcc+debug
	x86_64-native-bsdapp-gcc


OS: RHEL80-64
	Kernel Version: 4.18.0-80.el8.x86_64
	CPU info: Intel(R) Xeon(R) CPU E5-2699 v4 @ 2.20GHz
	GCC Version: gcc (GCC) 8.2.1 20180905 (Red Hat 8.2.1-3)
	Clang Version: 6.0.1 (tags/RELEASE_601/final)
	x86_64-native-linuxapp-gcc


OS: SUSE15-64
	Kernel Version: 4.12.14-lp150.11-default
	CPU info: Intel(R) Xeon(R) CPU E5-2699 v4 @ 2.20GHz
	GCC Version: gcc (SUSE Linux) 7.3.1 20180323 [gcc-7-branch revision 258812]
	Clang Version: 5.0.1 (tags/RELEASE_501/final 312548)
	x86_64-native-linuxapp-gcc
	x86_64-native-linuxapp-clang


** Meson build **


OS: UB1804-64
	Kernel Version: 4.15.0-20-generic
	CPU info: Intel(R) Xeon(R) CPU E5-2699 v4 @ 2.20GHz
	GCC Version: gcc (Ubuntu 7.3.0-27ubuntu1~18.04) 7.3.0
	Clang Version: 6.0.0-1ubuntu2 (tags/RELEASE_600/final)
	x86_64-native-linuxapp-doc
	build-gcc-static
	build-gcc-shared
	build-clang-static
	build-clang-shared
	build-x86-default


OS: UB1604-32
	Kernel Version: 4.4.0-131-generic
	CPU info: Intel(R) Xeon(R) CPU E5-2699 v4 @ 2.20GHz
	GCC Version: gcc (Ubuntu 5.4.0-6ubuntu1~16.04.11) 5.4.0 20160609
	Clang Version: 3.8.0-2ubuntu4 (tags/RELEASE_380/final)
	build-gcc-static
	build-gcc-shared
	build-clang-static
	build-clang-shared
	build-x86-default


OS: FC30-64
	Kernel Version: 5.0.9-301.fc30.x86_64
	CPU info: Intel(R) Xeon(R) CPU E5-2699 v4 @ 2.20GHz
	GCC Version: gcc (GCC) 9.1.1 20190503 (Red Hat 9.1.1-1)
	Clang Version: 8.0.0 (Fedora 8.0.0-1.fc30)
	build-gcc-static
	build-gcc-shared
	build-clang-static
	build-clang-shared
	build-x86-default


OS: WIN10-64
	Kernel Version: N/A
	CPU info: N/A
	GCC Version: N/A
	Clang Version: Clang 8.0.0
	x86_64-windows-clang


OS: FreeBSD12-64
	Kernel Version: 12.0-RC3
	CPU info: Intel(R) Xeon(R) CPU E5-2699 v4 @ 2.20GHz (2194.97-MHz K8-class CPU)
	GCC Version: gcc (FreeBSD Ports Collection) 7.3.0
	Clang Version: 6.0.1 (tags/RELEASE_601/final 335540) (based on LLVM 6.0.1)
	build-gcc-static
	build-gcc-shared
	build-clang-static
	build-clang-shared
	build-x86-default


OS: SUSE15-64
	Kernel Version: 4.12.14-lp150.11-default
	CPU info: Intel(R) Xeon(R) CPU E5-2699 v4 @ 2.20GHz
	GCC Version: gcc (SUSE Linux) 7.3.1 20180323 [gcc-7-branch revision 258812]
	Clang Version: 5.0.1 (tags/RELEASE_501/final 312548)
	build-gcc-static
	build-gcc-shared
	build-clang-static
	build-clang-shared
	build-x86-default


*Make Build Failed #1:
OS: UB1604-64
Target: x86_64-native-linuxapp-clang
  ret =  get_user_pages_remote(tsk, tsk->mm, iova, 1,
         ^
  MODPOST 1 modules
cc1: all warnings being treated as errors
  CC      /tmp/UB1604-64_K4.4.0_Clang3.8.0/x86_64-native-linuxapp-clang/713f3ad8d2a0498eb0a64fa14495957e/dpdk/x86_64-native-linuxapp-clang/build/kernel/linux/igb_uio/igb_uio.mod.o
/usr/src/linux-headers-4.4.0-47-generic/scripts/Makefile.build:258: recipe for target '/tmp/UB1604-64_K4.4.0_Clang3.8.0/x86_64-native-linuxapp-clang/713f3ad8d2a0498eb0a64fa14495957e/dpdk/x86_64-native-linuxapp-clang/build/kernel/linux/kni/kni_misc.o' failed
make[9]: *** [/tmp/UB1604-64_K4.4.0_Clang3.8.0/x86_64-native-linuxapp-clang/713f3ad8d2a0498eb0a64fa14495957e/dpdk/x86_64-native-linuxapp-clang/build/kernel/linux/kni/kni_misc.o] Error 1
/usr/src/linux-headers-4.4.0-47-generic/Makefile:1418: recipe for target '_module_/tmp/UB1604-64_K4.4.0_Clang3.8.0/x86_64-native-linuxapp-clang/713f3ad8d2a0498eb0a64fa14495957e/dpdk/x86_64-native-linuxapp-clang/build/kernel/linux/kni' failed
make[8]: *** [_module_/tmp/UB1604-64_K4.4.0_Clang3.8.0/x86_64-native-linuxapp-clang/713f3ad8d2a0498eb0a64fa14495957e/dpdk/x86_64-native-linuxapp-clang/build/kernel/linux/kni] Error 2
Makefile:150: recipe for target 'sub-make' failed
make[7]: *** [sub-make] Error 2
/tmp/UB1604-64_K4.4.0_Clang3.8.0/x86_64-native-linuxapp-clang/713f3ad8d2a0498eb0a64fa14495957e/dpdk/mk/rte.module.mk:50: recipe for target 'rte_kni.ko' failed
make[6]: *** [rte_kni.ko] Error 2
/tmp/UB1604-64_K4.4.0_Clang3.8.0/x86_64-native-linuxapp-clang/713f3ad8d2a0498eb0a64fa14495957e/dpdk/mk/rte.subdir.mk:35: recipe for target 'kni' failed
make[5]: *** [kni] Error 2
make[5]: *** Waiting for unfinished jobs....
  CC vdev_params.o
  LD [M]  /tmp/UB1604-64_K4.4.0_Clang3.8.0/x86_64-native-linuxapp-clang/713f3ad8d2a0498eb0a64fa14495957e/dpdk/x86_64-native-linuxapp-clang/build/kernel/linux/igb_uio/igb_uio.ko
INSTALL-MODULE igb_uio.ko
/tmp/UB1604-64_K4.4.0_Clang3.8.0/x86_64-native-linuxapp-clang/713f3ad8d2a0498eb0a64fa14495957e/dpdk/mk/rte.subdir.mk:35: recipe for target 'linux' failed
make[4]: *** [linux] Error 2
/tmp/UB1604-64_K4.4.0_Clang3.8.0/x86_64-native-linuxapp-clang/713f3ad8d2a0498eb0a64fa14495957e/dpdk/mk/rte.sdkbuild.mk:46: recipe for target 'kernel' failed
make[3]: *** [kernel] Error 2
make[3]: *** Waiting for unfinished jobs....
  CC base/fman/fman.o
  CC base/fman/fman_hw.o
  CC linux/pci_uio.o
  CC qbman/qbman_debug.o
--
  PMDINFO ifpga_rawdev.o.pmd.c
  CC ifpga_rawdev.o.pmd.o
  LD ifpga_rawdev.o
  AR librte_rawdev_ifpga.a
  INSTALL-LIB librte_rawdev_ifpga.a
/tmp/UB1604-64_K4.4.0_Clang3.8.0/x86_64-native-linuxapp-clang/713f3ad8d2a0498eb0a64fa14495957e/dpdk/mk/rte.sdkroot.mk:98: recipe for target 'all' failed
make[2]: *** [all] Error 2
/tmp/UB1604-64_K4.4.0_Clang3.8.0/x86_64-native-linuxapp-clang/713f3ad8d2a0498eb0a64fa14495957e/dpdk/mk/rte.sdkinstall.mk:60: recipe for target 'pre_install' failed
make[1]: *** [pre_install] Error 2
/tmp/UB1604-64_K4.4.0_Clang3.8.0/x86_64-native-linuxapp-clang/713f3ad8d2a0498eb0a64fa14495957e/dpdk/mk/rte.sdkroot.mk:77: recipe for target 'install' failed
make: *** [install] Error 2


*Make Build Failed #2:
OS: UB1604-32
Target: i686-native-linuxapp-gcc
  CC mc/mc_sys.o
  Building modules, stage 2.
  CC vdev_params.o
  CC linux/vmbus_uio.o
cc1: all warnings being treated as errors
/usr/src/linux-headers-4.4.0-131-generic/scripts/Makefile.build:277: recipe for target '/tmp/UB1604-32_K4.4.0_GCC5.4.0/i686-native-linuxapp-gcc/713f3ad8d2a0498eb0a64fa14495957e/dpdk/i686-native-linuxapp-gcc/build/kernel/linux/kni/kni_misc.o' failed
make[9]: *** [/tmp/UB1604-32_K4.4.0_GCC5.4.0/i686-native-linuxapp-gcc/713f3ad8d2a0498eb0a64fa14495957e/dpdk/i686-native-linuxapp-gcc/build/kernel/linux/kni/kni_misc.o] Error 1
/usr/src/linux-headers-4.4.0-131-generic/Makefile:1437: recipe for target '_module_/tmp/UB1604-32_K4.4.0_GCC5.4.0/i686-native-linuxapp-gcc/713f3ad8d2a0498eb0a64fa14495957e/dpdk/i686-native-linuxapp-gcc/build/kernel/linux/kni' failed
make[8]: *** [_module_/tmp/UB1604-32_K4.4.0_GCC5.4.0/i686-native-linuxapp-gcc/713f3ad8d2a0498eb0a64fa14495957e/dpdk/i686-native-linuxapp-gcc/build/kernel/linux/kni] Error 2
Makefile:152: recipe for target 'sub-make' failed
make[7]: *** [sub-make] Error 2
/tmp/UB1604-32_K4.4.0_GCC5.4.0/i686-native-linuxapp-gcc/713f3ad8d2a0498eb0a64fa14495957e/dpdk/mk/rte.module.mk:50: recipe for target 'rte_kni.ko' failed
make[6]: *** [rte_kni.ko] Error 2
/tmp/UB1604-32_K4.4.0_GCC5.4.0/i686-native-linuxapp-gcc/713f3ad8d2a0498eb0a64fa14495957e/dpdk/mk/rte.subdir.mk:35: recipe for target 'kni' failed
make[5]: *** [kni] Error 2
make[5]: *** Waiting for unfinished jobs....
  CC vmbus_common.o
  CC mc/dpcon.o
  AR librte_bus_ifpga.a
  INSTALL-LIB librte_bus_ifpga.a
--
  LD [M]  /tmp/UB1604-32_K4.4.0_GCC5.4.0/i686-native-linuxapp-gcc/713f3ad8d2a0498eb0a64fa14495957e/dpdk/i686-native-linuxapp-gcc/build/kernel/linux/igb_uio/igb_uio.ko
  CC base/qbman/dpaa_alloc.o
  PMDINFO portal/dpaa2_hw_dpci.o.pmd.c
  CC portal/dpaa2_hw_dpci.o.pmd.o
INSTALL-MODULE igb_uio.ko
/tmp/UB1604-32_K4.4.0_GCC5.4.0/i686-native-linuxapp-gcc/713f3ad8d2a0498eb0a64fa14495957e/dpdk/mk/rte.subdir.mk:35: recipe for target 'linux' failed
make[4]: *** [linux] Error 2
/tmp/UB1604-32_K4.4.0_GCC5.4.0/i686-native-linuxapp-gcc/713f3ad8d2a0498eb0a64fa14495957e/dpdk/mk/rte.sdkbuild.mk:46: recipe for target 'kernel' failed
make[3]: *** [kernel] Error 2
make[3]: *** Waiting for unfinished jobs....
  LD portal/dpaa2_hw_dpci.o
  CC base/qbman/dpaa_sys.o
  AR librte_bus_fslmc.a
  INSTALL-LIB librte_bus_fslmc.a
--
  PMDINFO ifpga_rawdev.o.pmd.c
  CC ifpga_rawdev.o.pmd.o
  LD ifpga_rawdev.o
  AR librte_rawdev_ifpga.a
  INSTALL-LIB librte_rawdev_ifpga.a
/tmp/UB1604-32_K4.4.0_GCC5.4.0/i686-native-linuxapp-gcc/713f3ad8d2a0498eb0a64fa14495957e/dpdk/mk/rte.sdkroot.mk:98: recipe for target 'all' failed
make[2]: *** [all] Error 2
/tmp/UB1604-32_K4.4.0_GCC5.4.0/i686-native-linuxapp-gcc/713f3ad8d2a0498eb0a64fa14495957e/dpdk/mk/rte.sdkinstall.mk:60: recipe for target 'pre_install' failed
make[1]: *** [pre_install] Error 2
/tmp/UB1604-32_K4.4.0_GCC5.4.0/i686-native-linuxapp-gcc/713f3ad8d2a0498eb0a64fa14495957e/dpdk/mk/rte.sdkroot.mk:77: recipe for target 'install' failed
make: *** [install] Error 2


*Make Build Failed #3:
OS: RHEL76-64
Target: x86_64-native-linuxapp-gcc
                 from /tmp/RHEL76-64_K3.10.0_GCC4.8.5/x86_64-native-linuxapp-gcc/713f3ad8d2a0498eb0a64fa14495957e/dpdk/x86_64-native-linuxapp-gcc/build/kernel/linux/kni/kni_misc.c:9:
/usr/src/kernels/3.10.0-957.el7.x86_64/include/linux/mm.h:1471:6: note: expected ‘int’ but argument is of type ‘struct page **’
 long get_user_pages_remote(struct task_struct *tsk, struct mm_struct *mm,
      ^
cc1: all warnings being treated as errors
make[9]: *** [/tmp/RHEL76-64_K3.10.0_GCC4.8.5/x86_64-native-linuxapp-gcc/713f3ad8d2a0498eb0a64fa14495957e/dpdk/x86_64-native-linuxapp-gcc/build/kernel/linux/kni/kni_misc.o] Error 1
make[9]: *** Waiting for unfinished jobs....
In file included from /tmp/RHEL76-64_K3.10.0_GCC4.8.5/x86_64-native-linuxapp-gcc/713f3ad8d2a0498eb0a64fa14495957e/dpdk/x86_64-native-linuxapp-gcc/build/kernel/linux/kni/kni_net.c:25:0:
/tmp/RHEL76-64_K3.10.0_GCC4.8.5/x86_64-native-linuxapp-gcc/713f3ad8d2a0498eb0a64fa14495957e/dpdk/kernel/linux/kni/kni_dev.h: In function ‘iova_to_phys’:
/tmp/RHEL76-64_K3.10.0_GCC4.8.5/x86_64-native-linuxapp-gcc/713f3ad8d2a0498eb0a64fa14495957e/dpdk/kernel/linux/kni/kni_dev.h:105:10: error: passing argument 6 of ‘get_user_pages_remote’ makes integer from pointer without a cast [-Werror]
          flags, &page, 0, 0);
--
                 from /tmp/RHEL76-64_K3.10.0_GCC4.8.5/x86_64-native-linuxapp-gcc/713f3ad8d2a0498eb0a64fa14495957e/dpdk/x86_64-native-linuxapp-gcc/build/kernel/linux/kni/kni_net.c:14:
/usr/src/kernels/3.10.0-957.el7.x86_64/include/linux/mm.h:1471:6: note: expected ‘int’ but argument is of type ‘struct page **’
 long get_user_pages_remote(struct task_struct *tsk, struct mm_struct *mm,
      ^
cc1: all warnings being treated as errors
make[9]: *** [/tmp/RHEL76-64_K3.10.0_GCC4.8.5/x86_64-native-linuxapp-gcc/713f3ad8d2a0498eb0a64fa14495957e/dpdk/x86_64-native-linuxapp-gcc/build/kernel/linux/kni/kni_net.o] Error 1
make[8]: *** [_module_/tmp/RHEL76-64_K3.10.0_GCC4.8.5/x86_64-native-linuxapp-gcc/713f3ad8d2a0498eb0a64fa14495957e/dpdk/x86_64-native-linuxapp-gcc/build/kernel/linux/kni] Error 2
make[7]: *** [sub-make] Error 2
make[6]: *** [rte_kni.ko] Error 2
make[5]: *** [kni] Error 2
make[5]: *** Waiting for unfinished jobs....
  Building modules, stage 2.
== Build drivers/bus/dpaa
== Build drivers/bus/fslmc
== Build drivers/bus/pci
--
  CC qbman/qbman_portal.o
  CC ifpga_bus.o
INSTALL-MODULE igb_uio.ko
  SYMLINK-FILE include/rte_vmbus_reg.h
  CC base/fman/fman.o
make[4]: *** [linux] Error 2
make[3]: *** [kernel] Error 2
make[3]: *** Waiting for unfinished jobs....
  CC vdev_params.o
  CC pci_common.o
  CC ifpga_common.o
  CC linux/vmbus_bus.o
--
  PMDINFO ifpga_rawdev.o.pmd.c
  CC ifpga_rawdev.o.pmd.o
  LD ifpga_rawdev.o
  AR librte_rawdev_ifpga.a
  INSTALL-LIB librte_rawdev_ifpga.a
make[2]: *** [all] Error 2
make[1]: *** [pre_install] Error 2
make: *** [install] Error 2


*Make Build Failed #4:
OS: CENTOS76-64
Target: x86_64-native-linuxapp-clang
/usr/src/kernels/3.10.0-957.27.2.el7.x86_64/include/linux/mm.h:1471:6: note: expected ‘int’ but argument is of type ‘struct page **’
 long get_user_pages_remote(struct task_struct *tsk, struct mm_struct *mm,
      ^
  CC vmbus_bufring.o
cc1: all warnings being treated as errors
make[9]: *** [/tmp/CENTOS76-64_K3.10.0_Clang3.4.2/x86_64-native-linuxapp-clang/713f3ad8d2a0498eb0a64fa14495957e/dpdk/x86_64-native-linuxapp-clang/build/kernel/linux/kni/kni_misc.o] Error 1
make[9]: *** Waiting for unfinished jobs....
  CC portal/dpaa2_hw_dpbp.o
  CC base/fman/fman_hw.o
In file included from /tmp/CENTOS76-64_K3.10.0_Clang3.4.2/x86_64-native-linuxapp-clang/713f3ad8d2a0498eb0a64fa14495957e/dpdk/x86_64-native-linuxapp-clang/build/kernel/linux/kni/kni_net.c:25:0:
/tmp/CENTOS76-64_K3.10.0_Clang3.4.2/x86_64-native-linuxapp-clang/713f3ad8d2a0498eb0a64fa14495957e/dpdk/kernel/linux/kni/kni_dev.h: In function ‘iova_to_phys’:
--
                 from /tmp/CENTOS76-64_K3.10.0_Clang3.4.2/x86_64-native-linuxapp-clang/713f3ad8d2a0498eb0a64fa14495957e/dpdk/x86_64-native-linuxapp-clang/build/kernel/linux/kni/kni_net.c:14:
/usr/src/kernels/3.10.0-957.27.2.el7.x86_64/include/linux/mm.h:1471:6: note: expected ‘int’ but argument is of type ‘struct page **’
 long get_user_pages_remote(struct task_struct *tsk, struct mm_struct *mm,
      ^
cc1: all warnings being treated as errors
make[9]: *** [/tmp/CENTOS76-64_K3.10.0_Clang3.4.2/x86_64-native-linuxapp-clang/713f3ad8d2a0498eb0a64fa14495957e/dpdk/x86_64-native-linuxapp-clang/build/kernel/linux/kni/kni_net.o] Error 1
make[8]: *** [_module_/tmp/CENTOS76-64_K3.10.0_Clang3.4.2/x86_64-native-linuxapp-clang/713f3ad8d2a0498eb0a64fa14495957e/dpdk/x86_64-native-linuxapp-clang/build/kernel/linux/kni] Error 2
make[7]: *** [sub-make] Error 2
make[6]: *** [rte_kni.ko] Error 2
make[5]: *** [kni] Error 2
make[5]: *** Waiting for unfinished jobs....
  CC base/fman/netcfg_layer.o
  CC vmbus_common_uio.o
  CC portal/dpaa2_hw_dpci.o
  Building modules, stage 2.
--
  CC base/qbman/dpaa_sys.o
  AR librte_bus_pci.a
  INSTALL-LIB librte_bus_pci.a
  LD [M]  /tmp/CENTOS76-64_K3.10.0_Clang3.4.2/x86_64-native-linuxapp-clang/713f3ad8d2a0498eb0a64fa14495957e/dpdk/x86_64-native-linuxapp-clang/build/kernel/linux/igb_uio/igb_uio.ko
INSTALL-MODULE igb_uio.ko
make[4]: *** [linux] Error 2
make[3]: *** [kernel] Error 2
make[3]: *** Waiting for unfinished jobs....
  AR librte_bus_fslmc.a
  INSTALL-LIB librte_bus_fslmc.a
  AR librte_bus_dpaa.a
  INSTALL-LIB librte_bus_dpaa.a
--
  PMDINFO ifpga_rawdev.o.pmd.c
  CC ifpga_rawdev.o.pmd.o
  LD ifpga_rawdev.o
  AR librte_rawdev_ifpga.a
  INSTALL-LIB librte_rawdev_ifpga.a
make[2]: *** [all] Error 2
make[1]: *** [pre_install] Error 2
make: *** [install] Error 2


*Make Build Failed #5:
OS: CENTOS76-64
Target: x86_64-native-linuxapp-gcc+debug
                 from /usr/src/kernels/3.10.0-957.27.2.el7.x86_64/include/linux/netdevice.h:39,
                 from /tmp/CENTOS76-64_K3.10.0_GCC4.8.5/x86_64-native-linuxapp-gcc+debug/713f3ad8d2a0498eb0a64fa14495957e/dpdk/x86_64-native-linuxapp-gcc/build/kernel/linux/kni/kni_misc.c:9:
/usr/src/kernels/3.10.0-957.27.2.el7.x86_64/include/linux/mm.h:1471:6: note: expected ‘int’ but argument is of type ‘struct page **’
 long get_user_pages_remote(struct task_struct *tsk, struct mm_struct *mm,
      ^
make[9]: *** [/tmp/CENTOS76-64_K3.10.0_GCC4.8.5/x86_64-native-linuxapp-gcc+debug/713f3ad8d2a0498eb0a64fa14495957e/dpdk/x86_64-native-linuxapp-gcc/build/kernel/linux/kni/kni_net.o] Error 1
make[9]: *** Waiting for unfinished jobs....
cc1: all warnings being treated as errors
make[9]: *** [/tmp/CENTOS76-64_K3.10.0_GCC4.8.5/x86_64-native-linuxapp-gcc+debug/713f3ad8d2a0498eb0a64fa14495957e/dpdk/x86_64-native-linuxapp-gcc/build/kernel/linux/kni/kni_misc.o] Error 1
make[8]: *** [_module_/tmp/CENTOS76-64_K3.10.0_GCC4.8.5/x86_64-native-linuxapp-gcc+debug/713f3ad8d2a0498eb0a64fa14495957e/dpdk/x86_64-native-linuxapp-gcc/build/kernel/linux/kni] Error 2
make[7]: *** [sub-make] Error 2
make[6]: *** [rte_kni.ko] Error 2
make[5]: *** [kni] Error 2
make[5]: *** Waiting for unfinished jobs....
  Building modules, stage 2.
== Build drivers/bus/dpaa
== Build drivers/bus/fslmc
== Build drivers/bus/ifpga
--
  SYMLINK-FILE include/rte_bus_vdev.h
  LD [M]  /tmp/CENTOS76-64_K3.10.0_GCC4.8.5/x86_64-native-linuxapp-gcc+debug/713f3ad8d2a0498eb0a64fa14495957e/dpdk/x86_64-native-linuxapp-gcc/build/kernel/linux/igb_uio/igb_uio.ko
  CC ifpga_bus.o
INSTALL-MODULE igb_uio.ko
  SYMLINK-FILE include/rte_vmbus_reg.h
make[4]: *** [linux] Error 2
make[3]: *** [kernel] Error 2
make[3]: *** Waiting for unfinished jobs....
  CC vdev.o
  CC vdev_params.o
  CC pci_params.o
  CC linux/vmbus_bus.o
--
  PMDINFO ifpga_rawdev.o.pmd.c
  CC ifpga_rawdev.o.pmd.o
  LD ifpga_rawdev.o
  AR librte_rawdev_ifpga.a
  INSTALL-LIB librte_rawdev_ifpga.a
make[2]: *** [all] Error 2
make[1]: *** [pre_install] Error 2
make: *** [install] Error 2


*Make Build Failed #6:
OS: CENTOS76-64
Target: x86_64-native-linuxapp-gcc
/usr/src/kernels/3.10.0-957.10.1.el7.x86_64/include/linux/mm.h:1471:6: note: expected ‘int’ but argument is of type ‘struct page **’
 long get_user_pages_remote(struct task_struct *tsk, struct mm_struct *mm,
      ^
cc1: all warnings being treated as errors
cc1: all warnings being treated as errors
make[9]: *** [/tmp/CENTOS76-64_K3.10.0_GCC4.8.5/x86_64-native-linuxapp-gcc/713f3ad8d2a0498eb0a64fa14495957e/dpdk/x86_64-native-linuxapp-gcc/build/kernel/linux/kni/kni_misc.o] Error 1
make[9]: *** Waiting for unfinished jobs....
make[9]: *** [/tmp/CENTOS76-64_K3.10.0_GCC4.8.5/x86_64-native-linuxapp-gcc/713f3ad8d2a0498eb0a64fa14495957e/dpdk/x86_64-native-linuxapp-gcc/build/kernel/linux/kni/kni_net.o] Error 1
make[8]: *** [_module_/tmp/CENTOS76-64_K3.10.0_GCC4.8.5/x86_64-native-linuxapp-gcc/713f3ad8d2a0498eb0a64fa14495957e/dpdk/x86_64-native-linuxapp-gcc/build/kernel/linux/kni] Error 2
make[7]: *** [sub-make] Error 2
make[6]: *** [rte_kni.ko] Error 2
make[5]: *** [kni] Error 2
make[5]: *** Waiting for unfinished jobs....
  Building modules, stage 2.
  INSTALL-LIB librte_common_octeontx2.a
  AR librte_common_dpaax.a
  INSTALL-LIB librte_common_dpaax.a
--
== Build drivers/bus/vmbus
== Build drivers/bus/vdev
  CC      /tmp/CENTOS76-64_K3.10.0_GCC4.8.5/x86_64-native-linuxapp-gcc/713f3ad8d2a0498eb0a64fa14495957e/dpdk/x86_64-native-linuxapp-gcc/build/kernel/linux/igb_uio/igb_uio.mod.o
  LD [M]  /tmp/CENTOS76-64_K3.10.0_GCC4.8.5/x86_64-native-linuxapp-gcc/713f3ad8d2a0498eb0a64fa14495957e/dpdk/x86_64-native-linuxapp-gcc/build/kernel/linux/igb_uio/igb_uio.ko
INSTALL-MODULE igb_uio.ko
make[4]: *** [linux] Error 2
make[3]: *** [kernel] Error 2
make[3]: *** Waiting for unfinished jobs....
  SYMLINK-FILE include/rte_bus_pci.h
  CC qbman/qbman_portal.o
  CC qbman/qbman_debug.o
  CC mc/dpmng.o
--
  PMDINFO ifpga_rawdev.o.pmd.c
  CC ifpga_rawdev.o.pmd.o
  LD ifpga_rawdev.o
  AR librte_rawdev_ifpga.a
  INSTALL-LIB librte_rawdev_ifpga.a
make[2]: *** [all] Error 2
make[1]: *** [pre_install] Error 2
make: *** [install] Error 2


*Make Build Failed #7:
OS: CENTOS76-64
Target: x86_64-native-linuxapp-gcc+shared
                 from /tmp/CENTOS76-64_K3.10.0_GCC4.8.5/x86_64-native-linuxapp-gcc+shared/713f3ad8d2a0498eb0a64fa14495957e/dpdk/x86_64-native-linuxapp-gcc/build/kernel/linux/kni/kni_misc.c:9:
/usr/src/kernels/3.10.0-957.27.2.el7.x86_64/include/linux/mm.h:1471:6: note: expected ‘int’ but argument is of type ‘struct page **’
 long get_user_pages_remote(struct task_struct *tsk, struct mm_struct *mm,
      ^
cc1: all warnings being treated as errors
make[9]: *** [/tmp/CENTOS76-64_K3.10.0_GCC4.8.5/x86_64-native-linuxapp-gcc+shared/713f3ad8d2a0498eb0a64fa14495957e/dpdk/x86_64-native-linuxapp-gcc/build/kernel/linux/kni/kni_misc.o] Error 1
make[9]: *** Waiting for unfinished jobs....
In file included from /tmp/CENTOS76-64_K3.10.0_GCC4.8.5/x86_64-native-linuxapp-gcc+shared/713f3ad8d2a0498eb0a64fa14495957e/dpdk/x86_64-native-linuxapp-gcc/build/kernel/linux/kni/kni_net.c:25:0:
/tmp/CENTOS76-64_K3.10.0_GCC4.8.5/x86_64-native-linuxapp-gcc+shared/713f3ad8d2a0498eb0a64fa14495957e/dpdk/kernel/linux/kni/kni_dev.h: In function ‘iova_to_phys’:
/tmp/CENTOS76-64_K3.10.0_GCC4.8.5/x86_64-native-linuxapp-gcc+shared/713f3ad8d2a0498eb0a64fa14495957e/dpdk/kernel/linux/kni/kni_dev.h:105:10: error: passing argument 6 of ‘get_user_pages_remote’ makes integer from pointer without a cast [-Werror]
          flags, &page, 0, 0);
--
                 from /tmp/CENTOS76-64_K3.10.0_GCC4.8.5/x86_64-native-linuxapp-gcc+shared/713f3ad8d2a0498eb0a64fa14495957e/dpdk/x86_64-native-linuxapp-gcc/build/kernel/linux/kni/kni_net.c:14:
/usr/src/kernels/3.10.0-957.27.2.el7.x86_64/include/linux/mm.h:1471:6: note: expected ‘int’ but argument is of type ‘struct page **’
 long get_user_pages_remote(struct task_struct *tsk, struct mm_struct *mm,
      ^
cc1: all warnings being treated as errors
make[9]: *** [/tmp/CENTOS76-64_K3.10.0_GCC4.8.5/x86_64-native-linuxapp-gcc+shared/713f3ad8d2a0498eb0a64fa14495957e/dpdk/x86_64-native-linuxapp-gcc/build/kernel/linux/kni/kni_net.o] Error 1
make[8]: *** [_module_/tmp/CENTOS76-64_K3.10.0_GCC4.8.5/x86_64-native-linuxapp-gcc+shared/713f3ad8d2a0498eb0a64fa14495957e/dpdk/x86_64-native-linuxapp-gcc/build/kernel/linux/kni] Error 2
make[7]: *** [sub-make] Error 2
make[6]: *** [rte_kni.ko] Error 2
make[5]: *** [kni] Error 2
make[5]: *** Waiting for unfinished jobs....
  MODPOST 1 modules
== Build drivers/bus/dpaa
== Build drivers/bus/fslmc
== Build drivers/bus/ifpga
--
== Build drivers/bus/vdev
== Build drivers/bus/vmbus
  CC      /tmp/CENTOS76-64_K3.10.0_GCC4.8.5/x86_64-native-linuxapp-gcc+shared/713f3ad8d2a0498eb0a64fa14495957e/dpdk/x86_64-native-linuxapp-gcc/build/kernel/linux/igb_uio/igb_uio.mod.o
  LD [M]  /tmp/CENTOS76-64_K3.10.0_GCC4.8.5/x86_64-native-linuxapp-gcc+shared/713f3ad8d2a0498eb0a64fa14495957e/dpdk/x86_64-native-linuxapp-gcc/build/kernel/linux/igb_uio/igb_uio.ko
INSTALL-MODULE igb_uio.ko
make[4]: *** [linux] Error 2
make[3]: *** [kernel] Error 2
make[3]: *** Waiting for unfinished jobs....
  SYMLINK-FILE include/rte_bus_vdev.h
  CC vdev.o
  CC vdev_params.o
  SYMLINK-FILE include/rte_bus_ifpga.h
--
  PMDINFO ifpga_rawdev.o.pmd.c
  CC ifpga_rawdev.o.pmd.o
  LD ifpga_rawdev.o
  LD librte_rawdev_ifpga.so.1.1
  INSTALL-LIB librte_rawdev_ifpga.so.1.1
make[2]: *** [all] Error 2
make[1]: *** [pre_install] Error 2
make: *** [install] Error 2


*Make Build Failed #8:
OS: CENTOS76-64
Target: x86_64-native-linuxapp-icc
/usr/src/kernels/3.10.0-957.27.2.el7.x86_64/include/linux/mm.h:1471:6: note: expected ‘int’ but argument is of type ‘struct page **’
 long get_user_pages_remote(struct task_struct *tsk, struct mm_struct *mm,
      ^
cc1: all warnings being treated as errors
cc1: all warnings being treated as errors
make[9]: *** [/tmp/CENTOS76-64_K3.10.0_ICC19.0.0/x86_64-native-linuxapp-icc/713f3ad8d2a0498eb0a64fa14495957e/dpdk/x86_64-native-linuxapp-icc/build/kernel/linux/kni/kni_misc.o] Error 1
make[9]: *** Waiting for unfinished jobs....
make[9]: *** [/tmp/CENTOS76-64_K3.10.0_ICC19.0.0/x86_64-native-linuxapp-icc/713f3ad8d2a0498eb0a64fa14495957e/dpdk/x86_64-native-linuxapp-icc/build/kernel/linux/kni/kni_net.o] Error 1
make[8]: *** [_module_/tmp/CENTOS76-64_K3.10.0_ICC19.0.0/x86_64-native-linuxapp-icc/713f3ad8d2a0498eb0a64fa14495957e/dpdk/x86_64-native-linuxapp-icc/build/kernel/linux/kni] Error 2
make[7]: *** [sub-make] Error 2
make[6]: *** [rte_kni.ko] Error 2
make[5]: *** [kni] Error 2
make[5]: *** Waiting for unfinished jobs....
  Building modules, stage 2.
  CC otx2_dev.o
  CC otx2_irq.o
  CC otx2_mbox.o
--
  AR librte_common_octeontx2.a
  INSTALL-LIB librte_common_dpaax.a
  CC      /tmp/CENTOS76-64_K3.10.0_ICC19.0.0/x86_64-native-linuxapp-icc/713f3ad8d2a0498eb0a64fa14495957e/dpdk/x86_64-native-linuxapp-icc/build/kernel/linux/igb_uio/igb_uio.mod.o
  LD [M]  /tmp/CENTOS76-64_K3.10.0_ICC19.0.0/x86_64-native-linuxapp-icc/713f3ad8d2a0498eb0a64fa14495957e/dpdk/x86_64-native-linuxapp-icc/build/kernel/linux/igb_uio/igb_uio.ko
INSTALL-MODULE igb_uio.ko
make[4]: *** [linux] Error 2
make[3]: *** [kernel] Error 2
make[3]: *** Waiting for unfinished jobs....
  INSTALL-LIB librte_common_octeontx2.a
== Build drivers/bus
== Build drivers/bus/dpaa
== Build drivers/bus/fslmc
--
  PMDINFO ifpga_rawdev.o.pmd.c
  CC ifpga_rawdev.o.pmd.o
  LD ifpga_rawdev.o
  AR librte_rawdev_ifpga.a
  INSTALL-LIB librte_rawdev_ifpga.a
make[2]: *** [all] Error 2
make[1]: *** [pre_install] Error 2
make: *** [install] Error 2

*Meson Build Failed #1:
OS: UB1604-32
Target:build-gcc-static
FAILED: kernel/linux/kni/rte_kni.ko 
make -j4 -C /lib/modules/4.4.0-131-generic/build M=/tmp/UB1604-32_K4.4.0_GCC5.4.0/i686-native-linuxapp-gcc/713f3ad8d2a0498eb0a64fa14495957e/dpdk/build-gcc-static/kernel/linux/kni src=/tmp/UB1604-32_K4.4.0_GCC5.4.0/i686-native-linuxapp-gcc/713f3ad8d2a0498eb0a64fa14495957e/dpdk/kernel/linux/kni 'MODULE_CFLAGS=-include /tmp/UB1604-32_K4.4.0_GCC5.4.0/i686-native-linuxapp-gcc/713f3ad8d2a0498eb0a64fa14495957e/dpdk/config/rte_config.h -I/tmp/UB1604-32_K4.4.0_GCC5.4.0/i686-native-linuxapp-gcc/713f3ad8d2a0498eb0a64fa14495957e/dpdk/lib/librte_eal/common/include -I/tmp/UB1604-32_K4.4.0_GCC5.4.0/i686-native-linuxapp-gcc/713f3ad8d2a0498eb0a64fa14495957e/dpdk/lib/librte_eal/linux/eal/include -I/tmp/UB1604-32_K4.4.0_GCC5.4.0/i686-native-linuxapp-gcc/713f3ad8d2a0498eb0a64fa14495957e/dpdk/build-gcc-static -I/tmp/UB1604-32_K4.4.0_GCC5.4.0/i686-native-linuxapp-gcc/713f3ad8d2a0498eb0a64fa14495957e/dpdk/kernel/linux/kni' modules
[1714/1714] Generating igb_uio with a custom command.
make: Entering directory '/usr/src/linux-headers-4.4.0-131-generic'
  CC [M]  /tmp/UB1604-32_K4.4.0_GCC5.4.0/i686-native-linuxapp-gcc/713f3ad8d2a0498eb0a64fa14495957e/dpdk/build-gcc-static/kernel/linux/igb_uio/igb_uio.o
  Building modules, stage 2.
  MODPOST 1 modules
  CC      /tmp/UB1604-32_K4.4.0_GCC5.4.0/i686-native-linuxapp-gcc/713f3ad8d2a0498eb0a64fa14495957e/dpdk/build-gcc-static/kernel/linux/igb_uio/igb_uio.mod.o
  LD [M]  /tmp/UB1604-32_K4.4.0_GCC5.4.0/i686-native-linuxapp-gcc/713f3ad8d2a0498eb0a64fa14495957e/dpdk/build-gcc-static/kernel/linux/igb_uio/igb_uio.ko
make: Leaving directory '/usr/src/linux-headers-4.4.0-131-generic'
ninja: build stopped: subcommand failed



DPDK STV team

^ permalink raw reply	[flat|nested] only message in thread

only message in thread, back to index

Thread overview: (only message) (download: mbox.gz / follow: Atom feed)
-- links below jump to the message on this page --
2019-10-21  8:43 [dpdk-test-report] |FAILURE| pw61561[v11, 3/4] kni: add IOVA=VA support sys_stv

automatic DPDK test reports

Archives are clonable:
	git clone --mirror http://inbox.dpdk.org/test-report/0 test-report/git/0.git

	# If you have public-inbox 1.1+ installed, you may
	# initialize and index your mirror using the following commands:
	public-inbox-init -V2 test-report test-report/ http://inbox.dpdk.org/test-report \
		test-report@dpdk.org
	public-inbox-index test-report


Newsgroup available over NNTP:
	nntp://inbox.dpdk.org/inbox.dpdk.test-report


AGPL code for this site: git clone https://public-inbox.org/ public-inbox