automatic DPDK test reports
 help / color / Atom feed
* [dpdk-test-report] |FAILURE| pw62527net/mlx5: add missing ptype for geneve tunnel
@ 2019-11-08  7:58 sys_stv
  0 siblings, 0 replies; 2+ messages in thread
From: sys_stv @ 2019-11-08  7:58 UTC (permalink / raw)
  To: test-report

[-- Attachment #1: Type: text/plain, Size: 6196 bytes --]

Test-Label: Intel-compilation
Test-Status: FAILURE
http://dpdk.org/patch/62527

_Compilation issues_

Submitter: Wisam Monther <wisamm@mellanox.com>
Date: 2019-11-06 09:38:55
Reply_mail: 1573033119-32015-1-git-send-email-wisamm@mellanox.com
DPDK git baseline: Repo:dpdk, CommitID: 9a643edb2b74c5993465089aa23178cd9ad612cc

Makefile build Summary: 22 Builds Done, 22 Successful, 0 Failures

Meson build Summary: 7 Builds Done, 6 Successful, 1 Failures

               +==============================================+===========+==========+
               |                   Makefile                   |   Meson   | Document |
+--------------+------+-------+------+------------+-----------+-----------+----------+
| os           | gcc  | clang | icc  | gcc+shared | gcc+debug | gcc/clang | pdf/html |
+--------------+------+-------+------+------------+-----------+-----------+----------+
| RHEL76-64    | pass |       |      |            |           |           |          |
| CENTOS76-64  | pass | pass  | pass | pass       | pass      |           |          |
| UB1804-64    | pass | pass  | pass |            |           | pass      | pass     |
| UB1604-32    | pass |       |      |            |           | FAIL      |          |
| UB1904-64    | pass |       |      |            |           |           |          |
| UB1604-64    | pass | pass  |      |            |           |           |          |
| FC30-64      | pass | pass  |      |            |           | pass      |          |
| WIN10-64     |      |       |      |            |           | pass      |          |
| FreeBSD12-64 | pass | pass  |      | pass       | pass      | pass      |          |
| RHEL80-64    | pass |       |      |            |           |           |          |
| SUSE15-64    | pass | pass  |      |            |           | pass      |          |
+--------------+------+-------+------+------------+-----------+-----------+----------+

Test environment and configuration as below:

** Makefile build **


OS: RHEL76-64
	Kernel Version: 3.10.0-957.el7.x86_64
	CPU info: Intel(R) Xeon(R) CPU E5-2699 v4 @ 2.20GHz
	GCC Version: gcc (GCC) 4.8.5 20150623 (Red Hat 4.8.5-36)
	Clang Version: NA
	x86_64-native-linuxapp-gcc


OS: CENTOS76-64
	Kernel Version: 3.10.0-957.27.2.el7.x86_64
	CPU info: Intel(R) Xeon(R) CPU E5-2699 v4 @ 2.20GHz
	GCC Version: gcc (GCC) 4.8.5 20150623 (Red Hat 4.8.5-36)
	Clang Version: 3.4.2 (tags/RELEASE_34/dot2-final)
	x86_64-native-linuxapp-clang
	x86_64-native-linuxapp-gcc+debug
	x86_64-native-linuxapp-gcc
	x86_64-native-linuxapp-gcc+shared
	x86_64-native-linuxapp-icc


OS: UB1804-64
	Kernel Version: 4.15.0-20-generic
	CPU info: Intel(R) Xeon(R) CPU E5-2699 v3 @ 2.30GHz
	GCC Version: gcc (Ubuntu 7.3.0-16ubuntu3) 7.3.0
	Clang Version: 6.0.0-1ubuntu2 (tags/RELEASE_600/final)
	x86_64-native-linuxapp-clang
	x86_64-native-linuxapp-icc
	x86_64-native-linuxapp-gcc


OS: UB1904-64
	Kernel Version: 5.0.0-13-generic
	CPU info: Intel(R) Xeon(R) CPU E5-2699 v3 @ 2.30GHz
	GCC Version: gcc (Ubuntu 8.3.0-6ubuntu1) 8.3.0
	Clang Version: 8.0.0-3 (tags/RELEASE_800/final)
	x86_64-native-linuxapp-gcc


OS: UB1604-32
	Kernel Version: 4.4.0-131-generic
	CPU info: Intel(R) Xeon(R) CPU E5-2699 v3 @ 2.30GHz
	GCC Version: gcc (Ubuntu 5.4.0-6ubuntu1~16.04.11) 5.4.0 20160609
	Clang Version: 3.8.0-2ubuntu4 (tags/RELEASE_380/final)
	i686-native-linuxapp-gcc


OS: UB1604-64
	Kernel Version: 4.4.0-47-generic
	CPU info: Intel(R) Xeon(R) CPU E5-2699 v3 @ 2.30GHz
	GCC Version: gcc (Ubuntu 5.4.0-6ubuntu1~16.04.12) 5.4.0 20160609
	Clang Version: 3.8.0-2ubuntu4 (tags/RELEASE_380/final)
	x86_64-native-linuxapp-clang
	x86_64-native-linuxapp-gcc


OS: FC30-64
	Kernel Version: 5.1.7-300.fc30.x86_64
	CPU info: Intel(R) Xeon(R) CPU E5-2699 v4 @ 2.20GHz
	GCC Version: gcc (GCC) 9.1.1 20190503 (Red Hat 9.1.1-1)
	Clang Version: 8.0.0 (Fedora 8.0.0-1.fc30)
	x86_64-native-linuxapp-gcc
	x86_64-native-linuxapp-clang


OS: FreeBSD12-64
	Kernel Version: 12.0-RC3
	CPU info: Intel(R) Xeon(R) CPU E5-2699 v4 @ 2.20GHz (2194.98-MHz K8-class CPU)
	GCC Version: gcc (FreeBSD Ports Collection) 9.2.0
	Clang Version: 6.0.1 (tags/RELEASE_601/final 335540) (based on LLVM 6.0.1)
	x86_64-native-bsdapp-gcc
	x86_64-native-bsdapp-gcc+debug
	x86_64-native-bsdapp-gcc+shared
	x86_64-native-bsdapp-clang


OS: RHEL80-64
	Kernel Version: 4.18.0-80.el8.x86_64
	CPU info: Intel(R) Xeon(R) CPU E5-2699 v4 @ 2.20GHz
	GCC Version: gcc (GCC) 8.2.1 20180905 (Red Hat 8.2.1-3)
	Clang Version: 6.0.1 (tags/RELEASE_601/final)
	x86_64-native-linuxapp-gcc


OS: SUSE15-64
	Kernel Version: 4.12.14-lp150.11-default
	CPU info: Intel(R) Xeon(R) CPU E5-2699 v4 @ 2.20GHz
	GCC Version: gcc (SUSE Linux) 7.3.1 20180323 [gcc-7-branch revision 258812]
	Clang Version: 5.0.1 (tags/RELEASE_501/final 312548)
	x86_64-native-linuxapp-gcc
	x86_64-native-linuxapp-clang


** Meson build **


OS: UB1804-64
	Kernel Version: 4.15.0-20-generic
	CPU info: Intel(R) Xeon(R) CPU E5-2699 v4 @ 2.20GHz
	GCC Version: gcc (Ubuntu 7.3.0-27ubuntu1~18.04) 7.3.0
	Clang Version: 6.0.0-1ubuntu2 (tags/RELEASE_600/final)
	x86_64-native-linuxapp-doc


OS: UB1604-32
	Kernel Version: 4.4.0-131-generic
	CPU info: Intel(R) Xeon(R) CPU E5-2699 v4 @ 2.20GHz
	GCC Version: gcc (Ubuntu 5.4.0-6ubuntu1~16.04.11) 5.4.0 20160609
	Clang Version: 3.8.0-2ubuntu4 (tags/RELEASE_380/final)
	


OS: FC30-64
	Kernel Version: 5.0.9-301.fc30.x86_64
	CPU info: Intel(R) Xeon(R) CPU E5-2699 v4 @ 2.20GHz
	GCC Version: gcc (GCC) 9.1.1 20190503 (Red Hat 9.1.1-1)
	Clang Version: 8.0.0 (Fedora 8.0.0-1.fc30)
	


OS: WIN10-64
	Kernel Version: N/A
	CPU info: N/A
	GCC Version: N/A
	Clang Version: Clang 8.0.0
	x86_64-windows-clang


OS: FreeBSD12-64
	Kernel Version: 12.0-RC3
	CPU info: Intel(R) Xeon(R) CPU E5-2699 v4 @ 2.20GHz (2194.97-MHz K8-class CPU)
	GCC Version: gcc (FreeBSD Ports Collection) 7.3.0
	Clang Version: 6.0.1 (tags/RELEASE_601/final 335540) (based on LLVM 6.0.1)
	


OS: SUSE15-64
	Kernel Version: 4.12.14-lp150.11-default
	CPU info: Intel(R) Xeon(R) CPU E5-2699 v4 @ 2.20GHz
	GCC Version: gcc (SUSE Linux) 7.3.1 20180323 [gcc-7-branch revision 258812]
	Clang Version: 5.0.1 (tags/RELEASE_501/final 312548)
	


*Meson Build Failed #1:
OS: UB1604-32


DPDK STV team

^ permalink raw reply	[flat|nested] 2+ messages in thread

* [dpdk-test-report] |FAILURE| pw62527net/mlx5: add missing ptype for geneve tunnel
@ 2019-11-08  9:02 sys_stv
  0 siblings, 0 replies; 2+ messages in thread
From: sys_stv @ 2019-11-08  9:02 UTC (permalink / raw)
  To: test-report

[-- Attachment #1: Type: text/plain, Size: 11795 bytes --]

Test-Label: Intel-compilation
Test-Status: FAILURE
http://dpdk.org/patch/62527

_Compilation issues_

Submitter: Wisam Monther <wisamm@mellanox.com>
Date: 2019-11-06 09:38:55
Reply_mail: 1573033119-32015-1-git-send-email-wisamm@mellanox.com
DPDK git baseline: Repo:dpdk, CommitID: 9a643edb2b74c5993465089aa23178cd9ad612cc

Makefile build Summary: 22 Builds Done, 22 Successful, 0 Failures

Meson build Summary: 7 Builds Done, 6 Successful, 1 Failures

               +==============================================+===========+==========+
               |                   Makefile                   |   Meson   | Document |
+--------------+------+-------+------+------------+-----------+-----------+----------+
| os           | gcc  | clang | icc  | gcc+shared | gcc+debug | gcc/clang | pdf/html |
+--------------+------+-------+------+------------+-----------+-----------+----------+
| RHEL76-64    | pass |       |      |            |           |           |          |
| CENTOS76-64  | pass | pass  | pass | pass       | pass      |           |          |
| UB1804-64    | pass | pass  | pass |            |           | pass      | pass     |
| UB1604-32    | pass |       |      |            |           | FAIL      |          |
| UB1904-64    | pass |       |      |            |           |           |          |
| UB1604-64    | pass | pass  |      |            |           |           |          |
| FC30-64      | pass | pass  |      |            |           | pass      |          |
| WIN10-64     |      |       |      |            |           | pass      |          |
| FreeBSD12-64 | pass | pass  |      | pass       | pass      | pass      |          |
| RHEL80-64    | pass |       |      |            |           |           |          |
| SUSE15-64    | pass | pass  |      |            |           | pass      |          |
+--------------+------+-------+------+------------+-----------+-----------+----------+

Test environment and configuration as below:

** Makefile build **


OS: RHEL76-64
	Kernel Version: 3.10.0-957.el7.x86_64
	CPU info: Intel(R) Xeon(R) CPU E5-2699 v4 @ 2.20GHz
	GCC Version: gcc (GCC) 4.8.5 20150623 (Red Hat 4.8.5-36)
	Clang Version: NA
	x86_64-native-linuxapp-gcc


OS: CENTOS76-64
	Kernel Version: 3.10.0-957.27.2.el7.x86_64
	CPU info: Intel(R) Xeon(R) CPU E5-2699 v4 @ 2.20GHz
	GCC Version: gcc (GCC) 4.8.5 20150623 (Red Hat 4.8.5-36)
	Clang Version: 3.4.2 (tags/RELEASE_34/dot2-final)
	x86_64-native-linuxapp-clang
	x86_64-native-linuxapp-gcc+debug
	x86_64-native-linuxapp-gcc+shared
	x86_64-native-linuxapp-gcc
	x86_64-native-linuxapp-icc


OS: UB1804-64
	Kernel Version: 4.15.0-20-generic
	CPU info: Intel(R) Xeon(R) CPU E5-2699 v3 @ 2.30GHz
	GCC Version: gcc (Ubuntu 7.3.0-16ubuntu3) 7.3.0
	Clang Version: 6.0.0-1ubuntu2 (tags/RELEASE_600/final)
	x86_64-native-linuxapp-clang
	x86_64-native-linuxapp-icc
	x86_64-native-linuxapp-gcc


OS: UB1904-64
	Kernel Version: 5.0.0-13-generic
	CPU info: Intel(R) Xeon(R) CPU E5-2699 v3 @ 2.30GHz
	GCC Version: gcc (Ubuntu 8.3.0-6ubuntu1) 8.3.0
	Clang Version: 8.0.0-3 (tags/RELEASE_800/final)
	x86_64-native-linuxapp-gcc


OS: UB1604-32
	Kernel Version: 4.4.0-131-generic
	CPU info: Intel(R) Xeon(R) CPU E5-2699 v3 @ 2.30GHz
	GCC Version: gcc (Ubuntu 5.4.0-6ubuntu1~16.04.11) 5.4.0 20160609
	Clang Version: 3.8.0-2ubuntu4 (tags/RELEASE_380/final)
	i686-native-linuxapp-gcc


OS: UB1604-64
	Kernel Version: 4.4.0-47-generic
	CPU info: Intel(R) Xeon(R) CPU E5-2699 v3 @ 2.30GHz
	GCC Version: gcc (Ubuntu 5.4.0-6ubuntu1~16.04.12) 5.4.0 20160609
	Clang Version: 3.8.0-2ubuntu4 (tags/RELEASE_380/final)
	x86_64-native-linuxapp-clang
	x86_64-native-linuxapp-gcc


OS: FC30-64
	Kernel Version: 5.1.7-300.fc30.x86_64
	CPU info: Intel(R) Xeon(R) CPU E5-2699 v4 @ 2.20GHz
	GCC Version: gcc (GCC) 9.1.1 20190503 (Red Hat 9.1.1-1)
	Clang Version: 8.0.0 (Fedora 8.0.0-1.fc30)
	x86_64-native-linuxapp-gcc
	x86_64-native-linuxapp-clang


OS: FreeBSD12-64
	Kernel Version: 12.0-RC3
	CPU info: Intel(R) Xeon(R) CPU E5-2699 v4 @ 2.20GHz (2194.98-MHz K8-class CPU)
	GCC Version: gcc (FreeBSD Ports Collection) 7.3.0
	Clang Version: 6.0.1 (tags/RELEASE_601/final 335540) (based on LLVM 6.0.1)
	x86_64-native-bsdapp-gcc+debug
	x86_64-native-bsdapp-gcc
	x86_64-native-bsdapp-clang
	x86_64-native-bsdapp-gcc+shared


OS: RHEL80-64
	Kernel Version: 4.18.0-80.el8.x86_64
	CPU info: Intel(R) Xeon(R) CPU E5-2699 v4 @ 2.20GHz
	GCC Version: gcc (GCC) 8.2.1 20180905 (Red Hat 8.2.1-3)
	Clang Version: 6.0.1 (tags/RELEASE_601/final)
	x86_64-native-linuxapp-gcc


OS: SUSE15-64
	Kernel Version: 4.12.14-lp150.11-default
	CPU info: Intel(R) Xeon(R) CPU E5-2699 v4 @ 2.20GHz
	GCC Version: gcc (SUSE Linux) 7.3.1 20180323 [gcc-7-branch revision 258812]
	Clang Version: 5.0.1 (tags/RELEASE_501/final 312548)
	x86_64-native-linuxapp-gcc
	x86_64-native-linuxapp-clang


** Meson build **


OS: UB1804-64
	Kernel Version: 4.15.0-20-generic
	CPU info: Intel(R) Xeon(R) CPU E5-2699 v4 @ 2.20GHz
	GCC Version: gcc (Ubuntu 7.3.0-27ubuntu1~18.04) 7.3.0
	Clang Version: 6.0.0-1ubuntu2 (tags/RELEASE_600/final)
	x86_64-native-linuxapp-doc
	build-gcc-static
	build-gcc-shared
	build-clang-static
	build-clang-shared
	build-x86-default


OS: UB1604-32
	Kernel Version: 4.4.0-131-generic
	CPU info: Intel(R) Xeon(R) CPU E5-2699 v4 @ 2.20GHz
	GCC Version: gcc (Ubuntu 5.4.0-6ubuntu1~16.04.11) 5.4.0 20160609
	Clang Version: 3.8.0-2ubuntu4 (tags/RELEASE_380/final)
	build-gcc-static
	build-gcc-shared
	build-clang-static
	build-clang-shared
	build-x86-default


OS: FC30-64
	Kernel Version: 5.0.9-301.fc30.x86_64
	CPU info: Intel(R) Xeon(R) CPU E5-2699 v4 @ 2.20GHz
	GCC Version: gcc (GCC) 9.1.1 20190503 (Red Hat 9.1.1-1)
	Clang Version: 8.0.0 (Fedora 8.0.0-1.fc30)
	build-gcc-static
	build-gcc-shared
	build-clang-static
	build-clang-shared
	build-x86-default


OS: WIN10-64
	Kernel Version: N/A
	CPU info: N/A
	GCC Version: N/A
	Clang Version: Clang 8.0.0
	x86_64-windows-clang


OS: FreeBSD12-64
	Kernel Version: 12.0-RC3
	CPU info: Intel(R) Xeon(R) CPU E5-2699 v4 @ 2.20GHz (2194.97-MHz K8-class CPU)
	GCC Version: gcc (FreeBSD Ports Collection) 7.3.0
	Clang Version: 6.0.1 (tags/RELEASE_601/final 335540) (based on LLVM 6.0.1)
	build-gcc-static
	build-gcc-shared
	build-clang-static
	build-clang-shared
	build-x86-default


OS: SUSE15-64
	Kernel Version: 4.12.14-lp150.11-default
	CPU info: Intel(R) Xeon(R) CPU E5-2699 v4 @ 2.20GHz
	GCC Version: gcc (SUSE Linux) 7.3.1 20180323 [gcc-7-branch revision 258812]
	Clang Version: 5.0.1 (tags/RELEASE_501/final 312548)
	build-gcc-static
	build-gcc-shared
	build-clang-static
	build-clang-shared
	build-x86-default


*Meson Build Failed #1:
OS: UB1604-32
Target:build-gcc-static
[801/1764] Linking static target drivers/net/i40e/base/libi40e_base.a.
[802/1764] Compiling C object 'drivers/a715181@@tmp_rte_pmd_i40e@sta/net_i40e_i40e_pf.c.o'.
[803/1764] Compiling C object 'drivers/a715181@@tmp_rte_pmd_i40e@sta/net_i40e_i40e_ethdev_vf.c.o'.
[804/1764] Compiling C object 'drivers/a715181@@tmp_rte_pmd_i40e@sta/net_i40e_i40e_vf_representor.c.o'.
[805/1764] Compiling C object 'drivers/a715181@@tmp_rte_pmd_i40e@sta/net_i40e_i40e_tm.c.o'.
FAILED: drivers/a715181@@tmp_rte_pmd_i40e@sta/net_i40e_i40e_tm.c.o 
clang -Idrivers/a715181@@tmp_rte_pmd_i40e@sta -Idrivers -I../drivers -Idrivers/net/i40e -I../drivers/net/i40e -Idrivers/net/i40e/base -I../drivers/net/i40e/base -Ilib/librte_ethdev -I../lib/librte_ethdev -I. -I../ -Iconfig -I../config -Ilib/librte_eal/common/include -I../lib/librte_eal/common/include -I../lib/librte_eal/linux/eal/include -Ilib/librte_eal/common -I../lib/librte_eal/common -Ilib/librte_eal/common/include/arch/x86 -I../lib/librte_eal/common/include/arch/x86 -Ilib/librte_eal -I../lib/librte_eal -Ilib/librte_kvargs -I../lib/librte_kvargs -Ilib/librte_net -I../lib/librte_net -Ilib/librte_mbuf -I../lib/librte_mbuf -Ilib/librte_mempool -I../lib/librte_mempool -Ilib/librte_ring -I../lib/librte_ring -Ilib/librte_meter -I../lib/librte_meter -Idrivers/bus/pci -I../drivers/bus/pci -I../drivers/bus/pci/linux -Ilib/librte_pci -I../lib/librte_pci -Idrivers/bus/vdev -I../drivers/bus/vdev -Ilib/librte_hash -I../lib/librte_hash -Xclang -fcolor-diagnostics -pipe -D_FILE_OFFSET_BITS=64 -Wall -Winvalid-pch -Werror -O3 -include rte_config.h -Wextra -Wcast-qual -Wdeprecated -Wformat-nonliteral -Wformat-security -Wmissing-declarations -Wmissing-prototypes -Wnested-externs -Wold-style-definition -Wpointer-arith -Wsign-compare -Wstrict-prototypes -Wundef -Wwrite-strings -Wno-missing-field-initializers -Wno-pointer-to-int-cast -D_GNU_SOURCE -fPIC -march=native -DPF_DRIVER -DVF_DRIVER -DINTEGRATED_VF -DX722_A0_SUPPORT -DALLOW_EXPERIMENTAL_API -DCC_AVX2_SUPPORT -MD -MQ 'drivers/a715181@@tmp_rte_pmd_i40e@sta/net_i40e_i40e_tm.c.o' -MF 'drivers/a715181@@tmp_rte_pmd_i40e@sta/net_i40e_i40e_tm.c.o.d' -o 'drivers/a715181@@tmp_rte_pmd_i40e@sta/net_i40e_i40e_tm.c.o' -c ../drivers/net/i40e/i40e_tm.c
fatal error: error in backend: IO failure on output stream.
[806/1764] Compiling C object 'drivers/a715181@@tmp_rte_pmd_i40e@sta/net_i40e_i40e_fdir.c.o'.
FAILED: drivers/a715181@@tmp_rte_pmd_i40e@sta/net_i40e_i40e_fdir.c.o 
clang -Idrivers/a715181@@tmp_rte_pmd_i40e@sta -Idrivers -I../drivers -Idrivers/net/i40e -I../drivers/net/i40e -Idrivers/net/i40e/base -I../drivers/net/i40e/base -Ilib/librte_ethdev -I../lib/librte_ethdev -I. -I../ -Iconfig -I../config -Ilib/librte_eal/common/include -I../lib/librte_eal/common/include -I../lib/librte_eal/linux/eal/include -Ilib/librte_eal/common -I../lib/librte_eal/common -Ilib/librte_eal/common/include/arch/x86 -I../lib/librte_eal/common/include/arch/x86 -Ilib/librte_eal -I../lib/librte_eal -Ilib/librte_kvargs -I../lib/librte_kvargs -Ilib/librte_net -I../lib/librte_net -Ilib/librte_mbuf -I../lib/librte_mbuf -Ilib/librte_mempool -I../lib/librte_mempool -Ilib/librte_ring -I../lib/librte_ring -Ilib/librte_meter -I../lib/librte_meter -Idrivers/bus/pci -I../drivers/bus/pci -I../drivers/bus/pci/linux -Ilib/librte_pci -I../lib/librte_pci -Idrivers/bus/vdev -I../drivers/bus/vdev -Ilib/librte_hash -I../lib/librte_hash -Xclang -fcolor-diagnostics -pipe -D_FILE_OFFSET_BITS=64 -Wall -Winvalid-pch -Werror -O3 -include rte_config.h -Wextra -Wcast-qual -Wdeprecated -Wformat-nonliteral -Wformat-security -Wmissing-declarations -Wmissing-prototypes -Wnested-externs -Wold-style-definition -Wpointer-arith -Wsign-compare -Wstrict-prototypes -Wundef -Wwrite-strings -Wno-missing-field-initializers -Wno-pointer-to-int-cast -D_GNU_SOURCE -fPIC -march=native -DPF_DRIVER -DVF_DRIVER -DINTEGRATED_VF -DX722_A0_SUPPORT -DALLOW_EXPERIMENTAL_API -DCC_AVX2_SUPPORT -MD -MQ 'drivers/a715181@@tmp_rte_pmd_i40e@sta/net_i40e_i40e_fdir.c.o' -MF 'drivers/a715181@@tmp_rte_pmd_i40e@sta/net_i40e_i40e_fdir.c.o.d' -o 'drivers/a715181@@tmp_rte_pmd_i40e@sta/net_i40e_i40e_fdir.c.o' -c ../drivers/net/i40e/i40e_fdir.c
fatal error: error in backend: IO failure on output stream.
[807/1764] Compiling C object 'drivers/a715181@@tmp_rte_pmd_i40e@sta/net_i40e_i40e_flow.c.o'.
[808/1764] Compiling C object 'drivers/a715181@@tmp_rte_pmd_i40e@sta/net_i40e_i40e_rxtx_vec_sse.c.o'.
[809/1764] Compiling C object 'drivers/a715181@@tmp_rte_pmd_i40e@sta/net_i40e_rte_pmd_i40e.c.o'.
[810/1764] Compiling C object 'drivers/a715181@@tmp_rte_pmd_i40e@sta/net_i40e_i40e_ethdev.c.o'.
ninja: build stopped: subcommand failed.
meson --werror -Dexamples=all --default-library=shared /tmp/UB1604-32_K4.4.0_GCC5.4.0/i686-native-linuxapp-gcc/26ad428617694e7ba757d1f131cbb9fc/dpdk/devtools/.. build-clang-shared
The Meson build system
Version: 0.50.1
Source dir: /tmp/UB1604-32_K4.4.0_GCC5.4.0/i686-native-linuxapp-gcc/26ad428617694e7ba757d1f131cbb9fc/dpdk
Build dir: /tmp/UB1604-32_K4.4.0_GCC5.4.0/i686-native-linuxapp-gcc/26ad428617694e7ba757d1f131cbb9fc/dpdk/build-clang-shared

DPDK STV team

^ permalink raw reply	[flat|nested] 2+ messages in thread

end of thread, back to index

Thread overview: 2+ messages (download: mbox.gz / follow: Atom feed)
-- links below jump to the message on this page --
2019-11-08  7:58 [dpdk-test-report] |FAILURE| pw62527net/mlx5: add missing ptype for geneve tunnel sys_stv
2019-11-08  9:02 sys_stv

automatic DPDK test reports

Archives are clonable:
	git clone --mirror http://inbox.dpdk.org/test-report/0 test-report/git/0.git

	# If you have public-inbox 1.1+ installed, you may
	# initialize and index your mirror using the following commands:
	public-inbox-init -V2 test-report test-report/ http://inbox.dpdk.org/test-report \
		test-report@dpdk.org
	public-inbox-index test-report


Newsgroup available over NNTP:
	nntp://inbox.dpdk.org/inbox.dpdk.test-report


AGPL code for this site: git clone https://public-inbox.org/ public-inbox