automatic DPDK test reports
 help / color / Atom feed
* [dpdk-test-report]  |FAILURE| pw62531[v3, 1/1] net/octeontx2: add Rx/Tx burst mode get callbacks
@ 2019-11-08 10:56 sys_stv
  0 siblings, 0 replies; only message in thread
From: sys_stv @ 2019-11-08 10:56 UTC (permalink / raw)
  To: test-report

[-- Attachment #1: Type: text/plain, Size: 62680 bytes --]

Test-Label: Intel-compilation
Test-Status: FAILURE
http://dpdk.org/patch/62531

_Compilation issues_

Submitter: Sunil Kumar Kori <skori@marvell.com>
Date: 2019-11-06 11:26:49
Reply_mail: 20191106112649.24484-1-skori@marvell.com
DPDK git baseline: Repo:dpdk-next-net-mrvl, CommitID: feba77e2fb797b4ddbe898b031aaf8d305f71c16

Makefile build Summary: 22 Builds Done, 0 Successful, 22 Failures

Meson build Summary: 7 Builds Done, 2 Successful, 5 Failures

               +==============================================+===========+==========+
               |                   Makefile                   |   Meson   | Document |
+--------------+------+-------+------+------------+-----------+-----------+----------+
| os           | gcc  | clang | icc  | gcc+shared | gcc+debug | gcc/clang | pdf/html |
+--------------+------+-------+------+------------+-----------+-----------+----------+
| RHEL76-64    | FAIL |       |      |            |           |           |          |
| CENTOS76-64  | FAIL | FAIL  | FAIL | FAIL       | FAIL      |           |          |
| UB1804-64    | FAIL | FAIL  | FAIL |            |           | FAIL      | pass     |
| UB1604-32    | FAIL |       |      |            |           | FAIL      |          |
| UB1904-64    | FAIL |       |      |            |           |           |          |
| UB1604-64    | FAIL | FAIL  |      |            |           |           |          |
| FC30-64      | FAIL | FAIL  |      |            |           | FAIL      |          |
| WIN10-64     |      |       |      |            |           | pass      |          |
| FreeBSD12-64 | FAIL | FAIL  |      | FAIL       | FAIL      | FAIL      |          |
| RHEL80-64    | FAIL |       |      |            |           |           |          |
| SUSE15-64    | FAIL | FAIL  |      |            |           | FAIL      |          |
+--------------+------+-------+------+------------+-----------+-----------+----------+

Test environment and configuration as below:

** Makefile build **


OS: RHEL76-64
	Kernel Version: 3.10.0-957.el7.x86_64
	CPU info: Intel(R) Xeon(R) CPU E5-2699 v4 @ 2.20GHz
	GCC Version: gcc (GCC) 4.8.5 20150623 (Red Hat 4.8.5-36)
	Clang Version: NA
	x86_64-native-linuxapp-gcc


OS: CENTOS76-64
	Kernel Version: 3.10.0-957.27.2.el7.x86_64
	CPU info: Intel(R) Xeon(R) CPU E5-2699 v4 @ 2.20GHz
	GCC Version: gcc (GCC) 4.8.5 20150623 (Red Hat 4.8.5-36)
	Clang Version: 3.4.2 (tags/RELEASE_34/dot2-final)
	x86_64-native-linuxapp-clang
	x86_64-native-linuxapp-gcc+debug
	x86_64-native-linuxapp-gcc+shared
	x86_64-native-linuxapp-gcc
	x86_64-native-linuxapp-icc


OS: UB1804-64
	Kernel Version: 4.15.0-20-generic
	CPU info: Intel(R) Xeon(R) CPU E5-2699 v3 @ 2.30GHz
	GCC Version: gcc (Ubuntu 7.3.0-27ubuntu1~18.04) 7.3.0
	Clang Version: 6.0.0-1ubuntu2 (tags/RELEASE_600/final)
	x86_64-native-linuxapp-icc
	x86_64-native-linuxapp-clang
	x86_64-native-linuxapp-gcc


OS: UB1904-64
	Kernel Version: 5.0.0-13-generic
	CPU info: Intel(R) Xeon(R) CPU E5-2699 v3 @ 2.30GHz
	GCC Version: gcc (Ubuntu 8.3.0-6ubuntu1) 8.3.0
	Clang Version: 8.0.0-3 (tags/RELEASE_800/final)
	x86_64-native-linuxapp-gcc


OS: UB1604-32
	Kernel Version: 4.4.0-131-generic
	CPU info: Intel(R) Xeon(R) CPU E5-2699 v3 @ 2.30GHz
	GCC Version: gcc (Ubuntu 5.4.0-6ubuntu1~16.04.11) 5.4.0 20160609
	Clang Version: 3.8.0-2ubuntu4 (tags/RELEASE_380/final)
	i686-native-linuxapp-gcc


OS: UB1604-64
	Kernel Version: 4.4.0-47-generic
	CPU info: Intel(R) Xeon(R) CPU E5-2699 v3 @ 2.30GHz
	GCC Version: gcc (Ubuntu 5.4.0-6ubuntu1~16.04.12) 5.4.0 20160609
	Clang Version: 3.8.0-2ubuntu4 (tags/RELEASE_380/final)
	x86_64-native-linuxapp-clang
	x86_64-native-linuxapp-gcc


OS: FC30-64
	Kernel Version: 5.1.7-300.fc30.x86_64
	CPU info: Intel(R) Xeon(R) CPU E5-2699 v4 @ 2.20GHz
	GCC Version: gcc (GCC) 9.1.1 20190503 (Red Hat 9.1.1-1)
	Clang Version: 8.0.0 (Fedora 8.0.0-1.fc30)
	x86_64-native-linuxapp-gcc
	x86_64-native-linuxapp-clang


OS: FreeBSD12-64
	Kernel Version: 12.0-RC3
	CPU info: Intel(R) Xeon(R) CPU E5-2699 v4 @ 2.20GHz (2194.98-MHz K8-class CPU)
	GCC Version: gcc (FreeBSD Ports Collection) 7.3.0
	Clang Version: 6.0.1 (tags/RELEASE_601/final 335540) (based on LLVM 6.0.1)
	x86_64-native-bsdapp-gcc+debug
	x86_64-native-bsdapp-gcc+shared
	x86_64-native-bsdapp-clang
	x86_64-native-bsdapp-gcc


OS: RHEL80-64
	Kernel Version: 4.18.0-80.el8.x86_64
	CPU info: Intel(R) Xeon(R) CPU E5-2699 v4 @ 2.20GHz
	GCC Version: gcc (GCC) 8.2.1 20180905 (Red Hat 8.2.1-3)
	Clang Version: 6.0.1 (tags/RELEASE_601/final)
	x86_64-native-linuxapp-gcc


OS: SUSE15-64
	Kernel Version: 4.12.14-lp150.11-default
	CPU info: Intel(R) Xeon(R) CPU E5-2699 v4 @ 2.20GHz
	GCC Version: gcc (SUSE Linux) 7.3.1 20180323 [gcc-7-branch revision 258812]
	Clang Version: 5.0.1 (tags/RELEASE_501/final 312548)
	x86_64-native-linuxapp-gcc
	x86_64-native-linuxapp-clang


** Meson build **


OS: UB1804-64
	Kernel Version: 4.15.0-20-generic
	CPU info: Intel(R) Xeon(R) CPU E5-2699 v4 @ 2.20GHz
	GCC Version: gcc (Ubuntu 7.3.0-27ubuntu1~18.04) 7.3.0
	Clang Version: 6.0.0-1ubuntu2 (tags/RELEASE_600/final)
	x86_64-native-linuxapp-doc
	build-gcc-static
	build-gcc-shared
	build-clang-static
	build-clang-shared
	build-x86-default


OS: UB1604-32
	Kernel Version: 4.4.0-131-generic
	CPU info: Intel(R) Xeon(R) CPU E5-2699 v4 @ 2.20GHz
	GCC Version: gcc (Ubuntu 5.4.0-6ubuntu1~16.04.11) 5.4.0 20160609
	Clang Version: 3.8.0-2ubuntu4 (tags/RELEASE_380/final)
	build-gcc-static
	build-gcc-shared
	build-clang-static
	build-clang-shared
	build-x86-default


OS: FC30-64
	Kernel Version: 5.0.9-301.fc30.x86_64
	CPU info: Intel(R) Xeon(R) CPU E5-2699 v4 @ 2.20GHz
	GCC Version: gcc (GCC) 9.1.1 20190503 (Red Hat 9.1.1-1)
	Clang Version: 8.0.0 (Fedora 8.0.0-1.fc30)
	build-gcc-static
	build-gcc-shared
	build-clang-static
	build-clang-shared
	build-x86-default


OS: WIN10-64
	Kernel Version: N/A
	CPU info: N/A
	GCC Version: N/A
	Clang Version: Clang 8.0.0
	x86_64-windows-clang


OS: FreeBSD12-64
	Kernel Version: 12.0-RC3
	CPU info: Intel(R) Xeon(R) CPU E5-2699 v4 @ 2.20GHz (2194.97-MHz K8-class CPU)
	GCC Version: gcc (FreeBSD Ports Collection) 7.3.0
	Clang Version: 6.0.1 (tags/RELEASE_601/final 335540) (based on LLVM 6.0.1)
	build-gcc-static
	build-gcc-shared
	build-clang-static
	build-clang-shared
	build-x86-default


OS: SUSE15-64
	Kernel Version: 4.12.14-lp150.11-default
	CPU info: Intel(R) Xeon(R) CPU E5-2699 v4 @ 2.20GHz
	GCC Version: gcc (SUSE Linux) 7.3.1 20180323 [gcc-7-branch revision 258812]
	Clang Version: 5.0.1 (tags/RELEASE_501/final 312548)
	build-gcc-static
	build-gcc-shared
	build-clang-static
	build-clang-shared
	build-x86-default


*Make Build Failed #1:
OS: UB1604-64
Target: x86_64-native-linuxapp-clang
                    ~~~~  ^
/tmp/UB1604-64_K4.4.0_Clang3.8.0/x86_64-native-linuxapp-clang/1ee16db4ac824c31b7ab3c798bf1b572/dpdk/drivers/net/octeontx2/otx2_ethdev_ops.c:311:20: error: no member named 'info' in 'struct rte_eth_burst_mode'
        rte_strscpy(mode->info, info, bytes + 1);
                    ~~~~  ^
2 errors generated.
/tmp/UB1604-64_K4.4.0_Clang3.8.0/x86_64-native-linuxapp-clang/1ee16db4ac824c31b7ab3c798bf1b572/dpdk/mk/internal/rte.compile-pre.mk:114: recipe for target 'otx2_ethdev_ops.o' failed
make[6]: *** [otx2_ethdev_ops.o] Error 1
make[6]: *** Waiting for unfinished jobs....
  CC ixgbe_ipsec.o
  PMDINFO otx2_ethdev.o.pmd.c
  CC otx2_ethdev.o.pmd.o
  LD otx2_ethdev.o
  CC sfc_ef10_rx.o
  CC sfc_ef10_essb_rx.o
  CC sfc_ef10_tx.o
  CC rte_eth_softnic_action.o
  CC rte_eth_softnic_pipeline.o
/tmp/UB1604-64_K4.4.0_Clang3.8.0/x86_64-native-linuxapp-clang/1ee16db4ac824c31b7ab3c798bf1b572/dpdk/mk/rte.subdir.mk:35: recipe for target 'octeontx2' failed
make[5]: *** [octeontx2] Error 2
make[5]: *** Waiting for unfinished jobs....
  CC rte_eth_softnic_thread.o
  CC rte_eth_softnic_cli.o
  CC rte_pmd_ixgbe.o
  CC efx_bootcfg.o
--
  CC hunt_nic.o
  CC medford_nic.o
  CC medford2_nic.o
  AR librte_pmd_sfc_efx.a
  INSTALL-LIB librte_pmd_sfc_efx.a
/tmp/UB1604-64_K4.4.0_Clang3.8.0/x86_64-native-linuxapp-clang/1ee16db4ac824c31b7ab3c798bf1b572/dpdk/mk/rte.subdir.mk:35: recipe for target 'net' failed
make[4]: *** [net] Error 2
/tmp/UB1604-64_K4.4.0_Clang3.8.0/x86_64-native-linuxapp-clang/1ee16db4ac824c31b7ab3c798bf1b572/dpdk/mk/rte.sdkbuild.mk:46: recipe for target 'drivers' failed
make[3]: *** [drivers] Error 2
/tmp/UB1604-64_K4.4.0_Clang3.8.0/x86_64-native-linuxapp-clang/1ee16db4ac824c31b7ab3c798bf1b572/dpdk/mk/rte.sdkroot.mk:98: recipe for target 'all' failed
make[2]: *** [all] Error 2
/tmp/UB1604-64_K4.4.0_Clang3.8.0/x86_64-native-linuxapp-clang/1ee16db4ac824c31b7ab3c798bf1b572/dpdk/mk/rte.sdkinstall.mk:60: recipe for target 'pre_install' failed
make[1]: *** [pre_install] Error 2
/tmp/UB1604-64_K4.4.0_Clang3.8.0/x86_64-native-linuxapp-clang/1ee16db4ac824c31b7ab3c798bf1b572/dpdk/mk/rte.sdkroot.mk:77: recipe for target 'install' failed
make: *** [install] Error 2


*Make Build Failed #2:
OS: UB1604-32
Target: i686-native-linuxapp-gcc
  rte_strscpy(mode->info, info, bytes + 1);
                  ^
/tmp/UB1604-32_K4.4.0_GCC5.4.0/i686-native-linuxapp-gcc/1ee16db4ac824c31b7ab3c798bf1b572/dpdk/drivers/net/octeontx2/otx2_ethdev_ops.c: At top level:
cc1: error: unrecognized command line option ‘-Wno-address-of-packed-member’ [-Werror]
cc1: all warnings being treated as errors
/tmp/UB1604-32_K4.4.0_GCC5.4.0/i686-native-linuxapp-gcc/1ee16db4ac824c31b7ab3c798bf1b572/dpdk/mk/internal/rte.compile-pre.mk:114: recipe for target 'otx2_ethdev_ops.o' failed
make[6]: *** [otx2_ethdev_ops.o] Error 1
make[6]: *** Waiting for unfinished jobs....
  CC ecore_init_fw_funcs.o
  CC ecore_spq.o
  CC bnxt_irq.o
  CC rte_eth_tap.o
  CC tap_flow.o
/tmp/UB1604-32_K4.4.0_GCC5.4.0/i686-native-linuxapp-gcc/1ee16db4ac824c31b7ab3c798bf1b572/dpdk/mk/rte.subdir.mk:35: recipe for target 'octeontx2' failed
make[5]: *** [octeontx2] Error 2
make[5]: *** Waiting for unfinished jobs....
  CC tap_netlink.o
  AR librte_pmd_nitrox.a
  CC ice_rxtx_vec_avx2.o
  INSTALL-LIB librte_pmd_nitrox.a
--
  PMDINFO qede_ethdev.o.pmd.c
  CC qede_ethdev.o.pmd.o
  LD qede_ethdev.o
  AR librte_pmd_qede.a
  INSTALL-LIB librte_pmd_qede.a
/tmp/UB1604-32_K4.4.0_GCC5.4.0/i686-native-linuxapp-gcc/1ee16db4ac824c31b7ab3c798bf1b572/dpdk/mk/rte.subdir.mk:35: recipe for target 'net' failed
make[4]: *** [net] Error 2
/tmp/UB1604-32_K4.4.0_GCC5.4.0/i686-native-linuxapp-gcc/1ee16db4ac824c31b7ab3c798bf1b572/dpdk/mk/rte.sdkbuild.mk:46: recipe for target 'drivers' failed
make[3]: *** [drivers] Error 2
/tmp/UB1604-32_K4.4.0_GCC5.4.0/i686-native-linuxapp-gcc/1ee16db4ac824c31b7ab3c798bf1b572/dpdk/mk/rte.sdkroot.mk:98: recipe for target 'all' failed
make[2]: *** [all] Error 2
/tmp/UB1604-32_K4.4.0_GCC5.4.0/i686-native-linuxapp-gcc/1ee16db4ac824c31b7ab3c798bf1b572/dpdk/mk/rte.sdkinstall.mk:60: recipe for target 'pre_install' failed
make[1]: *** [pre_install] Error 2
/tmp/UB1604-32_K4.4.0_GCC5.4.0/i686-native-linuxapp-gcc/1ee16db4ac824c31b7ab3c798bf1b572/dpdk/mk/rte.sdkroot.mk:77: recipe for target 'install' failed
make: *** [install] Error 2


*Make Build Failed #3:
OS: UB1904-64
Target: x86_64-native-linuxapp-gcc
  rte_strscpy(mode->info, info, bytes + 1);
                  ^~
/tmp/UB1904-64_K4.18.0_GCC8.3.0/x86_64-native-linuxapp-gcc/1ee16db4ac824c31b7ab3c798bf1b572/dpdk/drivers/net/octeontx2/otx2_ethdev_ops.c: At top level:
cc1: error: unrecognized command line option ‘-Wno-address-of-packed-member’ [-Werror]
cc1: all warnings being treated as errors
make[6]: *** [/tmp/UB1904-64_K4.18.0_GCC8.3.0/x86_64-native-linuxapp-gcc/1ee16db4ac824c31b7ab3c798bf1b572/dpdk/mk/internal/rte.compile-pre.mk:114: otx2_ethdev_ops.o] Error 1
make[6]: *** Waiting for unfinished jobs....
  CC tap_flow.o
== Build drivers/net/thunderx
  CC sfc_rx.o
  CC tap_netlink.o
  CC ecore_cxt.o
  CC sfc_tx.o
  CC sfc_tso.o
make[5]: *** [/tmp/UB1904-64_K4.18.0_GCC8.3.0/x86_64-native-linuxapp-gcc/1ee16db4ac824c31b7ab3c798bf1b572/dpdk/mk/rte.subdir.mk:37: octeontx2] Error 2
make[5]: *** Waiting for unfinished jobs....
  CC sfc_filter.o
  AR librte_pmd_bnxt.a
  INSTALL-LIB librte_pmd_bnxt.a
  CC sfc_flow.o
--
  CC hunt_nic.o
  CC medford_nic.o
  CC medford2_nic.o
  AR librte_pmd_sfc_efx.a
  INSTALL-LIB librte_pmd_sfc_efx.a
make[4]: *** [/tmp/UB1904-64_K4.18.0_GCC8.3.0/x86_64-native-linuxapp-gcc/1ee16db4ac824c31b7ab3c798bf1b572/dpdk/mk/rte.subdir.mk:35: net] Error 2
make[3]: *** [/tmp/UB1904-64_K4.18.0_GCC8.3.0/x86_64-native-linuxapp-gcc/1ee16db4ac824c31b7ab3c798bf1b572/dpdk/mk/rte.sdkbuild.mk:46: drivers] Error 2
make[2]: *** [/tmp/UB1904-64_K4.18.0_GCC8.3.0/x86_64-native-linuxapp-gcc/1ee16db4ac824c31b7ab3c798bf1b572/dpdk/mk/rte.sdkroot.mk:99: all] Error 2
make[1]: *** [/tmp/UB1904-64_K4.18.0_GCC8.3.0/x86_64-native-linuxapp-gcc/1ee16db4ac824c31b7ab3c798bf1b572/dpdk/mk/rte.sdkinstall.mk:61: pre_install] Error 2
make: *** [/tmp/UB1904-64_K4.18.0_GCC8.3.0/x86_64-native-linuxapp-gcc/1ee16db4ac824c31b7ab3c798bf1b572/dpdk/mk/rte.sdkroot.mk:77: install] Error 2


*Make Build Failed #4:
OS: UB1804-64
Target: x86_64-native-linuxapp-icc
/tmp/UB1804-64_K4.15.0_ICC19.0.0/x86_64-native-linuxapp-icc/1ee16db4ac824c31b7ab3c798bf1b572/dpdk/drivers/net/octeontx2/otx2_ethdev_ops.c(311): error: struct "rte_eth_burst_mode" has no field "info"
  	rte_strscpy(mode->info, info, bytes + 1);
  	                  ^

compilation aborted for /tmp/UB1804-64_K4.15.0_ICC19.0.0/x86_64-native-linuxapp-icc/1ee16db4ac824c31b7ab3c798bf1b572/dpdk/drivers/net/octeontx2/otx2_ethdev_ops.c (code 2)
/tmp/UB1804-64_K4.15.0_ICC19.0.0/x86_64-native-linuxapp-icc/1ee16db4ac824c31b7ab3c798bf1b572/dpdk/mk/internal/rte.compile-pre.mk:114: recipe for target 'otx2_ethdev_ops.o' failed
make[6]: *** [otx2_ethdev_ops.o] Error 2
make[6]: *** Waiting for unfinished jobs....
  CC virtio_pci.o
  CC ecore_mcp.o
  CC ecore_int.o
  AR librte_pmd_vdev_netvsc.a
--
  PMDINFO rte_eth_tap.o.pmd.c
  CC rte_eth_tap.o.pmd.o
  CC rte_eth_kni.o
  PMDINFO vmxnet3_ethdev.o.pmd.c
  CC vmxnet3_ethdev.o.pmd.o
/tmp/UB1804-64_K4.15.0_ICC19.0.0/x86_64-native-linuxapp-icc/1ee16db4ac824c31b7ab3c798bf1b572/dpdk/mk/rte.subdir.mk:35: recipe for target 'octeontx2' failed
make[5]: *** [octeontx2] Error 2
make[5]: *** Waiting for unfinished jobs....
  CC qede_ethdev.o
  LD rte_eth_tap.o
  CC tap_flow.o
  LD vmxnet3_ethdev.o
--
  LD virtio_user_ethdev.o
  AR librte_pmd_virtio.a
  INSTALL-LIB librte_pmd_virtio.a
  AR librte_pmd_softnic.a
  INSTALL-LIB librte_pmd_softnic.a
/tmp/UB1804-64_K4.15.0_ICC19.0.0/x86_64-native-linuxapp-icc/1ee16db4ac824c31b7ab3c798bf1b572/dpdk/mk/rte.subdir.mk:35: recipe for target 'net' failed
make[4]: *** [net] Error 2
/tmp/UB1804-64_K4.15.0_ICC19.0.0/x86_64-native-linuxapp-icc/1ee16db4ac824c31b7ab3c798bf1b572/dpdk/mk/rte.sdkbuild.mk:46: recipe for target 'drivers' failed
make[3]: *** [drivers] Error 2
/tmp/UB1804-64_K4.15.0_ICC19.0.0/x86_64-native-linuxapp-icc/1ee16db4ac824c31b7ab3c798bf1b572/dpdk/mk/rte.sdkroot.mk:98: recipe for target 'all' failed
make[2]: *** [all] Error 2
/tmp/UB1804-64_K4.15.0_ICC19.0.0/x86_64-native-linuxapp-icc/1ee16db4ac824c31b7ab3c798bf1b572/dpdk/mk/rte.sdkinstall.mk:60: recipe for target 'pre_install' failed
make[1]: *** [pre_install] Error 2
/tmp/UB1804-64_K4.15.0_ICC19.0.0/x86_64-native-linuxapp-icc/1ee16db4ac824c31b7ab3c798bf1b572/dpdk/mk/rte.sdkroot.mk:77: recipe for target 'install' failed
make: *** [install] Error 2


*Make Build Failed #5:
OS: UB1804-64
Target: x86_64-native-linuxapp-clang
                    ~~~~  ^
/tmp/UB1804-64_K4.15.0_Clang6.0.0/x86_64-native-linuxapp-clang/1ee16db4ac824c31b7ab3c798bf1b572/dpdk/drivers/net/octeontx2/otx2_ethdev_ops.c:311:20: error: no member named 'info' in 'struct rte_eth_burst_mode'
        rte_strscpy(mode->info, info, bytes + 1);
                    ~~~~  ^
2 errors generated.
/tmp/UB1804-64_K4.15.0_Clang6.0.0/x86_64-native-linuxapp-clang/1ee16db4ac824c31b7ab3c798bf1b572/dpdk/mk/internal/rte.compile-pre.mk:114: recipe for target 'otx2_ethdev_ops.o' failed
make[6]: *** [otx2_ethdev_ops.o] Error 1
/tmp/UB1804-64_K4.15.0_Clang6.0.0/x86_64-native-linuxapp-clang/1ee16db4ac824c31b7ab3c798bf1b572/dpdk/mk/rte.subdir.mk:35: recipe for target 'octeontx2' failed
make[5]: *** [octeontx2] Error 2
make[5]: *** Waiting for unfinished jobs....
  CC sfc_rx.o
  CC rte_eth_kni.o
  CC nicvf_bsvf.o
  CC sfc_tx.o
--
  CC hunt_nic.o
  CC medford_nic.o
  CC medford2_nic.o
  AR librte_pmd_sfc_efx.a
  INSTALL-LIB librte_pmd_sfc_efx.a
/tmp/UB1804-64_K4.15.0_Clang6.0.0/x86_64-native-linuxapp-clang/1ee16db4ac824c31b7ab3c798bf1b572/dpdk/mk/rte.subdir.mk:35: recipe for target 'net' failed
make[4]: *** [net] Error 2
/tmp/UB1804-64_K4.15.0_Clang6.0.0/x86_64-native-linuxapp-clang/1ee16db4ac824c31b7ab3c798bf1b572/dpdk/mk/rte.sdkbuild.mk:46: recipe for target 'drivers' failed
make[3]: *** [drivers] Error 2
/tmp/UB1804-64_K4.15.0_Clang6.0.0/x86_64-native-linuxapp-clang/1ee16db4ac824c31b7ab3c798bf1b572/dpdk/mk/rte.sdkroot.mk:98: recipe for target 'all' failed
make[2]: *** [all] Error 2
/tmp/UB1804-64_K4.15.0_Clang6.0.0/x86_64-native-linuxapp-clang/1ee16db4ac824c31b7ab3c798bf1b572/dpdk/mk/rte.sdkinstall.mk:60: recipe for target 'pre_install' failed
make[1]: *** [pre_install] Error 2
/tmp/UB1804-64_K4.15.0_Clang6.0.0/x86_64-native-linuxapp-clang/1ee16db4ac824c31b7ab3c798bf1b572/dpdk/mk/rte.sdkroot.mk:77: recipe for target 'install' failed
make: *** [install] Error 2


*Make Build Failed #6:
OS: SUSE15-64
Target: x86_64-native-linuxapp-gcc
  rte_strscpy(mode->info, info, bytes + 1);
                  ^~
/tmp/SUSE15-64_K4.12.14_GCC7.3.1/x86_64-native-linuxapp-gcc/1ee16db4ac824c31b7ab3c798bf1b572/dpdk/drivers/net/octeontx2/otx2_ethdev_ops.c: At top level:
cc1: error: unrecognized command line option ‘-Wno-address-of-packed-member’ [-Werror]
cc1: all warnings being treated as errors
make[6]: *** [/tmp/SUSE15-64_K4.12.14_GCC7.3.1/x86_64-native-linuxapp-gcc/1ee16db4ac824c31b7ab3c798bf1b572/dpdk/mk/internal/rte.compile-pre.mk:116: otx2_ethdev_ops.o] Error 1
make[5]: *** [/tmp/SUSE15-64_K4.12.14_GCC7.3.1/x86_64-native-linuxapp-gcc/1ee16db4ac824c31b7ab3c798bf1b572/dpdk/mk/rte.subdir.mk:35: octeontx2] Error 2
make[5]: *** Waiting for unfinished jobs....
  CC sfc_filter.o
  CC rte_pmd_bnxt.o
  CC nicvf_mbox.o
  CC ecore_vf.o
--
  CC hunt_nic.o
  CC medford_nic.o
  CC medford2_nic.o
  AR librte_pmd_sfc_efx.a
  INSTALL-LIB librte_pmd_sfc_efx.a
make[4]: *** [/tmp/SUSE15-64_K4.12.14_GCC7.3.1/x86_64-native-linuxapp-gcc/1ee16db4ac824c31b7ab3c798bf1b572/dpdk/mk/rte.subdir.mk:35: net] Error 2
make[3]: *** [/tmp/SUSE15-64_K4.12.14_GCC7.3.1/x86_64-native-linuxapp-gcc/1ee16db4ac824c31b7ab3c798bf1b572/dpdk/mk/rte.sdkbuild.mk:46: drivers] Error 2
make[2]: *** [/tmp/SUSE15-64_K4.12.14_GCC7.3.1/x86_64-native-linuxapp-gcc/1ee16db4ac824c31b7ab3c798bf1b572/dpdk/mk/rte.sdkroot.mk:99: all] Error 2
make[1]: *** [/tmp/SUSE15-64_K4.12.14_GCC7.3.1/x86_64-native-linuxapp-gcc/1ee16db4ac824c31b7ab3c798bf1b572/dpdk/mk/rte.sdkinstall.mk:61: pre_install] Error 2
make: *** [/tmp/SUSE15-64_K4.12.14_GCC7.3.1/x86_64-native-linuxapp-gcc/1ee16db4ac824c31b7ab3c798bf1b572/dpdk/mk/rte.sdkroot.mk:77: install] Error 2


*Make Build Failed #7:
OS: RHEL76-64
Target: x86_64-native-linuxapp-gcc
  rte_strscpy(mode->info, info, bytes + 1);
                  ^
/tmp/RHEL76-64_K3.10.0_GCC4.8.5/x86_64-native-linuxapp-gcc/1ee16db4ac824c31b7ab3c798bf1b572/dpdk/drivers/net/octeontx2/otx2_ethdev_ops.c: At top level:
cc1: error: unrecognized command line option "-Wno-address-of-packed-member" [-Werror]
cc1: all warnings being treated as errors
make[6]: *** [otx2_ethdev_ops.o] Error 1
make[6]: *** Waiting for unfinished jobs....
  CC ice_generic_flow.o
  AR librte_pmd_vdev_netvsc.a
  INSTALL-LIB librte_pmd_vdev_netvsc.a
  PMDINFO rte_eth_tap.o.pmd.c
== Build drivers/net/softnic
  CC rte_eth_tap.o.pmd.o
  LD rte_eth_tap.o
make[5]: *** [octeontx2] Error 2
make[5]: *** Waiting for unfinished jobs....
  CC tap_flow.o
  CC sfc_filter.o
  CC tap_netlink.o
  CC sfc_flow.o
--
  INSTALL-LIB librte_pmd_sfc_efx.a
  AR librte_pmd_softnic.a
  INSTALL-LIB librte_pmd_softnic.a
  AR librte_pmd_qede.a
  INSTALL-LIB librte_pmd_qede.a
make[4]: *** [net] Error 2
make[3]: *** [drivers] Error 2
make[2]: *** [all] Error 2
make[1]: *** [pre_install] Error 2
make: *** [install] Error 2


*Make Build Failed #8:
OS: FC30-64
Target: x86_64-native-linuxapp-gcc
      |                  ^~
/tmp/FC30-64_K4.20_GCC9.1.1/x86_64-native-linuxapp-gcc/1ee16db4ac824c31b7ab3c798bf1b572/dpdk/drivers/net/octeontx2/otx2_ethdev_ops.c: In function ‘otx2_tx_burst_mode_get’:
/tmp/FC30-64_K4.20_GCC9.1.1/x86_64-native-linuxapp-gcc/1ee16db4ac824c31b7ab3c798bf1b572/dpdk/drivers/net/octeontx2/otx2_ethdev_ops.c:311:18: error: ‘struct rte_eth_burst_mode’ has no member named ‘info’
  311 |  rte_strscpy(mode->info, info, bytes + 1);
      |                  ^~
make[6]: *** [/tmp/FC30-64_K4.20_GCC9.1.1/x86_64-native-linuxapp-gcc/1ee16db4ac824c31b7ab3c798bf1b572/dpdk/mk/internal/rte.compile-pre.mk:114: otx2_ethdev_ops.o] Error 1
make[6]: *** Waiting for unfinished jobs....
  CC otx2_ethdev_debug.o
  CC ecore_sriov.o
  CC virtio_rxtx.o
== Build drivers/net/vmxnet3
  CC sfc_tx.o
== Build drivers/net/kni
  CC virtio_ethdev.o
== Build drivers/net/softnic
  CC ecore_vf.o
make[5]: *** [/tmp/FC30-64_K4.20_GCC9.1.1/x86_64-native-linuxapp-gcc/1ee16db4ac824c31b7ab3c798bf1b572/dpdk/mk/rte.subdir.mk:37: octeontx2] Error 2
make[5]: *** Waiting for unfinished jobs....
  CC qede_ethdev.o
  CC sfc_tso.o
  CC rte_eth_kni.o
  CC vmxnet3_rxtx.o
--
  CC hunt_nic.o
  CC medford_nic.o
  CC medford2_nic.o
  AR librte_pmd_sfc_efx.a
  INSTALL-LIB librte_pmd_sfc_efx.a
make[4]: *** [/tmp/FC30-64_K4.20_GCC9.1.1/x86_64-native-linuxapp-gcc/1ee16db4ac824c31b7ab3c798bf1b572/dpdk/mk/rte.subdir.mk:35: net] Error 2
make[3]: *** [/tmp/FC30-64_K4.20_GCC9.1.1/x86_64-native-linuxapp-gcc/1ee16db4ac824c31b7ab3c798bf1b572/dpdk/mk/rte.sdkbuild.mk:46: drivers] Error 2
make[2]: *** [/tmp/FC30-64_K4.20_GCC9.1.1/x86_64-native-linuxapp-gcc/1ee16db4ac824c31b7ab3c798bf1b572/dpdk/mk/rte.sdkroot.mk:99: all] Error 2
make[1]: *** [/tmp/FC30-64_K4.20_GCC9.1.1/x86_64-native-linuxapp-gcc/1ee16db4ac824c31b7ab3c798bf1b572/dpdk/mk/rte.sdkinstall.mk:61: pre_install] Error 2
make: *** [/tmp/FC30-64_K4.20_GCC9.1.1/x86_64-native-linuxapp-gcc/1ee16db4ac824c31b7ab3c798bf1b572/dpdk/mk/rte.sdkroot.mk:77: install] Error 2


*Make Build Failed #9:
OS: RHEL80-64
Target: x86_64-native-linuxapp-gcc
  rte_strscpy(mode->info, info, bytes + 1);
                  ^~
/tmp/RHEL80-64_K3.10.0_GCC8.2.1/x86_64-native-linuxapp-gcc/1ee16db4ac824c31b7ab3c798bf1b572/dpdk/drivers/net/octeontx2/otx2_ethdev_ops.c: At top level:
cc1: error: unrecognized command line option ‘-Wno-address-of-packed-member’ [-Werror]
cc1: all warnings being treated as errors
make[6]: *** [/tmp/RHEL80-64_K3.10.0_GCC8.2.1/x86_64-native-linuxapp-gcc/1ee16db4ac824c31b7ab3c798bf1b572/dpdk/mk/internal/rte.compile-pre.mk:114: otx2_ethdev_ops.o] Error 1
make[5]: *** [/tmp/RHEL80-64_K3.10.0_GCC8.2.1/x86_64-native-linuxapp-gcc/1ee16db4ac824c31b7ab3c798bf1b572/dpdk/mk/rte.subdir.mk:35: octeontx2] Error 2
make[5]: *** Waiting for unfinished jobs....
  CC ecore_vf.o
  CC sfc_dp.o
  CC sfc_ef10_rx.o
  CC qede_ethdev.o
--
  CC hunt_nic.o
  CC medford_nic.o
  CC medford2_nic.o
  AR librte_pmd_sfc_efx.a
  INSTALL-LIB librte_pmd_sfc_efx.a
make[4]: *** [/tmp/RHEL80-64_K3.10.0_GCC8.2.1/x86_64-native-linuxapp-gcc/1ee16db4ac824c31b7ab3c798bf1b572/dpdk/mk/rte.subdir.mk:35: net] Error 2
make[3]: *** [/tmp/RHEL80-64_K3.10.0_GCC8.2.1/x86_64-native-linuxapp-gcc/1ee16db4ac824c31b7ab3c798bf1b572/dpdk/mk/rte.sdkbuild.mk:46: drivers] Error 2
make[2]: *** [/tmp/RHEL80-64_K3.10.0_GCC8.2.1/x86_64-native-linuxapp-gcc/1ee16db4ac824c31b7ab3c798bf1b572/dpdk/mk/rte.sdkroot.mk:99: all] Error 2
make[1]: *** [/tmp/RHEL80-64_K3.10.0_GCC8.2.1/x86_64-native-linuxapp-gcc/1ee16db4ac824c31b7ab3c798bf1b572/dpdk/mk/rte.sdkinstall.mk:61: pre_install] Error 2
make: *** [/tmp/RHEL80-64_K3.10.0_GCC8.2.1/x86_64-native-linuxapp-gcc/1ee16db4ac824c31b7ab3c798bf1b572/dpdk/mk/rte.sdkroot.mk:77: install] Error 2


*Make Build Failed #10:
OS: SUSE15-64
Target: x86_64-native-linuxapp-clang
                    ~~~~  ^
/tmp/SUSE15-64_K4.12.14_Clang5.0.1/x86_64-native-linuxapp-clang/1ee16db4ac824c31b7ab3c798bf1b572/dpdk/drivers/net/octeontx2/otx2_ethdev_ops.c:311:20: error: no member named 'info' in 'struct rte_eth_burst_mode'
        rte_strscpy(mode->info, info, bytes + 1);
                    ~~~~  ^
2 errors generated.
make[6]: *** [/tmp/SUSE15-64_K4.12.14_Clang5.0.1/x86_64-native-linuxapp-clang/1ee16db4ac824c31b7ab3c798bf1b572/dpdk/mk/internal/rte.compile-pre.mk:114: otx2_ethdev_ops.o] Error 1
make[5]: *** [/tmp/SUSE15-64_K4.12.14_Clang5.0.1/x86_64-native-linuxapp-clang/1ee16db4ac824c31b7ab3c798bf1b572/dpdk/mk/rte.subdir.mk:35: octeontx2] Error 2
make[5]: *** Waiting for unfinished jobs....
  CC ifcvf_vdpa.o
  CC ifcvf.o
  LD virtio_user_ethdev.o
  CC efx_nvram.o
--
  CC hunt_nic.o
  CC medford_nic.o
  CC medford2_nic.o
  AR librte_pmd_sfc_efx.a
  INSTALL-LIB librte_pmd_sfc_efx.a
make[4]: *** [/tmp/SUSE15-64_K4.12.14_Clang5.0.1/x86_64-native-linuxapp-clang/1ee16db4ac824c31b7ab3c798bf1b572/dpdk/mk/rte.subdir.mk:35: net] Error 2
make[3]: *** [/tmp/SUSE15-64_K4.12.14_Clang5.0.1/x86_64-native-linuxapp-clang/1ee16db4ac824c31b7ab3c798bf1b572/dpdk/mk/rte.sdkbuild.mk:46: drivers] Error 2
make[2]: *** [/tmp/SUSE15-64_K4.12.14_Clang5.0.1/x86_64-native-linuxapp-clang/1ee16db4ac824c31b7ab3c798bf1b572/dpdk/mk/rte.sdkroot.mk:99: all] Error 2
make[1]: *** [/tmp/SUSE15-64_K4.12.14_Clang5.0.1/x86_64-native-linuxapp-clang/1ee16db4ac824c31b7ab3c798bf1b572/dpdk/mk/rte.sdkinstall.mk:61: pre_install] Error 2
make: *** [/tmp/SUSE15-64_K4.12.14_Clang5.0.1/x86_64-native-linuxapp-clang/1ee16db4ac824c31b7ab3c798bf1b572/dpdk/mk/rte.sdkroot.mk:77: install] Error 2


*Make Build Failed #11:
OS: FC30-64
Target: x86_64-native-linuxapp-clang
                    ~~~~  ^
/tmp/FC30-64_K4.20_Clang8.0.0/x86_64-native-linuxapp-clang/1ee16db4ac824c31b7ab3c798bf1b572/dpdk/drivers/net/octeontx2/otx2_ethdev_ops.c:311:20: error: no member named 'info' in 'struct rte_eth_burst_mode'
        rte_strscpy(mode->info, info, bytes + 1);
                    ~~~~  ^
2 errors generated.
make[6]: *** [/tmp/FC30-64_K4.20_Clang8.0.0/x86_64-native-linuxapp-clang/1ee16db4ac824c31b7ab3c798bf1b572/dpdk/mk/internal/rte.compile-pre.mk:116: otx2_ethdev_ops.o] Error 1
make[6]: *** Waiting for unfinished jobs....
  AR librte_pmd_i40e.a
  CC ecore_dcbx.o
  INSTALL-LIB librte_pmd_i40e.a
== Build drivers/net/kni
--
  LD rte_eth_kni.o
  CC bcm_osal.o
  LD rte_eth_softnic.o
  AR librte_pmd_kni.a
  INSTALL-LIB librte_pmd_kni.a
make[5]: *** [/tmp/FC30-64_K4.20_Clang8.0.0/x86_64-native-linuxapp-clang/1ee16db4ac824c31b7ab3c798bf1b572/dpdk/mk/rte.subdir.mk:35: octeontx2] Error 2
make[5]: *** Waiting for unfinished jobs....
== Build drivers/net/vhost
  CC sfc_tso.o
  CC rte_eth_softnic_tm.o
  CC sfc_filter.o
--
  CC hunt_nic.o
  CC medford_nic.o
  CC medford2_nic.o
  AR librte_pmd_sfc_efx.a
  INSTALL-LIB librte_pmd_sfc_efx.a
make[4]: *** [/tmp/FC30-64_K4.20_Clang8.0.0/x86_64-native-linuxapp-clang/1ee16db4ac824c31b7ab3c798bf1b572/dpdk/mk/rte.subdir.mk:35: net] Error 2
make[3]: *** [/tmp/FC30-64_K4.20_Clang8.0.0/x86_64-native-linuxapp-clang/1ee16db4ac824c31b7ab3c798bf1b572/dpdk/mk/rte.sdkbuild.mk:46: drivers] Error 2
make[2]: *** [/tmp/FC30-64_K4.20_Clang8.0.0/x86_64-native-linuxapp-clang/1ee16db4ac824c31b7ab3c798bf1b572/dpdk/mk/rte.sdkroot.mk:99: all] Error 2
make[1]: *** [/tmp/FC30-64_K4.20_Clang8.0.0/x86_64-native-linuxapp-clang/1ee16db4ac824c31b7ab3c798bf1b572/dpdk/mk/rte.sdkinstall.mk:61: pre_install] Error 2
make: *** [/tmp/FC30-64_K4.20_Clang8.0.0/x86_64-native-linuxapp-clang/1ee16db4ac824c31b7ab3c798bf1b572/dpdk/mk/rte.sdkroot.mk:77: install] Error 2


*Make Build Failed #12:
OS: UB1604-64
Target: x86_64-native-linuxapp-gcc
  rte_strscpy(mode->info, info, bytes + 1);
                  ^
/tmp/UB1604-64_K4.4.0_GCC5.4.0/x86_64-native-linuxapp-gcc/1ee16db4ac824c31b7ab3c798bf1b572/dpdk/drivers/net/octeontx2/otx2_ethdev_ops.c: At top level:
cc1: error: unrecognized command line option ‘-Wno-address-of-packed-member’ [-Werror]
cc1: all warnings being treated as errors
/tmp/UB1604-64_K4.4.0_GCC5.4.0/x86_64-native-linuxapp-gcc/1ee16db4ac824c31b7ab3c798bf1b572/dpdk/mk/internal/rte.compile-pre.mk:114: recipe for target 'otx2_ethdev_ops.o' failed
make[6]: *** [otx2_ethdev_ops.o] Error 1
make[6]: *** Waiting for unfinished jobs....
  CC sfc_filter.o
/tmp/UB1604-64_K4.4.0_GCC5.4.0/x86_64-native-linuxapp-gcc/1ee16db4ac824c31b7ab3c798bf1b572/dpdk/mk/rte.subdir.mk:35: recipe for target 'octeontx2' failed
make[5]: *** [octeontx2] Error 2
make[5]: *** Waiting for unfinished jobs....
  CC ecore_sriov.o
  CC ecore_vf.o
  CC sfc_flow.o
  CC qede_ethdev.o
--
  CC hunt_nic.o
  CC medford_nic.o
  CC medford2_nic.o
  AR librte_pmd_sfc_efx.a
  INSTALL-LIB librte_pmd_sfc_efx.a
/tmp/UB1604-64_K4.4.0_GCC5.4.0/x86_64-native-linuxapp-gcc/1ee16db4ac824c31b7ab3c798bf1b572/dpdk/mk/rte.subdir.mk:35: recipe for target 'net' failed
make[4]: *** [net] Error 2
/tmp/UB1604-64_K4.4.0_GCC5.4.0/x86_64-native-linuxapp-gcc/1ee16db4ac824c31b7ab3c798bf1b572/dpdk/mk/rte.sdkbuild.mk:46: recipe for target 'drivers' failed
make[3]: *** [drivers] Error 2
/tmp/UB1604-64_K4.4.0_GCC5.4.0/x86_64-native-linuxapp-gcc/1ee16db4ac824c31b7ab3c798bf1b572/dpdk/mk/rte.sdkroot.mk:98: recipe for target 'all' failed
make[2]: *** [all] Error 2
/tmp/UB1604-64_K4.4.0_GCC5.4.0/x86_64-native-linuxapp-gcc/1ee16db4ac824c31b7ab3c798bf1b572/dpdk/mk/rte.sdkinstall.mk:60: recipe for target 'pre_install' failed
make[1]: *** [pre_install] Error 2
/tmp/UB1604-64_K4.4.0_GCC5.4.0/x86_64-native-linuxapp-gcc/1ee16db4ac824c31b7ab3c798bf1b572/dpdk/mk/rte.sdkroot.mk:77: recipe for target 'install' failed
make: *** [install] Error 2


*Make Build Failed #13:
OS: UB1804-64
Target: x86_64-native-linuxapp-gcc
  rte_strscpy(mode->info, info, bytes + 1);
                  ^~
/tmp/UB1804-64_K4.15.0_GCC7.3.0/x86_64-native-linuxapp-gcc/1ee16db4ac824c31b7ab3c798bf1b572/dpdk/drivers/net/octeontx2/otx2_ethdev_ops.c: At top level:
cc1: error: unrecognized command line option ‘-Wno-address-of-packed-member’ [-Werror]
cc1: all warnings being treated as errors
/tmp/UB1804-64_K4.15.0_GCC7.3.0/x86_64-native-linuxapp-gcc/1ee16db4ac824c31b7ab3c798bf1b572/dpdk/mk/internal/rte.compile-pre.mk:114: recipe for target 'otx2_ethdev_ops.o' failed
make[6]: *** [otx2_ethdev_ops.o] Error 1
make[6]: *** Waiting for unfinished jobs....
  CC nicvf_hw.o
  CC nicvf_mbox.o
/tmp/UB1804-64_K4.15.0_GCC7.3.0/x86_64-native-linuxapp-gcc/1ee16db4ac824c31b7ab3c798bf1b572/dpdk/mk/rte.subdir.mk:35: recipe for target 'octeontx2' failed
make[5]: *** [octeontx2] Error 2
make[5]: *** Waiting for unfinished jobs....
  CC nicvf_ethdev.o
  PMDINFO rte_eth_ring.o.pmd.c
  CC rte_eth_ring.o.pmd.o
  LD rte_eth_ring.o
--
  CC hunt_nic.o
  CC medford_nic.o
  CC medford2_nic.o
  AR librte_pmd_sfc_efx.a
  INSTALL-LIB librte_pmd_sfc_efx.a
/tmp/UB1804-64_K4.15.0_GCC7.3.0/x86_64-native-linuxapp-gcc/1ee16db4ac824c31b7ab3c798bf1b572/dpdk/mk/rte.subdir.mk:35: recipe for target 'net' failed
make[4]: *** [net] Error 2
/tmp/UB1804-64_K4.15.0_GCC7.3.0/x86_64-native-linuxapp-gcc/1ee16db4ac824c31b7ab3c798bf1b572/dpdk/mk/rte.sdkbuild.mk:46: recipe for target 'drivers' failed
make[3]: *** [drivers] Error 2
/tmp/UB1804-64_K4.15.0_GCC7.3.0/x86_64-native-linuxapp-gcc/1ee16db4ac824c31b7ab3c798bf1b572/dpdk/mk/rte.sdkroot.mk:98: recipe for target 'all' failed
make[2]: *** [all] Error 2
/tmp/UB1804-64_K4.15.0_GCC7.3.0/x86_64-native-linuxapp-gcc/1ee16db4ac824c31b7ab3c798bf1b572/dpdk/mk/rte.sdkinstall.mk:60: recipe for target 'pre_install' failed
make[1]: *** [pre_install] Error 2
/tmp/UB1804-64_K4.15.0_GCC7.3.0/x86_64-native-linuxapp-gcc/1ee16db4ac824c31b7ab3c798bf1b572/dpdk/mk/rte.sdkroot.mk:77: recipe for target 'install' failed
make: *** [install] Error 2


*Make Build Failed #14:
OS: CENTOS76-64
Target: x86_64-native-linuxapp-clang
                        ^
  PMDINFO null_crypto_pmd.o.pmd.c
  CC null_crypto_pmd.o.pmd.o
  LD null_crypto_pmd.o
1 error generated.
make[6]: *** [dpaa2_sec_dpseci.o] Error 1
make[5]: *** [dpaa2_sec] Error 2
make[5]: *** Waiting for unfinished jobs....
  CC rte_eth_bond_args.o
  CC rte_cryptodev_scheduler.o
  CC cxgbevf_ethdev.o
  CC axgbe_rxtx.o
--
  CC dpaa_ethdev.o.pmd.o
  LD dpaa_ethdev.o
  AR librte_pmd_octeontx_crypto.a
  INSTALL-LIB librte_pmd_octeontx_crypto.a
  CC e1000_82540.o
make[4]: *** [crypto] Error 2
make[4]: *** Waiting for unfinished jobs....
  CC e1000_82541.o
  CC dpaa2_rxtx.o
== Build drivers/net/ena
== Build drivers/net/enetc
--
                    ~~~~  ^
/tmp/CENTOS76-64_K3.10.0_Clang3.4.2/x86_64-native-linuxapp-clang/1ee16db4ac824c31b7ab3c798bf1b572/dpdk/drivers/net/octeontx2/otx2_ethdev_ops.c:311:20: error: no member named 'info' in 'struct rte_eth_burst_mode'
        rte_strscpy(mode->info, info, bytes + 1);
                    ~~~~  ^
2 errors generated.
make[6]: *** [otx2_ethdev_ops.o] Error 1
make[6]: *** Waiting for unfinished jobs....
  LD nicvf_ethdev.o
  CC ecore_int.o
  CC tap_intr.o
  CC ecore_dcbx.o
  CC nicvf_bsvf.o
  CC virtqueue.o
  CC sfc_rx.o
  CC sfc_tx.o
make[5]: *** [octeontx2] Error 2
make[5]: *** Waiting for unfinished jobs....
  CC bnxt_vnic.o
  AR librte_pmd_tap.a
  CC nicvf_svf.o
  INSTALL-LIB librte_pmd_tap.a
--
  CC hunt_nic.o
  CC medford_nic.o
  CC medford2_nic.o
  AR librte_pmd_sfc_efx.a
  INSTALL-LIB librte_pmd_sfc_efx.a
make[4]: *** [net] Error 2
make[3]: *** [drivers] Error 2
make[2]: *** [all] Error 2
make[1]: *** [pre_install] Error 2
make: *** [install] Error 2


*Make Build Failed #15:
OS: CENTOS76-64
Target: x86_64-native-linuxapp-gcc+debug
                  ^
/tmp/CENTOS76-64_K3.10.0_GCC4.8.5/x86_64-native-linuxapp-gcc+debug/1ee16db4ac824c31b7ab3c798bf1b572/dpdk/drivers/net/octeontx2/otx2_ethdev_ops.c: At top level:
cc1: error: unrecognized command line option "-Wno-address-of-packed-member" [-Werror]
cc1: all warnings being treated as errors
  CC otx2_ethdev_debug.o
make[6]: *** [otx2_ethdev_ops.o] Error 1
make[6]: *** Waiting for unfinished jobs....
  CC rte_eth_softnic_mempool.o
  CC virtio_ethdev.o
  CC efx_ev.o
  PMDINFO rte_eth_softnic.o.pmd.c
--
  LD rte_eth_vhost.o
  CC efx_intr.o
  AR librte_pmd_vhost.a
  CC efx_lic.o
  CC rte_eth_softnic_tm.o
make[5]: *** [octeontx2] Error 2
make[5]: *** Waiting for unfinished jobs....
  CC ifcvf.o
  INSTALL-LIB librte_pmd_vhost.a
  CC efx_mac.o
  CC virtio_rxtx_simple.o
--
  CC medford2_nic.o
  AR librte_pmd_sfc_efx.a
  INSTALL-LIB librte_pmd_sfc_efx.a
  AR librte_pmd_softnic.a
  INSTALL-LIB librte_pmd_softnic.a
make[4]: *** [net] Error 2
make[3]: *** [drivers] Error 2
make[2]: *** [all] Error 2
make[1]: *** [pre_install] Error 2
make: *** [install] Error 2


*Make Build Failed #16:
OS: CENTOS76-64
Target: x86_64-native-linuxapp-gcc+shared
  rte_strscpy(mode->info, info, bytes + 1);
                  ^
/tmp/CENTOS76-64_K3.10.0_GCC4.8.5/x86_64-native-linuxapp-gcc+shared/1ee16db4ac824c31b7ab3c798bf1b572/dpdk/drivers/net/octeontx2/otx2_ethdev_ops.c: At top level:
cc1: error: unrecognized command line option "-Wno-address-of-packed-member" [-Werror]
cc1: all warnings being treated as errors
make[6]: *** [otx2_ethdev_ops.o] Error 1
make[6]: *** Waiting for unfinished jobs....
  CC ixgbe_tm.o
  CC virtio_ethdev.o
  PMDINFO otx2_ethdev.o.pmd.c
  CC otx2_ethdev.o.pmd.o
  CC rte_eth_softnic_tap.o
  LD otx2_ethdev.o
  CC rte_eth_softnic_action.o
  CC qede_ethdev.o
  CC ixgbe_vf_representor.o
make[5]: *** [octeontx2] Error 2
make[5]: *** Waiting for unfinished jobs....
  CC qede_main.o
  CC efx_bootcfg.o
  CC rte_eth_softnic_pipeline.o
  CC efx_crc32.o
--
  CC hunt_nic.o
  CC medford_nic.o
  CC medford2_nic.o
  LD librte_pmd_sfc_efx.so.1.1
  INSTALL-LIB librte_pmd_sfc_efx.so.1.1
make[4]: *** [net] Error 2
make[3]: *** [drivers] Error 2
make[2]: *** [all] Error 2
make[1]: *** [pre_install] Error 2
make: *** [install] Error 2


*Make Build Failed #17:
OS: CENTOS76-64
Target: x86_64-native-linuxapp-gcc
  rte_strscpy(mode->info, info, bytes + 1);
                  ^
/tmp/CENTOS76-64_K3.10.0_GCC4.8.5/x86_64-native-linuxapp-gcc/1ee16db4ac824c31b7ab3c798bf1b572/dpdk/drivers/net/octeontx2/otx2_ethdev_ops.c: At top level:
cc1: error: unrecognized command line option "-Wno-address-of-packed-member" [-Werror]
cc1: all warnings being treated as errors
make[6]: *** [otx2_ethdev_ops.o] Error 1
make[6]: *** Waiting for unfinished jobs....
  CC conn.o
  CC ef10_nic.o
  CC ef10_nvram.o
  CC ef10_phy.o
  CC ef10_proxy.o
  CC ef10_rx.o
  AR librte_pmd_softnic.a
  CC ef10_tx.o
  INSTALL-LIB librte_pmd_softnic.a
make[5]: *** [octeontx2] Error 2
make[5]: *** Waiting for unfinished jobs....
  CC ef10_vpd.o
  CC hunt_nic.o
  CC medford_nic.o
  CC medford2_nic.o
  AR librte_pmd_sfc_efx.a
  INSTALL-LIB librte_pmd_sfc_efx.a
  AR librte_pmd_qede.a
  INSTALL-LIB librte_pmd_qede.a
make[4]: *** [net] Error 2
make[3]: *** [drivers] Error 2
make[2]: *** [all] Error 2
make[1]: *** [pre_install] Error 2
make: *** [install] Error 2


*Make Build Failed #18:
OS: FreeBSD12-64
Target: x86_64-native-bsdapp-gcc+debug
  rte_strscpy(mode->info, info, bytes + 1);
                  ^~
/tmp/FreeBSD12-64_K19.02_GCC7.3.0/x86_64-native-bsdapp-gcc+debug/1ee16db4ac824c31b7ab3c798bf1b572/dpdk/drivers/net/octeontx2/otx2_ethdev_ops.c: At top level:
cc1: error: unrecognized command line option '-Wno-address-of-packed-member' [-Werror]
cc1: all warnings being treated as errors
gmake[6]: *** [/tmp/FreeBSD12-64_K19.02_GCC7.3.0/x86_64-native-bsdapp-gcc+debug/1ee16db4ac824c31b7ab3c798bf1b572/dpdk/mk/internal/rte.compile-pre.mk:114: otx2_ethdev_ops.o] Error 1
gmake[6]: *** Waiting for unfinished jobs....
  CC efx_hash.o
  CC qede_main.o
  CC efx_intr.o
gmake[5]: *** [/tmp/FreeBSD12-64_K19.02_GCC7.3.0/x86_64-native-bsdapp-gcc+debug/1ee16db4ac824c31b7ab3c798bf1b572/dpdk/mk/rte.subdir.mk:35: octeontx2] Error 2
gmake[5]: *** Waiting for unfinished jobs....
  CC qede_rxtx.o
  CC efx_lic.o
  CC efx_mac.o
  CC qede_filter.o
--
  CC hunt_nic.o
  CC medford_nic.o
  CC medford2_nic.o
  AR librte_pmd_sfc_efx.a
  INSTALL-LIB librte_pmd_sfc_efx.a
gmake[4]: *** [/tmp/FreeBSD12-64_K19.02_GCC7.3.0/x86_64-native-bsdapp-gcc+debug/1ee16db4ac824c31b7ab3c798bf1b572/dpdk/mk/rte.subdir.mk:35: net] Error 2
gmake[3]: *** [/tmp/FreeBSD12-64_K19.02_GCC7.3.0/x86_64-native-bsdapp-gcc+debug/1ee16db4ac824c31b7ab3c798bf1b572/dpdk/mk/rte.sdkbuild.mk:46: drivers] Error 2
gmake[2]: *** [/tmp/FreeBSD12-64_K19.02_GCC7.3.0/x86_64-native-bsdapp-gcc+debug/1ee16db4ac824c31b7ab3c798bf1b572/dpdk/mk/rte.sdkroot.mk:99: all] Error 2
gmake[1]: *** [/tmp/FreeBSD12-64_K19.02_GCC7.3.0/x86_64-native-bsdapp-gcc+debug/1ee16db4ac824c31b7ab3c798bf1b572/dpdk/mk/rte.sdkinstall.mk:61: pre_install] Error 2
gmake: *** [/tmp/FreeBSD12-64_K19.02_GCC7.3.0/x86_64-native-bsdapp-gcc+debug/1ee16db4ac824c31b7ab3c798bf1b572/dpdk/mk/rte.sdkroot.mk:77: install] Error 2


*Make Build Failed #19:
OS: CENTOS76-64
Target: x86_64-native-linuxapp-icc
  	rte_strscpy(mode->info, info, bytes + 1);
  	                  ^

compilation aborted for /tmp/CENTOS76-64_K3.10.0_ICC19.0.0/x86_64-native-linuxapp-icc/1ee16db4ac824c31b7ab3c798bf1b572/dpdk/drivers/net/octeontx2/otx2_ethdev_ops.c (code 2)
  INSTALL-LIB librte_pmd_ifc.a
make[6]: *** [otx2_ethdev_ops.o] Error 2
make[6]: *** Waiting for unfinished jobs....
  CC rte_eth_softnic_meter.o
  CC rte_eth_softnic_cryptodev.o
  CC parser.o
  CC conn.o
make[5]: *** [octeontx2] Error 2
make[5]: *** Waiting for unfinished jobs....
  AR librte_pmd_qede.a
  AR librte_pmd_softnic.a
  INSTALL-LIB librte_pmd_qede.a
  INSTALL-LIB librte_pmd_softnic.a
make[4]: *** [net] Error 2
make[3]: *** [drivers] Error 2
make[2]: *** [all] Error 2
make[1]: *** [pre_install] Error 2
make: *** [install] Error 2


*Make Build Failed #20:
OS: FreeBSD12-64
Target: x86_64-native-bsdapp-gcc+shared
  rte_strscpy(mode->info, info, bytes + 1);
                  ^~
/tmp/FreeBSD12-64_K19.02_GCC7.3.0/x86_64-native-bsdapp-gcc+shared/1ee16db4ac824c31b7ab3c798bf1b572/dpdk/drivers/net/octeontx2/otx2_ethdev_ops.c: At top level:
cc1: error: unrecognized command line option '-Wno-address-of-packed-member' [-Werror]
cc1: all warnings being treated as errors
gmake[6]: *** [/tmp/FreeBSD12-64_K19.02_GCC7.3.0/x86_64-native-bsdapp-gcc+shared/1ee16db4ac824c31b7ab3c798bf1b572/dpdk/mk/internal/rte.compile-pre.mk:114: otx2_ethdev_ops.o] Error 1
gmake[6]: *** Waiting for unfinished jobs....
gmake[5]: *** [/tmp/FreeBSD12-64_K19.02_GCC7.3.0/x86_64-native-bsdapp-gcc+shared/1ee16db4ac824c31b7ab3c798bf1b572/dpdk/mk/rte.subdir.mk:35: octeontx2] Error 2
gmake[5]: *** Waiting for unfinished jobs....
  CC sfc_filter.o
  CC sfc_flow.o
  CC sfc_dp.o
  CC bcm_osal.o
--
  CC hunt_nic.o
  CC medford_nic.o
  CC medford2_nic.o
  LD librte_pmd_sfc_efx.so.1.1
  INSTALL-LIB librte_pmd_sfc_efx.so.1.1
gmake[4]: *** [/tmp/FreeBSD12-64_K19.02_GCC7.3.0/x86_64-native-bsdapp-gcc+shared/1ee16db4ac824c31b7ab3c798bf1b572/dpdk/mk/rte.subdir.mk:35: net] Error 2
gmake[3]: *** [/tmp/FreeBSD12-64_K19.02_GCC7.3.0/x86_64-native-bsdapp-gcc+shared/1ee16db4ac824c31b7ab3c798bf1b572/dpdk/mk/rte.sdkbuild.mk:46: drivers] Error 2
gmake[2]: *** [/tmp/FreeBSD12-64_K19.02_GCC7.3.0/x86_64-native-bsdapp-gcc+shared/1ee16db4ac824c31b7ab3c798bf1b572/dpdk/mk/rte.sdkroot.mk:99: all] Error 2
gmake[1]: *** [/tmp/FreeBSD12-64_K19.02_GCC7.3.0/x86_64-native-bsdapp-gcc+shared/1ee16db4ac824c31b7ab3c798bf1b572/dpdk/mk/rte.sdkinstall.mk:61: pre_install] Error 2
gmake: *** [/tmp/FreeBSD12-64_K19.02_GCC7.3.0/x86_64-native-bsdapp-gcc+shared/1ee16db4ac824c31b7ab3c798bf1b572/dpdk/mk/rte.sdkroot.mk:77: install] Error 2


*Make Build Failed #21:
OS: FreeBSD12-64
Target: x86_64-native-bsdapp-clang
                    ~~~~  ^
/tmp/FreeBSD12-64_K19.02_Clang6.0.1/x86_64-native-bsdapp-clang/1ee16db4ac824c31b7ab3c798bf1b572/dpdk/drivers/net/octeontx2/otx2_ethdev_ops.c:311:20: error: no member named 'info' in 'struct rte_eth_burst_mode'
        rte_strscpy(mode->info, info, bytes + 1);
                    ~~~~  ^
2 errors generated.
gmake[6]: *** [/tmp/FreeBSD12-64_K19.02_Clang6.0.1/x86_64-native-bsdapp-clang/1ee16db4ac824c31b7ab3c798bf1b572/dpdk/mk/internal/rte.compile-pre.mk:116: otx2_ethdev_ops.o] Error 1
gmake[6]: *** Waiting for unfinished jobs....
  CC efx_bootcfg.o
  CC efx_crc32.o
  CC efx_ev.o
  CC efx_evb.o
  CC efx_filter.o
  CC efx_hash.o
  CC efx_intr.o
  AR librte_pmd_qede.a
gmake[5]: *** [/tmp/FreeBSD12-64_K19.02_Clang6.0.1/x86_64-native-bsdapp-clang/1ee16db4ac824c31b7ab3c798bf1b572/dpdk/mk/rte.subdir.mk:35: octeontx2] Error 2
gmake[5]: *** Waiting for unfinished jobs....
  CC efx_lic.o
  INSTALL-LIB librte_pmd_qede.a
  CC efx_mcdi.o
  CC efx_mac.o
--
  CC hunt_nic.o
  CC medford2_nic.o
  CC medford_nic.o
  AR librte_pmd_sfc_efx.a
  INSTALL-LIB librte_pmd_sfc_efx.a
gmake[4]: *** [/tmp/FreeBSD12-64_K19.02_Clang6.0.1/x86_64-native-bsdapp-clang/1ee16db4ac824c31b7ab3c798bf1b572/dpdk/mk/rte.subdir.mk:35: net] Error 2
gmake[3]: *** [/tmp/FreeBSD12-64_K19.02_Clang6.0.1/x86_64-native-bsdapp-clang/1ee16db4ac824c31b7ab3c798bf1b572/dpdk/mk/rte.sdkbuild.mk:46: drivers] Error 2
gmake[2]: *** [/tmp/FreeBSD12-64_K19.02_Clang6.0.1/x86_64-native-bsdapp-clang/1ee16db4ac824c31b7ab3c798bf1b572/dpdk/mk/rte.sdkroot.mk:99: all] Error 2
gmake[1]: *** [/tmp/FreeBSD12-64_K19.02_Clang6.0.1/x86_64-native-bsdapp-clang/1ee16db4ac824c31b7ab3c798bf1b572/dpdk/mk/rte.sdkinstall.mk:61: pre_install] Error 2
gmake: *** [/tmp/FreeBSD12-64_K19.02_Clang6.0.1/x86_64-native-bsdapp-clang/1ee16db4ac824c31b7ab3c798bf1b572/dpdk/mk/rte.sdkroot.mk:77: install] Error 2


*Make Build Failed #22:
OS: FreeBSD12-64
Target: x86_64-native-bsdapp-gcc
      |                  ^~
/tmp/FreeBSD12-64_K19.02_GCC7.3.0/x86_64-native-bsdapp-gcc/1ee16db4ac824c31b7ab3c798bf1b572/dpdk/drivers/net/octeontx2/otx2_ethdev_ops.c: In function 'otx2_tx_burst_mode_get':
/tmp/FreeBSD12-64_K19.02_GCC7.3.0/x86_64-native-bsdapp-gcc/1ee16db4ac824c31b7ab3c798bf1b572/dpdk/drivers/net/octeontx2/otx2_ethdev_ops.c:311:18: error: 'struct rte_eth_burst_mode' has no member named 'info'
  311 |  rte_strscpy(mode->info, info, bytes + 1);
      |                  ^~
gmake[6]: *** [/tmp/FreeBSD12-64_K19.02_GCC7.3.0/x86_64-native-bsdapp-gcc/1ee16db4ac824c31b7ab3c798bf1b572/dpdk/mk/internal/rte.compile-pre.mk:116: otx2_ethdev_ops.o] Error 1
gmake[6]: *** Waiting for unfinished jobs....
  CC qede_ethdev.o
  CC sfc_ef10_tx.o
  CC qede_main.o
  CC efx_bootcfg.o
gmake[5]: *** [/tmp/FreeBSD12-64_K19.02_GCC7.3.0/x86_64-native-bsdapp-gcc/1ee16db4ac824c31b7ab3c798bf1b572/dpdk/mk/rte.subdir.mk:35: octeontx2] Error 2
gmake[5]: *** Waiting for unfinished jobs....
  CC qede_rxtx.o
  CC qede_filter.o
  CC efx_crc32.o
  CC efx_ev.o
--
  CC hunt_nic.o
  CC medford_nic.o
  CC medford2_nic.o
  AR librte_pmd_sfc_efx.a
  INSTALL-LIB librte_pmd_sfc_efx.a
gmake[4]: *** [/tmp/FreeBSD12-64_K19.02_GCC7.3.0/x86_64-native-bsdapp-gcc/1ee16db4ac824c31b7ab3c798bf1b572/dpdk/mk/rte.subdir.mk:35: net] Error 2
gmake[3]: *** [/tmp/FreeBSD12-64_K19.02_GCC7.3.0/x86_64-native-bsdapp-gcc/1ee16db4ac824c31b7ab3c798bf1b572/dpdk/mk/rte.sdkbuild.mk:46: drivers] Error 2
gmake[2]: *** [/tmp/FreeBSD12-64_K19.02_GCC7.3.0/x86_64-native-bsdapp-gcc/1ee16db4ac824c31b7ab3c798bf1b572/dpdk/mk/rte.sdkroot.mk:99: all] Error 2
gmake[1]: *** [/tmp/FreeBSD12-64_K19.02_GCC7.3.0/x86_64-native-bsdapp-gcc/1ee16db4ac824c31b7ab3c798bf1b572/dpdk/mk/rte.sdkinstall.mk:61: pre_install] Error 2
gmake: *** [/tmp/FreeBSD12-64_K19.02_GCC7.3.0/x86_64-native-bsdapp-gcc/1ee16db4ac824c31b7ab3c798bf1b572/dpdk/mk/rte.sdkroot.mk:77: install] Error 2

*Meson Build Failed #1:
OS: UB1604-32
Target:build-gcc-static
FAILED: drivers/a715181@@tmp_rte_pmd_octeontx2@sta/net_octeontx2_otx2_ethdev_ops.c.o 
gcc -Idrivers/a715181@@tmp_rte_pmd_octeontx2@sta -Idrivers -I../drivers -Idrivers/net/octeontx2 -I../drivers/net/octeontx2 -Ilib/librte_ethdev -I../lib/librte_ethdev -I. -I../ -Iconfig -I../config -Ilib/librte_eal/common/include -I../lib/librte_eal/common/include -I../lib/librte_eal/linux/eal/include -Ilib/librte_eal/common -I../lib/librte_eal/common -Ilib/librte_eal/common/include/arch/x86 -I../lib/librte_eal/common/include/arch/x86 -Ilib/librte_eal -I../lib/librte_eal -Ilib/librte_kvargs -I../lib/librte_kvargs -Ilib/librte_net -I../lib/librte_net -Ilib/librte_mbuf -I../lib/librte_mbuf -Ilib/librte_mempool -I../lib/librte_mempool -Ilib/librte_ring -I../lib/librte_ring -Ilib/librte_meter -I../lib/librte_meter -Idrivers/bus/pci -I../drivers/bus/pci -I../drivers/bus/pci/linux -Ilib/librte_pci -I../lib/librte_pci -Idrivers/bus/vdev -I../drivers/bus/vdev -Idrivers/common/octeontx2 -I../drivers/common/octeontx2 -Idrivers/common/octeontx2/../../common/octeontx2 -I../drivers/common/octeontx2/../../common/octeontx2 -Idrivers/common/octeontx2/../../mempool/octeontx2 -I../drivers/common/octeontx2/../../mempool/octeontx2 -Idrivers/common/octeontx2/../../bus/pci -I../drivers/common/octeontx2/../../bus/pci -Idrivers/mempool/octeontx2 -I../drivers/mempool/octeontx2 -fdiagnostics-color=always -pipe -D_FILE_OFFSET_BITS=64 -Wall -Winvalid-pch -Werror -O3 -include rte_config.h -Wextra -Wcast-qual -Wdeprecated -Wformat-nonliteral -Wformat-security -Wmissing-declarations -Wmissing-prototypes -Wnested-externs -Wold-style-definition -Wpointer-arith -Wsign-compare -Wstrict-prototypes -Wundef -Wwrite-strings -Wno-missing-field-initializers -Wno-pointer-to-int-cast -D_GNU_SOURCE -fPIC -march=native -flax-vector-conversions -Wno-int-to-pointer-cast -Wno-pointer-to-int-cast -MD -MQ 'drivers/a715181@@tmp_rte_pmd_octeontx2@sta/net_octeontx2_otx2_ethdev_ops.c.o' -MF 'drivers/a715181@@tmp_rte_pmd_octeontx2@sta/net_octeontx2_otx2_ethdev_ops.c.o.d' -o 'drivers/a715181@@tmp_rte_pmd_octeontx2@sta/net_octeontx2_otx2_ethdev_ops.c.o' -c ../drivers/net/octeontx2/otx2_ethdev_ops.c
../drivers/net/octeontx2/otx2_ethdev_ops.c: In function ‘otx2_rx_burst_mode_get’:
../drivers/net/octeontx2/otx2_ethdev_ops.c:268:18: error: ‘struct rte_eth_burst_mode’ has no member named ‘info’
  rte_strscpy(mode->info, info, bytes + 1);
                  ^
../drivers/net/octeontx2/otx2_ethdev_ops.c: In function ‘otx2_tx_burst_mode_get’:
../drivers/net/octeontx2/otx2_ethdev_ops.c:311:18: error: ‘struct rte_eth_burst_mode’ has no member named ‘info’
  rte_strscpy(mode->info, info, bytes + 1);
                  ^
[972/1738] Compiling C object 'drivers/a715181@@tmp_rte_pmd_octeontx2@sta/net_octeontx2_otx2_flow_utils.c.o'.
[973/1738] Compiling C object 'drivers/a715181@@tmp_rte_pmd_octeontx2@sta/net_octeontx2_otx2_ethdev_devargs.c.o'.
[974/1738] Compiling C object 'drivers/a715181@@tmp_rte_pmd_octeontx2@sta/net_octeontx2_otx2_ethdev_debug.c.o'.
[975/1738] Compiling C object 'drivers/a715181@@tmp_rte_pmd_octeontx2@sta/net_octeontx2_otx2_rx.c.o'.
[976/1738] Compiling C object 'drivers/a715181@@tmp_rte_pmd_octeontx2@sta/net_octeontx2_otx2_tx.c.o'.
ninja: build stopped: subcommand failed




*Meson Build Failed #2:
OS: SUSE15-64
Target:build-gcc-static
FAILED: drivers/a715181@@tmp_rte_pmd_octeontx2@sta/net_octeontx2_otx2_ethdev_ops.c.o 
gcc -Idrivers/a715181@@tmp_rte_pmd_octeontx2@sta -Idrivers -I../drivers -Idrivers/net/octeontx2 -I../drivers/net/octeontx2 -Ilib/librte_ethdev -I../lib/librte_ethdev -I. -I../ -Iconfig -I../config -Ilib/librte_eal/common/include -I../lib/librte_eal/common/include -I../lib/librte_eal/linux/eal/include -Ilib/librte_eal/common -I../lib/librte_eal/common -Ilib/librte_eal/common/include/arch/x86 -I../lib/librte_eal/common/include/arch/x86 -Ilib/librte_eal -I../lib/librte_eal -Ilib/librte_kvargs -I../lib/librte_kvargs -Ilib/librte_net -I../lib/librte_net -Ilib/librte_mbuf -I../lib/librte_mbuf -Ilib/librte_mempool -I../lib/librte_mempool -Ilib/librte_ring -I../lib/librte_ring -Ilib/librte_meter -I../lib/librte_meter -Idrivers/bus/pci -I../drivers/bus/pci -I../drivers/bus/pci/linux -Ilib/librte_pci -I../lib/librte_pci -Idrivers/bus/vdev -I../drivers/bus/vdev -Idrivers/common/octeontx2 -I../drivers/common/octeontx2 -Idrivers/common/octeontx2/../../common/octeontx2 -I../drivers/common/octeontx2/../../common/octeontx2 -Idrivers/common/octeontx2/../../mempool/octeontx2 -I../drivers/common/octeontx2/../../mempool/octeontx2 -Idrivers/common/octeontx2/../../bus/pci -I../drivers/common/octeontx2/../../bus/pci -Idrivers/mempool/octeontx2 -I../drivers/mempool/octeontx2 -fdiagnostics-color=always -pipe -D_FILE_OFFSET_BITS=64 -Wall -Winvalid-pch -Werror -O3 -include rte_config.h -Wextra -Wcast-qual -Wdeprecated -Wformat-nonliteral -Wformat-security -Wmissing-declarations -Wmissing-prototypes -Wnested-externs -Wold-style-definition -Wpointer-arith -Wsign-compare -Wstrict-prototypes -Wundef -Wwrite-strings -Wno-missing-field-initializers -D_GNU_SOURCE -fPIC -march=native -Wno-format-truncation -flax-vector-conversions -MD -MQ 'drivers/a715181@@tmp_rte_pmd_octeontx2@sta/net_octeontx2_otx2_ethdev_ops.c.o' -MF 'drivers/a715181@@tmp_rte_pmd_octeontx2@sta/net_octeontx2_otx2_ethdev_ops.c.o.d' -o 'drivers/a715181@@tmp_rte_pmd_octeontx2@sta/net_octeontx2_otx2_ethdev_ops.c.o' -c ../drivers/net/octeontx2/otx2_ethdev_ops.c
../drivers/net/octeontx2/otx2_ethdev_ops.c: In function ‘otx2_rx_burst_mode_get’:
../drivers/net/octeontx2/otx2_ethdev_ops.c:268:18: error: ‘struct rte_eth_burst_mode’ has no member named ‘info’
  rte_strscpy(mode->info, info, bytes + 1);
                  ^~
../drivers/net/octeontx2/otx2_ethdev_ops.c: In function ‘otx2_tx_burst_mode_get’:
../drivers/net/octeontx2/otx2_ethdev_ops.c:311:18: error: ‘struct rte_eth_burst_mode’ has no member named ‘info’
  rte_strscpy(mode->info, info, bytes + 1);
                  ^~
[1040/1951] Compiling C object 'drivers/a715181@@tmp_rte_pmd_octeontx2@sta/net_octeontx2_otx2_ethdev_irq.c.o'.
[1041/1951] Compiling C object 'drivers/a715181@@tmp_rte_pmd_octeontx2@sta/net_octeontx2_otx2_ethdev.c.o'.
[1042/1951] Compiling C object 'drivers/a715181@@tmp_rte_pmd_octeontx2@sta/net_octeontx2_otx2_flow_utils.c.o'.
[1043/1951] Compiling C object 'drivers/a715181@@tmp_rte_pmd_octeontx2@sta/net_octeontx2_otx2_ethdev_debug.c.o'.
[1044/1951] Compiling C object 'drivers/a715181@@tmp_rte_pmd_pcap@sta/net_pcap_rte_eth_pcap.c.o'.
[1045/1951] Compiling C object 'drivers/a715181@@tmp_rte_pmd_octeontx2@sta/net_octeontx2_otx2_rx.c.o'.
[1046/1951] Compiling C object 'drivers/a715181@@tmp_rte_pmd_octeontx2@sta/net_octeontx2_otx2_tx.c.o'.
ninja: build stopped: subcommand failed




*Meson Build Failed #3:
OS: FC30-64
Target:build-gcc-static
FAILED: drivers/a715181@@tmp_rte_pmd_octeontx2@sta/net_octeontx2_otx2_ethdev_ops.c.o 
gcc -Idrivers/a715181@@tmp_rte_pmd_octeontx2@sta -Idrivers -I../drivers -Idrivers/net/octeontx2 -I../drivers/net/octeontx2 -Ilib/librte_ethdev -I../lib/librte_ethdev -I. -I../ -Iconfig -I../config -Ilib/librte_eal/common/include -I../lib/librte_eal/common/include -I../lib/librte_eal/linux/eal/include -Ilib/librte_eal/common -I../lib/librte_eal/common -Ilib/librte_eal/common/include/arch/x86 -I../lib/librte_eal/common/include/arch/x86 -Ilib/librte_eal -I../lib/librte_eal -Ilib/librte_kvargs -I../lib/librte_kvargs -Ilib/librte_net -I../lib/librte_net -Ilib/librte_mbuf -I../lib/librte_mbuf -Ilib/librte_mempool -I../lib/librte_mempool -Ilib/librte_ring -I../lib/librte_ring -Ilib/librte_meter -I../lib/librte_meter -Idrivers/bus/pci -I../drivers/bus/pci -I../drivers/bus/pci/linux -Ilib/librte_pci -I../lib/librte_pci -Idrivers/bus/vdev -I../drivers/bus/vdev -Idrivers/common/octeontx2 -I../drivers/common/octeontx2 -Idrivers/common/octeontx2/../../common/octeontx2 -I../drivers/common/octeontx2/../../common/octeontx2 -Idrivers/common/octeontx2/../../mempool/octeontx2 -I../drivers/common/octeontx2/../../mempool/octeontx2 -Idrivers/common/octeontx2/../../bus/pci -I../drivers/common/octeontx2/../../bus/pci -Idrivers/mempool/octeontx2 -I../drivers/mempool/octeontx2 -fdiagnostics-color=always -pipe -D_FILE_OFFSET_BITS=64 -Wall -Winvalid-pch -Werror -O3 -include rte_config.h -Wextra -Wcast-qual -Wdeprecated -Wformat-nonliteral -Wformat-security -Wmissing-declarations -Wmissing-prototypes -Wnested-externs -Wold-style-definition -Wpointer-arith -Wsign-compare -Wstrict-prototypes -Wundef -Wwrite-strings -Wno-address-of-packed-member -Wno-packed-not-aligned -Wno-missing-field-initializers -D_GNU_SOURCE -fPIC -march=native -mno-avx512f -Wno-format-truncation -flax-vector-conversions -MD -MQ 'drivers/a715181@@tmp_rte_pmd_octeontx2@sta/net_octeontx2_otx2_ethdev_ops.c.o' -MF 'drivers/a715181@@tmp_rte_pmd_octeontx2@sta/net_octeontx2_otx2_ethdev_ops.c.o.d' -o 'drivers/a715181@@tmp_rte_pmd_octeontx2@sta/net_octeontx2_otx2_ethdev_ops.c.o' -c ../drivers/net/octeontx2/otx2_ethdev_ops.c
../drivers/net/octeontx2/otx2_ethdev_ops.c: In function ‘otx2_rx_burst_mode_get’:
../drivers/net/octeontx2/otx2_ethdev_ops.c:268:18: error: ‘struct rte_eth_burst_mode’ has no member named ‘info’
  268 |  rte_strscpy(mode->info, info, bytes + 1);
      |                  ^~
../drivers/net/octeontx2/otx2_ethdev_ops.c: In function ‘otx2_tx_burst_mode_get’:
../drivers/net/octeontx2/otx2_ethdev_ops.c:311:18: error: ‘struct rte_eth_burst_mode’ has no member named ‘info’
  311 |  rte_strscpy(mode->info, info, bytes + 1);
      |                  ^~
[1027/1904] Compiling C object 'drivers/a715181@@tmp_rte_pmd_octeontx2@sta/net_octeontx2_otx2_mcast.c.o'.
[1028/1904] Compiling C object 'drivers/a715181@@tmp_rte_pmd_octeontx2@sta/net_octeontx2_otx2_ethdev.c.o'.
[1029/1904] Compiling C object 'drivers/a715181@@tmp_rte_pmd_octeontx2@sta/net_octeontx2_otx2_ethdev_debug.c.o'.
[1030/1904] Compiling C object 'drivers/a715181@@tmp_rte_pmd_octeontx2@sta/net_octeontx2_otx2_flow_utils.c.o'.
[1031/1904] Compiling C object 'drivers/a715181@@tmp_rte_pmd_pcap@sta/net_pcap_rte_eth_pcap.c.o'.
[1032/1904] Compiling C object 'drivers/a715181@@tmp_rte_pmd_octeontx2@sta/net_octeontx2_otx2_rx.c.o'.
[1033/1904] Compiling C object 'drivers/a715181@@tmp_rte_pmd_octeontx2@sta/net_octeontx2_otx2_tx.c.o'.
ninja: build stopped: subcommand failed




*Meson Build Failed #4:
OS: UB1804-64
Target:build-gcc-static
FAILED: drivers/a715181@@tmp_rte_pmd_octeontx2@sta/net_octeontx2_otx2_ethdev_ops.c.o 
gcc -Idrivers/a715181@@tmp_rte_pmd_octeontx2@sta -Idrivers -I../drivers -Idrivers/net/octeontx2 -I../drivers/net/octeontx2 -Ilib/librte_ethdev -I../lib/librte_ethdev -I. -I../ -Iconfig -I../config -Ilib/librte_eal/common/include -I../lib/librte_eal/common/include -I../lib/librte_eal/linux/eal/include -Ilib/librte_eal/common -I../lib/librte_eal/common -Ilib/librte_eal/common/include/arch/x86 -I../lib/librte_eal/common/include/arch/x86 -Ilib/librte_eal -I../lib/librte_eal -Ilib/librte_kvargs -I../lib/librte_kvargs -Ilib/librte_net -I../lib/librte_net -Ilib/librte_mbuf -I../lib/librte_mbuf -Ilib/librte_mempool -I../lib/librte_mempool -Ilib/librte_ring -I../lib/librte_ring -Ilib/librte_meter -I../lib/librte_meter -Idrivers/bus/pci -I../drivers/bus/pci -I../drivers/bus/pci/linux -Ilib/librte_pci -I../lib/librte_pci -Idrivers/bus/vdev -I../drivers/bus/vdev -Idrivers/common/octeontx2 -I../drivers/common/octeontx2 -Idrivers/common/octeontx2/../../common/octeontx2 -I../drivers/common/octeontx2/../../common/octeontx2 -Idrivers/common/octeontx2/../../mempool/octeontx2 -I../drivers/common/octeontx2/../../mempool/octeontx2 -Idrivers/common/octeontx2/../../bus/pci -I../drivers/common/octeontx2/../../bus/pci -Idrivers/mempool/octeontx2 -I../drivers/mempool/octeontx2 -fdiagnostics-color=always -pipe -D_FILE_OFFSET_BITS=64 -Wall -Winvalid-pch -Werror -O3 -include rte_config.h -Wextra -Wcast-qual -Wdeprecated -Wformat-nonliteral -Wformat-security -Wmissing-declarations -Wmissing-prototypes -Wnested-externs -Wold-style-definition -Wpointer-arith -Wsign-compare -Wstrict-prototypes -Wundef -Wwrite-strings -Wno-missing-field-initializers -D_GNU_SOURCE -fPIC -march=native -mno-avx512f -Wno-format-truncation -flax-vector-conversions -MD -MQ 'drivers/a715181@@tmp_rte_pmd_octeontx2@sta/net_octeontx2_otx2_ethdev_ops.c.o' -MF 'drivers/a715181@@tmp_rte_pmd_octeontx2@sta/net_octeontx2_otx2_ethdev_ops.c.o.d' -o 'drivers/a715181@@tmp_rte_pmd_octeontx2@sta/net_octeontx2_otx2_ethdev_ops.c.o' -c ../drivers/net/octeontx2/otx2_ethdev_ops.c
../drivers/net/octeontx2/otx2_ethdev_ops.c: In function ‘otx2_rx_burst_mode_get’:
../drivers/net/octeontx2/otx2_ethdev_ops.c:268:18: error: ‘struct rte_eth_burst_mode’ has no member named ‘info’
  rte_strscpy(mode->info, info, bytes + 1);
                  ^~
../drivers/net/octeontx2/otx2_ethdev_ops.c: In function ‘otx2_tx_burst_mode_get’:
../drivers/net/octeontx2/otx2_ethdev_ops.c:311:18: error: ‘struct rte_eth_burst_mode’ has no member named ‘info’
  rte_strscpy(mode->info, info, bytes + 1);
                  ^~
[1040/1911] Compiling C object 'drivers/a715181@@tmp_rte_pmd_octeontx2@sta/net_octeontx2_otx2_ethdev_irq.c.o'.
[1041/1911] Compiling C object 'drivers/a715181@@tmp_rte_pmd_octeontx2@sta/net_octeontx2_otx2_ethdev.c.o'.
[1042/1911] Compiling C object 'drivers/a715181@@tmp_rte_pmd_octeontx2@sta/net_octeontx2_otx2_ethdev_debug.c.o'.
[1043/1911] Compiling C object 'drivers/a715181@@tmp_rte_pmd_octeontx2@sta/net_octeontx2_otx2_tx.c.o'.
[1044/1911] Compiling C object 'drivers/a715181@@tmp_rte_pmd_pcap@sta/net_pcap_rte_eth_pcap.c.o'.
ninja: build stopped: subcommand failed




*Meson Build Failed #5:
OS: FreeBSD12-64
Target:build-gcc-static
FAILED: drivers/a715181@@tmp_rte_pmd_octeontx2@sta/net_octeontx2_otx2_ethdev_ops.c.o 
ccache gcc -Idrivers/a715181@@tmp_rte_pmd_octeontx2@sta -Idrivers -I../drivers -Idrivers/net/octeontx2 -I../drivers/net/octeontx2 -Ilib/librte_ethdev -I../lib/librte_ethdev -I. -I../ -Iconfig -I../config -Ilib/librte_eal/common/include -I../lib/librte_eal/common/include -I../lib/librte_eal/freebsd/eal/include -Ilib/librte_eal/common -I../lib/librte_eal/common -Ilib/librte_eal/common/include/arch/x86 -I../lib/librte_eal/common/include/arch/x86 -Ilib/librte_eal -I../lib/librte_eal -Ilib/librte_kvargs -I../lib/librte_kvargs -Ilib/librte_net -I../lib/librte_net -Ilib/librte_mbuf -I../lib/librte_mbuf -Ilib/librte_mempool -I../lib/librte_mempool -Ilib/librte_ring -I../lib/librte_ring -Ilib/librte_meter -I../lib/librte_meter -Idrivers/bus/pci -I../drivers/bus/pci -I../drivers/bus/pci/bsd -Ilib/librte_pci -I../lib/librte_pci -Idrivers/bus/vdev -I../drivers/bus/vdev -Idrivers/common/octeontx2 -I../drivers/common/octeontx2 -Idrivers/common/octeontx2/../../common/octeontx2 -I../drivers/common/octeontx2/../../common/octeontx2 -Idrivers/common/octeontx2/../../mempool/octeontx2 -I../drivers/common/octeontx2/../../mempool/octeontx2 -Idrivers/common/octeontx2/../../bus/pci -I../drivers/common/octeontx2/../../bus/pci -Idrivers/mempool/octeontx2 -I../drivers/mempool/octeontx2 -fdiagnostics-color=always -pipe -D_FILE_OFFSET_BITS=64 -Wall -Winvalid-pch -Werror -O3 -include rte_config.h -Wextra -Wcast-qual -Wdeprecated -Wformat-nonliteral -Wformat-security -Wmissing-declarations -Wmissing-prototypes -Wnested-externs -Wold-style-definition -Wpointer-arith -Wsign-compare -Wstrict-prototypes -Wundef -Wwrite-strings -Wno-missing-field-initializers -D_GNU_SOURCE -D__BSD_VISIBLE -fPIC -march=native -Wno-format-truncation -flax-vector-conversions -MD -MQ 'drivers/a715181@@tmp_rte_pmd_octeontx2@sta/net_octeontx2_otx2_ethdev_ops.c.o' -MF 'drivers/a715181@@tmp_rte_pmd_octeontx2@sta/net_octeontx2_otx2_ethdev_ops.c.o.d' -o 'drivers/a715181@@tmp_rte_pmd_octeontx2@sta/net_octeontx2_otx2_ethdev_ops.c.o' -c ../drivers/net/octeontx2/otx2_ethdev_ops.c
../drivers/net/octeontx2/otx2_ethdev_ops.c: In function 'otx2_rx_burst_mode_get':
../drivers/net/octeontx2/otx2_ethdev_ops.c:268:18: error: 'struct rte_eth_burst_mode' has no member named 'info'
  rte_strscpy(mode->info, info, bytes + 1);
                  ^~
../drivers/net/octeontx2/otx2_ethdev_ops.c: In function 'otx2_tx_burst_mode_get':
../drivers/net/octeontx2/otx2_ethdev_ops.c:311:18: error: 'struct rte_eth_burst_mode' has no member named 'info'
  rte_strscpy(mode->info, info, bytes + 1);
                  ^~
[561/1476] Compiling C object 'drivers/a715181@@tmp_rte_pmd_octeontx2@sta/net_octeontx2_otx2_ethdev.c.o'.
[562/1476] Compiling C object 'drivers/a715181@@tmp_rte_pmd_octeontx2@sta/net_octeontx2_otx2_flow_utils.c.o'.
[563/1476] Compiling C object 'drivers/a715181@@tmp_rte_pmd_octeontx2@sta/net_octeontx2_otx2_ethdev_devargs.c.o'.
[564/1476] Compiling C object 'drivers/a715181@@tmp_rte_pmd_octeontx2@sta/net_octeontx2_otx2_ethdev_debug.c.o'.
[565/1476] Compiling C object 'drivers/a715181@@tmp_rte_pmd_pcap@sta/net_pcap_rte_eth_pcap.c.o'.
ninja: build stopped: subcommand failed



DPDK STV team

^ permalink raw reply	[flat|nested] only message in thread

only message in thread, back to index

Thread overview: (only message) (download: mbox.gz / follow: Atom feed)
-- links below jump to the message on this page --
2019-11-08 10:56 [dpdk-test-report] |FAILURE| pw62531[v3, 1/1] net/octeontx2: add Rx/Tx burst mode get callbacks sys_stv

automatic DPDK test reports

Archives are clonable:
	git clone --mirror http://inbox.dpdk.org/test-report/0 test-report/git/0.git

	# If you have public-inbox 1.1+ installed, you may
	# initialize and index your mirror using the following commands:
	public-inbox-init -V2 test-report test-report/ http://inbox.dpdk.org/test-report \
		test-report@dpdk.org
	public-inbox-index test-report


Newsgroup available over NNTP:
	nntp://inbox.dpdk.org/inbox.dpdk.test-report


AGPL code for this site: git clone https://public-inbox.org/ public-inbox