automatic DPDK test reports
 help / color / Atom feed
* [dpdk-test-report]  |FAILURE| pw63501version: 20.02-rc0
@ 2019-12-02 15:28 sys_stv
  0 siblings, 0 replies; only message in thread
From: sys_stv @ 2019-12-02 15:28 UTC (permalink / raw)
  To: test-report

[-- Attachment #1: Type: text/plain, Size: 25060 bytes --]

Test-Label: Intel-compilation
Test-Status: FAILURE
http://dpdk.org/patch/63501

_Compilation issues_

Submitter: Thomas Monjalon <thomas@monjalon.net>
Date: 2019-12-02 14:57:18
Reply_mail: 20191202145718.16407-1-thomas@monjalon.net
DPDK git baseline: Repo:dpdk, CommitID: 7001c8fdb27357c67147c0a13cb3826e48c0f2bf

Makefile build Summary: 22 Builds Done, 22 Successful, 0 Failures

Meson build Summary: 8 Builds Done, 1 Successful, 7 Failures

               +==============================================+===========+==========+
               |                   Makefile                   |   Meson   | Document |
+--------------+------+-------+------+------------+-----------+-----------+----------+
| os           | gcc  | clang | icc  | gcc+shared | gcc+debug | gcc/clang | pdf/html |
+--------------+------+-------+------+------------+-----------+-----------+----------+
| RHEL76-64    | pass |       |      |            |           |           |          |
| CENTOS76-64  | pass | pass  | pass | pass       | pass      | FAIL      |          |
| UB1804-64    | pass | pass  | pass |            |           | FAIL      | pass     |
| UB1604-32    | pass |       |      |            |           | FAIL      |          |
| UB1904-64    | pass |       |      |            |           |           |          |
| UB1604-64    | pass | pass  |      |            |           |           |          |
| FC30-64      | pass | pass  |      |            |           | FAIL      |          |
| WIN10-64     |      |       |      |            |           | FAIL      |          |
| FreeBSD12-64 | pass | pass  |      | pass       | pass      | FAIL      |          |
| RHEL80-64    | pass |       |      |            |           |           |          |
| SUSE15-64    | pass | pass  |      |            |           | FAIL      |          |
+--------------+------+-------+------+------------+-----------+-----------+----------+

Test environment and configuration as below:

** Makefile build **


OS: RHEL76-64
	Kernel Version: 3.10.0-957.el7.x86_64
	CPU info: Intel(R) Xeon(R) CPU E5-2699 v4 @ 2.20GHz
	GCC Version: gcc (GCC) 4.8.5 20150623 (Red Hat 4.8.5-36)
	Clang Version: NA
	x86_64-native-linuxapp-gcc


OS: CENTOS76-64
	Kernel Version: 3.10.0-957.10.1.el7.x86_64
	CPU info: Intel(R) Xeon(R) CPU E5-2699 v4 @ 2.20GHz
	GCC Version: gcc (GCC) 4.8.5 20150623 (Red Hat 4.8.5-36)
	Clang Version: 3.4.2 (tags/RELEASE_34/dot2-final)
	x86_64-native-linuxapp-gcc
	x86_64-native-linuxapp-gcc+debug
	x86_64-native-linuxapp-clang
	x86_64-native-linuxapp-gcc+shared
	x86_64-native-linuxapp-icc


OS: UB1804-64
	Kernel Version: 4.15.0-20-generic
	CPU info: Intel(R) Xeon(R) CPU E5-2699 v3 @ 2.30GHz
	GCC Version: gcc (Ubuntu 7.3.0-16ubuntu3) 7.3.0
	Clang Version: 6.0.0-1ubuntu2 (tags/RELEASE_600/final)
	x86_64-native-linuxapp-clang
	x86_64-native-linuxapp-icc
	x86_64-native-linuxapp-gcc


OS: UB1904-64
	Kernel Version: 5.0.0-13-generic
	CPU info: Intel(R) Xeon(R) CPU E5-2699 v3 @ 2.30GHz
	GCC Version: gcc (Ubuntu 8.3.0-6ubuntu1) 8.3.0
	Clang Version: 8.0.0-3 (tags/RELEASE_800/final)
	x86_64-native-linuxapp-gcc


OS: UB1604-32
	Kernel Version: 4.4.0-131-generic
	CPU info: Intel(R) Xeon(R) CPU E5-2699 v3 @ 2.30GHz
	GCC Version: gcc (Ubuntu 5.4.0-6ubuntu1~16.04.11) 5.4.0 20160609
	Clang Version: 3.8.0-2ubuntu4 (tags/RELEASE_380/final)
	i686-native-linuxapp-gcc


OS: UB1604-64
	Kernel Version: 4.4.0-47-generic
	CPU info: Intel(R) Xeon(R) CPU E5-2699 v3 @ 2.30GHz
	GCC Version: gcc (Ubuntu 5.4.0-6ubuntu1~16.04.12) 5.4.0 20160609
	Clang Version: 3.8.0-2ubuntu4 (tags/RELEASE_380/final)
	x86_64-native-linuxapp-clang
	x86_64-native-linuxapp-gcc


OS: FC30-64
	Kernel Version: 5.1.7-300.fc30.x86_64
	CPU info: Intel(R) Xeon(R) CPU E5-2699 v4 @ 2.20GHz
	GCC Version: gcc (GCC) 9.1.1 20190503 (Red Hat 9.1.1-1)
	Clang Version: 8.0.0 (Fedora 8.0.0-1.fc30)
	x86_64-native-linuxapp-gcc
	x86_64-native-linuxapp-clang


OS: FreeBSD12-64
	Kernel Version: 12.0-RC3
	CPU info: Intel(R) Xeon(R) CPU E5-2699 v4 @ 2.20GHz (2194.97-MHz K8-class CPU)
	GCC Version: gcc (FreeBSD Ports Collection) 7.3.0
	Clang Version: 6.0.1 (tags/RELEASE_601/final 335540) (based on LLVM 6.0.1)
	x86_64-native-bsdapp-clang
	x86_64-native-bsdapp-gcc+shared
	x86_64-native-bsdapp-gcc
	x86_64-native-bsdapp-gcc+debug


OS: RHEL80-64
	Kernel Version: 4.18.0-80.el8.x86_64
	CPU info: Intel(R) Xeon(R) CPU E5-2699 v4 @ 2.20GHz
	GCC Version: gcc (GCC) 8.2.1 20180905 (Red Hat 8.2.1-3)
	Clang Version: 6.0.1 (tags/RELEASE_601/final)
	x86_64-native-linuxapp-gcc


OS: SUSE15-64
	Kernel Version: 4.12.14-lp150.11-default
	CPU info: Intel(R) Xeon(R) CPU E5-2699 v4 @ 2.20GHz
	GCC Version: gcc (SUSE Linux) 7.3.1 20180323 [gcc-7-branch revision 258812]
	Clang Version: 5.0.1 (tags/RELEASE_501/final 312548)
	x86_64-native-linuxapp-gcc
	x86_64-native-linuxapp-clang


** Meson build **


OS: CENTOS76-64
	Kernel Version: 3.10.0-1062.4.1.el7.x86_64
	CPU info: Intel(R) Xeon(R) CPU E5-2699 v4 @ 2.20GHz
	GCC Version: gcc (GCC) 4.8.5 20150623 (Red Hat 4.8.5-39)
	Clang Version: 6.0.0 (tags/RELEASE_600/final)
	./build-gcc-static
	./build-gcc-shared
	./build-clang-static
	./build-clang-shared
	./build-x86-default


OS: UB1804-64
	Kernel Version: 4.15.0-20-generic
	CPU info: Intel(R) Xeon(R) CPU E5-2699 v4 @ 2.20GHz
	GCC Version: gcc (Ubuntu 7.3.0-27ubuntu1~18.04) 7.3.0
	Clang Version: 6.0.0-1ubuntu2 (tags/RELEASE_600/final)
	x86_64-native-linuxapp-doc
	./build-gcc-static
	./build-gcc-shared
	./build-clang-static
	./build-clang-shared
	./build-x86-default


OS: UB1604-32
	Kernel Version: 4.4.0-131-generic
	CPU info: Intel(R) Xeon(R) CPU E5-2699 v4 @ 2.20GHz
	GCC Version: gcc (Ubuntu 5.4.0-6ubuntu1~16.04.11) 5.4.0 20160609
	Clang Version: 3.8.0-2ubuntu4 (tags/RELEASE_380/final)
	./build-gcc-static
	./build-gcc-shared
	./build-clang-static
	./build-clang-shared
	./build-x86-default


OS: FC30-64
	Kernel Version: 5.0.9-301.fc30.x86_64
	CPU info: Intel(R) Xeon(R) CPU E5-2699 v4 @ 2.20GHz
	GCC Version: gcc (GCC) 9.1.1 20190503 (Red Hat 9.1.1-1)
	Clang Version: 8.0.0 (Fedora 8.0.0-1.fc30)
	./build-gcc-static
	./build-gcc-shared
	./build-clang-static
	./build-clang-shared
	./build-x86-default


OS: WIN10-64
	Kernel Version: N/A
	CPU info: N/A
	GCC Version: N/A
	Clang Version: Clang 8.0.0
	x86_64-windows-clang


OS: FreeBSD12-64
	Kernel Version: 12.0-RC3
	CPU info: Intel(R) Xeon(R) CPU E5-2699 v4 @ 2.20GHz (2194.98-MHz K8-class CPU)
	GCC Version: gcc (FreeBSD Ports Collection) 7.3.0
	Clang Version: 6.0.1 (tags/RELEASE_601/final 335540) (based on LLVM 6.0.1)
	./build-gcc-static
	./build-gcc-shared
	./build-clang-static
	./build-clang-shared
	./build-x86-default


OS: SUSE15-64
	Kernel Version: 4.12.14-lp150.11-default
	CPU info: Intel(R) Xeon(R) CPU E5-2699 v4 @ 2.20GHz
	GCC Version: gcc (SUSE Linux) 7.3.1 20180323 [gcc-7-branch revision 258812]
	Clang Version: 5.0.1 (tags/RELEASE_501/final 312548)
	./build-gcc-static
	./build-gcc-shared
	./build-clang-static
	./build-clang-shared
	./build-x86-default


*Meson Build Failed #1:
OS: WIN10-64
Target: x86_64-windows-clang
Build machine cpu family: x86_64
Build machine cpu: x86_64
Program cat found: NO
Program more found: YES (C:\Windows\system32\more.COM)

config\meson.build:29:10: ERROR: String '02-rc0' cannot be converted to int

A full log can be found at C:\windows-dpdk\dpdk\build\meson-logs\meson-log.txt
ninja: Entering directory `build'
end_time=Mon 12/02/2019  7:20:48.51 
status=0 


*Meson Build Failed #2:
OS: SUSE15-64
Target:./build-gcc-static
Native C compiler: gcc (gcc 7.3.1 "gcc (SUSE Linux) 7.3.1 20180323 [gcc-7-branch revision 258812]")
Build machine cpu family: x86_64
Build machine cpu: x86_64
Program cat found: YES (/usr/bin/cat)

config/meson.build:29:10: ERROR: String '02-rc0' cannot be converted to int

A full log can be found at /root/SUSE15-64_K4.12.14_GCC7.3.1/x86_64-native-linuxapp-gcc/63178fc72f724330aead516c61cf0092/dpdk/build-gcc-static/meson-logs/meson-log.txt
ninja -C ./build-gcc-static
ninja: Entering directory `./build-gcc-static'
ninja: error: loading 'build.ninja': No such file or directory
--
Native C compiler: gcc (gcc 7.3.1 "gcc (SUSE Linux) 7.3.1 20180323 [gcc-7-branch revision 258812]")
Build machine cpu family: x86_64
Build machine cpu: x86_64
Program cat found: YES (/usr/bin/cat)

config/meson.build:29:10: ERROR: String '02-rc0' cannot be converted to int

A full log can be found at /root/SUSE15-64_K4.12.14_GCC7.3.1/x86_64-native-linuxapp-gcc/63178fc72f724330aead516c61cf0092/dpdk/build-gcc-shared/meson-logs/meson-log.txt
ninja -C ./build-gcc-shared
ninja: Entering directory `./build-gcc-shared'
ninja: error: loading 'build.ninja': No such file or directory
--
Native C compiler: clang (clang 5.0.1 "clang version 5.0.1 (tags/RELEASE_501/final 312548)")
Build machine cpu family: x86_64
Build machine cpu: x86_64
Program cat found: YES (/usr/bin/cat)

config/meson.build:29:10: ERROR: String '02-rc0' cannot be converted to int

A full log can be found at /root/SUSE15-64_K4.12.14_GCC7.3.1/x86_64-native-linuxapp-gcc/63178fc72f724330aead516c61cf0092/dpdk/build-clang-static/meson-logs/meson-log.txt
ninja -C ./build-clang-static
ninja: Entering directory `./build-clang-static'
ninja: error: loading 'build.ninja': No such file or directory
--
Native C compiler: clang (clang 5.0.1 "clang version 5.0.1 (tags/RELEASE_501/final 312548)")
Build machine cpu family: x86_64
Build machine cpu: x86_64
Program cat found: YES (/usr/bin/cat)

config/meson.build:29:10: ERROR: String '02-rc0' cannot be converted to int

A full log can be found at /root/SUSE15-64_K4.12.14_GCC7.3.1/x86_64-native-linuxapp-gcc/63178fc72f724330aead516c61cf0092/dpdk/build-clang-shared/meson-logs/meson-log.txt
ninja -C ./build-clang-shared
ninja: Entering directory `./build-clang-shared'
ninja: error: loading 'build.ninja': No such file or directory
--
Native C compiler: cc (gcc 7.3.1 "cc (SUSE Linux) 7.3.1 20180323 [gcc-7-branch revision 258812]")
Build machine cpu family: x86_64
Build machine cpu: x86_64
Program cat found: YES (/usr/bin/cat)

config/meson.build:29:10: ERROR: String '02-rc0' cannot be converted to int

A full log can be found at /root/SUSE15-64_K4.12.14_GCC7.3.1/x86_64-native-linuxapp-gcc/63178fc72f724330aead516c61cf0092/dpdk/build-x86-default/meson-logs/meson-log.txt
ninja -C ./build-x86-default
ninja: Entering directory `./build-x86-default'
ninja: error: loading 'build.ninja': No such file or directory


*Meson Build Failed #3:
OS: UB1604-32
Target:./build-gcc-static
Native C compiler: gcc (gcc 5.4.0 "gcc (Ubuntu 5.4.0-6ubuntu1~16.04.11) 5.4.0 20160609")
Build machine cpu family: x86
Build machine cpu: i686
Program cat found: YES (/bin/cat)

config/meson.build:29:10: ERROR: String '02-rc0' cannot be converted to int

A full log can be found at /root/UB1604-32_K4.4.0_GCC5.4.0/i686-native-linuxapp-gcc/63178fc72f724330aead516c61cf0092/dpdk/build-gcc-static/meson-logs/meson-log.txt
ninja -C ./build-gcc-static
ninja: Entering directory `./build-gcc-static'
ninja: error: loading 'build.ninja': No such file or directory
--
Native C compiler: gcc (gcc 5.4.0 "gcc (Ubuntu 5.4.0-6ubuntu1~16.04.11) 5.4.0 20160609")
Build machine cpu family: x86
Build machine cpu: i686
Program cat found: YES (/bin/cat)

config/meson.build:29:10: ERROR: String '02-rc0' cannot be converted to int

A full log can be found at /root/UB1604-32_K4.4.0_GCC5.4.0/i686-native-linuxapp-gcc/63178fc72f724330aead516c61cf0092/dpdk/build-gcc-shared/meson-logs/meson-log.txt
ninja -C ./build-gcc-shared
ninja: Entering directory `./build-gcc-shared'
ninja: error: loading 'build.ninja': No such file or directory
--
Native C compiler: clang (clang 3.8.0-2ubuntu4 "clang version 3.8.0-2ubuntu4 (tags/RELEASE_380/final)")
Build machine cpu family: x86
Build machine cpu: i686
Program cat found: YES (/bin/cat)

config/meson.build:29:10: ERROR: String '02-rc0' cannot be converted to int

A full log can be found at /root/UB1604-32_K4.4.0_GCC5.4.0/i686-native-linuxapp-gcc/63178fc72f724330aead516c61cf0092/dpdk/build-clang-static/meson-logs/meson-log.txt
ninja -C ./build-clang-static
ninja: Entering directory `./build-clang-static'
ninja: error: loading 'build.ninja': No such file or directory
--
Native C compiler: clang (clang 3.8.0-2ubuntu4 "clang version 3.8.0-2ubuntu4 (tags/RELEASE_380/final)")
Build machine cpu family: x86
Build machine cpu: i686
Program cat found: YES (/bin/cat)

config/meson.build:29:10: ERROR: String '02-rc0' cannot be converted to int

A full log can be found at /root/UB1604-32_K4.4.0_GCC5.4.0/i686-native-linuxapp-gcc/63178fc72f724330aead516c61cf0092/dpdk/build-clang-shared/meson-logs/meson-log.txt
ninja -C ./build-clang-shared
ninja: Entering directory `./build-clang-shared'
ninja: error: loading 'build.ninja': No such file or directory
--
Native C compiler: cc (gcc 5.4.0 "cc (Ubuntu 5.4.0-6ubuntu1~16.04.11) 5.4.0 20160609")
Build machine cpu family: x86
Build machine cpu: i686
Program cat found: YES (/bin/cat)

config/meson.build:29:10: ERROR: String '02-rc0' cannot be converted to int

A full log can be found at /root/UB1604-32_K4.4.0_GCC5.4.0/i686-native-linuxapp-gcc/63178fc72f724330aead516c61cf0092/dpdk/build-x86-default/meson-logs/meson-log.txt
ninja -C ./build-x86-default
ninja: Entering directory `./build-x86-default'
ninja: error: loading 'build.ninja': No such file or directory


*Meson Build Failed #4:
OS: FC30-64
Target:./build-gcc-static
Native C compiler: gcc (gcc 9.1.1 "gcc (GCC) 9.1.1 20190503 (Red Hat 9.1.1-1)")
Build machine cpu family: x86_64
Build machine cpu: x86_64
Program cat found: YES (/usr/bin/cat)

config/meson.build:29:10: ERROR: String '02-rc0' cannot be converted to int

A full log can be found at /root/FC30-64_K4.20_GCC9.1.1/x86_64-native-linuxapp-gcc/63178fc72f724330aead516c61cf0092/dpdk/build-gcc-static/meson-logs/meson-log.txt
ninja -C ./build-gcc-static
ninja: Entering directory `./build-gcc-static'
ninja: error: loading 'build.ninja': No such file or directory
--
Native C compiler: gcc (gcc 9.1.1 "gcc (GCC) 9.1.1 20190503 (Red Hat 9.1.1-1)")
Build machine cpu family: x86_64
Build machine cpu: x86_64
Program cat found: YES (/usr/bin/cat)

config/meson.build:29:10: ERROR: String '02-rc0' cannot be converted to int

A full log can be found at /root/FC30-64_K4.20_GCC9.1.1/x86_64-native-linuxapp-gcc/63178fc72f724330aead516c61cf0092/dpdk/build-gcc-shared/meson-logs/meson-log.txt
ninja -C ./build-gcc-shared
ninja: Entering directory `./build-gcc-shared'
ninja: error: loading 'build.ninja': No such file or directory
--
Native C compiler: clang (clang 8.0.0 "clang version 8.0.0 (Fedora 8.0.0-1.fc30)")
Build machine cpu family: x86_64
Build machine cpu: x86_64
Program cat found: YES (/usr/bin/cat)

config/meson.build:29:10: ERROR: String '02-rc0' cannot be converted to int

A full log can be found at /root/FC30-64_K4.20_GCC9.1.1/x86_64-native-linuxapp-gcc/63178fc72f724330aead516c61cf0092/dpdk/build-clang-static/meson-logs/meson-log.txt
ninja -C ./build-clang-static
ninja: Entering directory `./build-clang-static'
ninja: error: loading 'build.ninja': No such file or directory
--
Native C compiler: clang (clang 8.0.0 "clang version 8.0.0 (Fedora 8.0.0-1.fc30)")
Build machine cpu family: x86_64
Build machine cpu: x86_64
Program cat found: YES (/usr/bin/cat)

config/meson.build:29:10: ERROR: String '02-rc0' cannot be converted to int

A full log can be found at /root/FC30-64_K4.20_GCC9.1.1/x86_64-native-linuxapp-gcc/63178fc72f724330aead516c61cf0092/dpdk/build-clang-shared/meson-logs/meson-log.txt
ninja -C ./build-clang-shared
ninja: Entering directory `./build-clang-shared'
ninja: error: loading 'build.ninja': No such file or directory
--
Native C compiler: cc (gcc 9.1.1 "cc (GCC) 9.1.1 20190503 (Red Hat 9.1.1-1)")
Build machine cpu family: x86_64
Build machine cpu: x86_64
Program cat found: YES (/usr/bin/cat)

config/meson.build:29:10: ERROR: String '02-rc0' cannot be converted to int

A full log can be found at /root/FC30-64_K4.20_GCC9.1.1/x86_64-native-linuxapp-gcc/63178fc72f724330aead516c61cf0092/dpdk/build-x86-default/meson-logs/meson-log.txt
ninja -C ./build-x86-default
ninja: Entering directory `./build-x86-default'
ninja: error: loading 'build.ninja': No such file or directory


*Meson Build Failed #5:
OS: UB1804-64
Target:./build-gcc-static
Native C compiler: gcc (gcc 7.3.0 "gcc (Ubuntu 7.3.0-27ubuntu1~18.04) 7.3.0")
Build machine cpu family: x86_64
Build machine cpu: x86_64
Program cat found: YES (/bin/cat)

config/meson.build:29:10: ERROR: String '02-rc0' cannot be converted to int

A full log can be found at /root/UB1804-64_K4.15.0_GCC7.3.0/x86_64-native-linuxapp-gcc/63178fc72f724330aead516c61cf0092/dpdk/build-gcc-static/meson-logs/meson-log.txt
ninja -C ./build-gcc-static
ninja: Entering directory `./build-gcc-static'
ninja: error: loading 'build.ninja': No such file or directory
--
Native C compiler: gcc (gcc 7.3.0 "gcc (Ubuntu 7.3.0-27ubuntu1~18.04) 7.3.0")
Build machine cpu family: x86_64
Build machine cpu: x86_64
Program cat found: YES (/bin/cat)

config/meson.build:29:10: ERROR: String '02-rc0' cannot be converted to int

A full log can be found at /root/UB1804-64_K4.15.0_GCC7.3.0/x86_64-native-linuxapp-gcc/63178fc72f724330aead516c61cf0092/dpdk/build-gcc-shared/meson-logs/meson-log.txt
ninja -C ./build-gcc-shared
ninja: Entering directory `./build-gcc-shared'
ninja: error: loading 'build.ninja': No such file or directory
--
Native C compiler: clang (clang 6.0.0-1ubuntu2 "clang version 6.0.0-1ubuntu2 (tags/RELEASE_600/final)")
Build machine cpu family: x86_64
Build machine cpu: x86_64
Program cat found: YES (/bin/cat)

config/meson.build:29:10: ERROR: String '02-rc0' cannot be converted to int

A full log can be found at /root/UB1804-64_K4.15.0_GCC7.3.0/x86_64-native-linuxapp-gcc/63178fc72f724330aead516c61cf0092/dpdk/build-clang-static/meson-logs/meson-log.txt
ninja -C ./build-clang-static
ninja: Entering directory `./build-clang-static'
ninja: error: loading 'build.ninja': No such file or directory
--
Native C compiler: clang (clang 6.0.0-1ubuntu2 "clang version 6.0.0-1ubuntu2 (tags/RELEASE_600/final)")
Build machine cpu family: x86_64
Build machine cpu: x86_64
Program cat found: YES (/bin/cat)

config/meson.build:29:10: ERROR: String '02-rc0' cannot be converted to int

A full log can be found at /root/UB1804-64_K4.15.0_GCC7.3.0/x86_64-native-linuxapp-gcc/63178fc72f724330aead516c61cf0092/dpdk/build-clang-shared/meson-logs/meson-log.txt
ninja -C ./build-clang-shared
ninja: Entering directory `./build-clang-shared'
ninja: error: loading 'build.ninja': No such file or directory
--
Native C compiler: cc (gcc 7.3.0 "cc (Ubuntu 7.3.0-27ubuntu1~18.04) 7.3.0")
Build machine cpu family: x86_64
Build machine cpu: x86_64
Program cat found: YES (/bin/cat)

config/meson.build:29:10: ERROR: String '02-rc0' cannot be converted to int

A full log can be found at /root/UB1804-64_K4.15.0_GCC7.3.0/x86_64-native-linuxapp-gcc/63178fc72f724330aead516c61cf0092/dpdk/build-x86-default/meson-logs/meson-log.txt
ninja -C ./build-x86-default
ninja: Entering directory `./build-x86-default'
ninja: error: loading 'build.ninja': No such file or directory


*Meson Build Failed #6:
OS: FreeBSD12-64
Target:./build-gcc-static
Native C compiler: ccache gcc (gcc 7.3.0 "gcc (FreeBSD Ports Collection) 7.3.0")
Build machine cpu family: x86_64
Build machine cpu: x86_64
Program cat found: YES (/bin/cat)

config/meson.build:29:10: ERROR: String '02-rc0' cannot be converted to int

A full log can be found at /root/FreeBSD12-64_K19.02_GCC7.3.0/x86_64-native-bsdapp-gcc/63178fc72f724330aead516c61cf0092/dpdk/build-gcc-static/meson-logs/meson-log.txt
ninja -C ./build-gcc-static
ninja: Entering directory `./build-gcc-static'
ninja: error: loading 'build.ninja': No such file or directory
--
Native C compiler: ccache gcc (gcc 7.3.0 "gcc (FreeBSD Ports Collection) 7.3.0")
Build machine cpu family: x86_64
Build machine cpu: x86_64
Program cat found: YES (/bin/cat)

config/meson.build:29:10: ERROR: String '02-rc0' cannot be converted to int

A full log can be found at /root/FreeBSD12-64_K19.02_GCC7.3.0/x86_64-native-bsdapp-gcc/63178fc72f724330aead516c61cf0092/dpdk/build-gcc-shared/meson-logs/meson-log.txt
ninja -C ./build-gcc-shared
ninja: Entering directory `./build-gcc-shared'
ninja: error: loading 'build.ninja': No such file or directory
--
Native C compiler: ccache clang (clang 6.0.1 "FreeBSD clang version 6.0.1 (tags/RELEASE_601/final 335540) (based on LLVM 6.0.1)")
Build machine cpu family: x86_64
Build machine cpu: x86_64
Program cat found: YES (/bin/cat)

config/meson.build:29:10: ERROR: String '02-rc0' cannot be converted to int

A full log can be found at /root/FreeBSD12-64_K19.02_GCC7.3.0/x86_64-native-bsdapp-gcc/63178fc72f724330aead516c61cf0092/dpdk/build-clang-static/meson-logs/meson-log.txt
ninja -C ./build-clang-static
ninja: Entering directory `./build-clang-static'
ninja: error: loading 'build.ninja': No such file or directory
--
Native C compiler: ccache clang (clang 6.0.1 "FreeBSD clang version 6.0.1 (tags/RELEASE_601/final 335540) (based on LLVM 6.0.1)")
Build machine cpu family: x86_64
Build machine cpu: x86_64
Program cat found: YES (/bin/cat)

config/meson.build:29:10: ERROR: String '02-rc0' cannot be converted to int

A full log can be found at /root/FreeBSD12-64_K19.02_GCC7.3.0/x86_64-native-bsdapp-gcc/63178fc72f724330aead516c61cf0092/dpdk/build-clang-shared/meson-logs/meson-log.txt
ninja -C ./build-clang-shared
ninja: Entering directory `./build-clang-shared'
ninja: error: loading 'build.ninja': No such file or directory
--
Native C compiler: ccache cc (clang 6.0.1 "FreeBSD clang version 6.0.1 (tags/RELEASE_601/final 335540) (based on LLVM 6.0.1)")
Build machine cpu family: x86_64
Build machine cpu: x86_64
Program cat found: YES (/bin/cat)

config/meson.build:29:10: ERROR: String '02-rc0' cannot be converted to int

A full log can be found at /root/FreeBSD12-64_K19.02_GCC7.3.0/x86_64-native-bsdapp-gcc/63178fc72f724330aead516c61cf0092/dpdk/build-x86-default/meson-logs/meson-log.txt
ninja -C ./build-x86-default
ninja: Entering directory `./build-x86-default'
ninja: error: loading 'build.ninja': No such file or directory


*Meson Build Failed #7:
OS: CENTOS76-64
Target:./build-gcc-static
Native C compiler: gcc (gcc 4.8.5 "gcc (GCC) 4.8.5 20150623 (Red Hat 4.8.5-39)")
Build machine cpu family: x86_64
Build machine cpu: x86_64
Program cat found: YES (/usr/bin/cat)

config/meson.build:29:10: ERROR: String '02-rc0' cannot be converted to int

A full log can be found at /root/CENTOS76-64_K3.10.0_GCC4.8.5/x86_64-native-linuxapp-gcc/63178fc72f724330aead516c61cf0092/dpdk/build-gcc-static/meson-logs/meson-log.txt
ninja -C ./build-gcc-static
ninja: Entering directory `./build-gcc-static'
ninja: error: loading 'build.ninja': No such file or directory
--
Native C compiler: gcc (gcc 4.8.5 "gcc (GCC) 4.8.5 20150623 (Red Hat 4.8.5-39)")
Build machine cpu family: x86_64
Build machine cpu: x86_64
Program cat found: YES (/usr/bin/cat)

config/meson.build:29:10: ERROR: String '02-rc0' cannot be converted to int

A full log can be found at /root/CENTOS76-64_K3.10.0_GCC4.8.5/x86_64-native-linuxapp-gcc/63178fc72f724330aead516c61cf0092/dpdk/build-gcc-shared/meson-logs/meson-log.txt
ninja -C ./build-gcc-shared
ninja: Entering directory `./build-gcc-shared'
ninja: error: loading 'build.ninja': No such file or directory
--
Native C compiler: clang (clang 6.0.0 "clang version 6.0.0 (tags/RELEASE_600/final)")
Build machine cpu family: x86_64
Build machine cpu: x86_64
Program cat found: YES (/usr/bin/cat)

config/meson.build:29:10: ERROR: String '02-rc0' cannot be converted to int

A full log can be found at /root/CENTOS76-64_K3.10.0_GCC4.8.5/x86_64-native-linuxapp-gcc/63178fc72f724330aead516c61cf0092/dpdk/build-clang-static/meson-logs/meson-log.txt
ninja -C ./build-clang-static
ninja: Entering directory `./build-clang-static'
ninja: error: loading 'build.ninja': No such file or directory
--
Native C compiler: clang (clang 6.0.0 "clang version 6.0.0 (tags/RELEASE_600/final)")
Build machine cpu family: x86_64
Build machine cpu: x86_64
Program cat found: YES (/usr/bin/cat)

config/meson.build:29:10: ERROR: String '02-rc0' cannot be converted to int

A full log can be found at /root/CENTOS76-64_K3.10.0_GCC4.8.5/x86_64-native-linuxapp-gcc/63178fc72f724330aead516c61cf0092/dpdk/build-clang-shared/meson-logs/meson-log.txt
ninja -C ./build-clang-shared
ninja: Entering directory `./build-clang-shared'
ninja: error: loading 'build.ninja': No such file or directory
--
Native C compiler: cc (gcc 4.8.5 "cc (GCC) 4.8.5 20150623 (Red Hat 4.8.5-39)")
Build machine cpu family: x86_64
Build machine cpu: x86_64
Program cat found: YES (/usr/bin/cat)

config/meson.build:29:10: ERROR: String '02-rc0' cannot be converted to int

A full log can be found at /root/CENTOS76-64_K3.10.0_GCC4.8.5/x86_64-native-linuxapp-gcc/63178fc72f724330aead516c61cf0092/dpdk/build-x86-default/meson-logs/meson-log.txt
ninja -C ./build-x86-default
ninja: Entering directory `./build-x86-default'
ninja: error: loading 'build.ninja': No such file or directory

DPDK STV team

^ permalink raw reply	[flat|nested] only message in thread

only message in thread, back to index

Thread overview: (only message) (download: mbox.gz / follow: Atom feed)
-- links below jump to the message on this page --
2019-12-02 15:28 [dpdk-test-report] |FAILURE| pw63501version: 20.02-rc0 sys_stv

automatic DPDK test reports

Archives are clonable:
	git clone --mirror http://inbox.dpdk.org/test-report/0 test-report/git/0.git

	# If you have public-inbox 1.1+ installed, you may
	# initialize and index your mirror using the following commands:
	public-inbox-init -V2 test-report test-report/ http://inbox.dpdk.org/test-report \
		test-report@dpdk.org
	public-inbox-index test-report


Newsgroup available over NNTP:
	nntp://inbox.dpdk.org/inbox.dpdk.test-report


AGPL code for this site: git clone https://public-inbox.org/ public-inbox