automatic DPDK test reports
 help / color / Atom feed
* [dpdk-test-report] |FAILURE| pw64135net/ice: fix TSO pkt exceeds allowed buf size issue
@ 2020-01-15  1:12 sys_stv
  0 siblings, 0 replies; only message in thread
From: sys_stv @ 2020-01-15  1:12 UTC (permalink / raw)
  To: test-report

[-- Attachment #1: Type: text/plain, Size: 67494 bytes --]

Test-Label: Intel-compilation
Test-Status: FAILURE
http://dpdk.org/patch/64135

_Compilation issues_

Submitter: Xiaoyun Li <xiaoyun.li@intel.com>
Date: 2019-12-26 06:43:21
Reply_mail: 20191226064321.48237-1-xiaoyun.li@intel.com
DPDK git baseline: Repo:dpdk-next-net-intel, CommitID: 95edbfebfa116dffd3db7fac9a1776317acd7dd9

Makefile build Summary: 23 Builds Done, 0 Successful, 23 Failures

Meson build Summary: 8 Builds Done, 2 Successful, 6 Failures

               +==============================================+===========+==========+
               |                   Makefile                   |   Meson   | Document |
+----------------+------+-------+------+------------+-----------+-----------+----------+
| os             | gcc  | clang | icc  | gcc+shared | gcc+debug | gcc/clang | pdf/html |
+----------------+------+-------+------+------------+-----------+-----------+----------+
| RHEL80-64      | FAIL |       |      |            |           |           |          |
| UB1804-64      | FAIL | FAIL  | FAIL |            |           | FAIL      | pass     |
| UB1604-32      | FAIL |       |      |            |           | FAIL      |          |
| CENTOS77-64    | FAIL | FAIL  | FAIL | FAIL       | FAIL      | FAIL      |          |
| UB1604-64      | FAIL | FAIL  |      |            |           |           |          |
| WIN10-64       |      |       |      |            |           | pass      |          |
| UB1910-64      | FAIL |       |      |            |           |           |          |
| FC31-64        | FAIL | FAIL  |      |            |           | FAIL      |          |
| CENTOS80-64    | FAIL |       |      |            |           |           |          |
| FreeBSD1201-64 | FAIL | FAIL  |      | FAIL       | FAIL      | FAIL      |          |
| RHEL77-64      | FAIL |       |      |            |           |           |          |
| SUSE15-64      | FAIL | FAIL  |      |            |           | FAIL      |          |
+----------------+------+-------+------+------------+-----------+-----------+----------+

Test environment and configuration as below:

** Makefile build **


OS: UB1804-64
	Kernel Version: 4.15.0-20-generic
	CPU info: Intel(R) Xeon(R) CPU E5-2699 v3 @ 2.30GHz
	GCC Version: gcc (Ubuntu 7.3.0-27ubuntu1~18.04) 7.3.0
	Clang Version: 6.0.0-1ubuntu2 (tags/RELEASE_600/final)
	x86_64-native-linuxapp-icc
	x86_64-native-linuxapp-clang
	x86_64-native-linuxapp-gcc


OS: UB1604-32
	Kernel Version: 4.4.0-131-generic
	CPU info: Intel(R) Xeon(R) CPU E5-2699 v3 @ 2.30GHz
	GCC Version: gcc (Ubuntu 5.4.0-6ubuntu1~16.04.11) 5.4.0 20160609
	Clang Version: 3.8.0-2ubuntu4 (tags/RELEASE_380/final)
	i686-native-linuxapp-gcc


OS: CENTOS77-64
	Kernel Version: 3.10.0-1062.9.1.el7.x86_64
	CPU info: Intel(R) Xeon(R) CPU E5-2699 v4 @ 2.20GHz
	GCC Version: gcc (GCC) 4.8.5 20150623 (Red Hat 4.8.5-39)
	Clang Version: 3.4.2 (tags/RELEASE_34/dot2-final)
	x86_64-native-linuxapp-gcc
	x86_64-native-linuxapp-gcc+shared
	x86_64-native-linuxapp-gcc+debug
	x86_64-native-linuxapp-clang
	x86_64-native-linuxapp-icc


OS: UB1910-64
	Kernel Version: 5.3.0-18-generic
	CPU info: Intel(R) Xeon(R) CPU E5-2699 v3 @ 2.30GHz
	GCC Version: gcc (Ubuntu 9.2.1-9ubuntu2) 9.2.1 20191008
	Clang Version: 9.0.0-2 (tags/RELEASE_900/final)
	x86_64-native-linuxapp-gcc


OS: CENTOS80-64
	Kernel Version: 4.18.0-80.11.2.el8_0.x86_64
	CPU info: Intel(R) Xeon(R) CPU E5-2699 v4 @ 2.20GHz
	GCC Version: gcc (GCC) 8.2.1 20180905 (Red Hat 8.2.1-3)
	Clang Version: 7.0.1 (tags/RELEASE_701/final)
	x86_64-native-linuxapp-gcc


OS: UB1604-64
	Kernel Version: 4.4.0-170-generic
	CPU info: Intel(R) Xeon(R) CPU E5-2699 v3 @ 2.30GHz
	GCC Version: gcc (Ubuntu 5.4.0-6ubuntu1~16.04.12) 5.4.0 20160609
	Clang Version: 3.8.0-2ubuntu4 (tags/RELEASE_380/final)
	x86_64-native-linuxapp-clang
	x86_64-native-linuxapp-gcc


OS: FC31-64
	Kernel Version: 5.3.15-300.fc31.x86_64
	CPU info: Intel(R) Xeon(R) CPU E5-2699 v4 @ 2.20GHz
	GCC Version: gcc (GCC) 9.2.1 20190827 (Red Hat 9.2.1-1)
	Clang Version: 9.0.0 (Fedora 9.0.0-1.fc31)
	x86_64-native-linuxapp-gcc
	x86_64-native-linuxapp-clang


OS: RHEL80-64
	Kernel Version: 4.18.0-80.el8.x86_64
	CPU info: Intel(R) Xeon(R) CPU E5-2699 v4 @ 2.20GHz
	GCC Version: gcc (GCC) 8.2.1 20180905 (Red Hat 8.2.1-3)
	Clang Version: 6.0.1 (tags/RELEASE_601/final)
	x86_64-native-linuxapp-gcc


OS: FreeBSD1201-64
	Kernel Version: 12.1-RELEASE
	CPU info: Intel(R) Xeon(R) CPU E5-2699 v4 @ 2.20GHz (2194.98-MHz K8-class CPU)
	GCC Version: gcc (FreeBSD Ports Collection) 9.2.0
	Clang Version: 8.0.1 (tags/RELEASE_801/final 366581) (based on LLVM 8.0.1)
	x86_64-native-bsdapp-gcc+debug
	x86_64-native-bsdapp-gcc+shared
	x86_64-native-bsdapp-clang
	x86_64-native-bsdapp-gcc


OS: RHEL77-64
	Kernel Version: 3.10.0-1062.9.1.el7.x86_64
	CPU info: Intel(R) Xeon(R) CPU E5-2699 v4 @ 2.20GHz
	GCC Version: gcc (GCC) 4.8.5 20150623 (Red Hat 4.8.5-39)
	Clang Version: 3.4.2 (tags/RELEASE_34/dot2-final)
	x86_64-native-linuxapp-gcc


OS: SUSE15-64
	Kernel Version: 4.12.14-lp150.11-default
	CPU info: Intel(R) Xeon(R) CPU E5-2699 v4 @ 2.20GHz
	GCC Version: gcc (SUSE Linux) 7.3.1 20180323 [gcc-7-branch revision 258812]
	Clang Version: 5.0.1 (tags/RELEASE_501/final 312548)
	x86_64-native-linuxapp-gcc
	x86_64-native-linuxapp-clang


** Meson build **


OS: UB1804-64
	Kernel Version: 4.15.0-20-generic
	CPU info: Intel(R) Xeon(R) CPU E5-2699 v4 @ 2.20GHz
	GCC Version: gcc (Ubuntu 7.3.0-27ubuntu1~18.04) 7.3.0
	Clang Version: 6.0.0-1ubuntu2 (tags/RELEASE_600/final)
	x86_64-native-linuxapp-doc
	./build-gcc-static
	./build-gcc-shared
	./build-clang-static
	./build-clang-shared
	./build-x86-default


OS: UB1604-32
	Kernel Version: 4.4.0-131-generic
	CPU info: Intel(R) Xeon(R) CPU E5-2699 v4 @ 2.20GHz
	GCC Version: gcc (Ubuntu 5.4.0-6ubuntu1~16.04.11) 5.4.0 20160609
	Clang Version: 3.8.0-2ubuntu4 (tags/RELEASE_380/final)
	./build-gcc-static
	./build-gcc-shared
	./build-clang-static
	./build-clang-shared
	./build-x86-default


OS: CENTOS77-64
	Kernel Version: 3.10.0-1062.9.1.el7.x86_64
	CPU info: Intel(R) Xeon(R) CPU E5-2699 v4 @ 2.20GHz
	GCC Version: gcc (GCC) 4.8.5 20150623 (Red Hat 4.8.5-39)
	Clang Version: 3.4.2 (tags/RELEASE_34/dot2-final)
	./build-gcc-static
	./build-gcc-shared
	./build-clang-static
	./build-clang-shared
	./build-x86-default


OS: WIN10-64
	Kernel Version: N/A
	CPU info: N/A
	GCC Version: N/A
	Clang Version: Clang 8.0.0
	x86_64-windows-clang


OS: FC31-64
	Kernel Version: 5.3.14-300.fc31.x86_64
	CPU info: Intel(R) Xeon(R) CPU E5-2699 v4 @ 2.20GHz
	GCC Version: gcc (GCC) 9.2.1 20190827 (Red Hat 9.2.1-1)
	Clang Version: 9.0.0 (Fedora 9.0.0-1.fc31)
	./build-gcc-static
	./build-gcc-shared
	./build-clang-static
	./build-clang-shared
	./build-x86-default


OS: FreeBSD1201-64
	Kernel Version: 12.1-RELEASE
	CPU info: Intel(R) Xeon(R) CPU E5-2699 v4 @ 2.20GHz (2194.97-MHz K8-class CPU)
	GCC Version: gcc (FreeBSD Ports Collection) 9.2.0
	Clang Version: 8.0.1 (tags/RELEASE_801/final 366581) (based on LLVM 8.0.1)
	./build-gcc-static
	./build-gcc-shared
	./build-clang-static
	./build-clang-shared
	./build-x86-default


OS: SUSE15-64
	Kernel Version: 4.12.14-lp150.11-default
	CPU info: Intel(R) Xeon(R) CPU E5-2699 v4 @ 2.20GHz
	GCC Version: gcc (SUSE Linux) 7.3.1 20180323 [gcc-7-branch revision 258812]
	Clang Version: 5.0.1 (tags/RELEASE_501/final 312548)
	./build-gcc-static
	./build-gcc-shared
	./build-clang-static
	./build-clang-shared
	./build-x86-default


*Make Build Failed #1:
OS: UB1604-64
Target: x86_64-native-linuxapp-clang
               ^
/root/UB1604-64_K4.4.0_Clang3.8.0/x86_64-native-linuxapp-clang/cb19994c156541a792c8cbd4b541fb26/dpdk/drivers/net/ice/ice_rxtx.c:2615:12: error: use of undeclared identifier 'txr'
                                txd = &txr[tx_id];
                                       ^
2 errors generated.
/root/UB1604-64_K4.4.0_Clang3.8.0/x86_64-native-linuxapp-clang/cb19994c156541a792c8cbd4b541fb26/dpdk/mk/internal/rte.compile-pre.mk:114: recipe for target 'ice_rxtx.o' failed
make[6]: *** [ice_rxtx.o] Error 1
/root/UB1604-64_K4.4.0_Clang3.8.0/x86_64-native-linuxapp-clang/cb19994c156541a792c8cbd4b541fb26/dpdk/mk/rte.subdir.mk:35: recipe for target 'ice' failed
make[5]: *** [ice] Error 2
make[5]: *** Waiting for unfinished jobs....
  CC sfc_port.o
  CC otx2_ethdev_debug.o
  CC ecore_sp_commands.o
  CC otx2_ethdev_devargs.o
--
  PMDINFO qede_ethdev.o.pmd.c
  CC qede_ethdev.o.pmd.o
  LD qede_ethdev.o
  AR librte_pmd_qede.a
  INSTALL-LIB librte_pmd_qede.a
/root/UB1604-64_K4.4.0_Clang3.8.0/x86_64-native-linuxapp-clang/cb19994c156541a792c8cbd4b541fb26/dpdk/mk/rte.subdir.mk:35: recipe for target 'net' failed
make[4]: *** [net] Error 2
/root/UB1604-64_K4.4.0_Clang3.8.0/x86_64-native-linuxapp-clang/cb19994c156541a792c8cbd4b541fb26/dpdk/mk/rte.sdkbuild.mk:46: recipe for target 'drivers' failed
make[3]: *** [drivers] Error 2
/root/UB1604-64_K4.4.0_Clang3.8.0/x86_64-native-linuxapp-clang/cb19994c156541a792c8cbd4b541fb26/dpdk/mk/rte.sdkroot.mk:98: recipe for target 'all' failed
make[2]: *** [all] Error 2
/root/UB1604-64_K4.4.0_Clang3.8.0/x86_64-native-linuxapp-clang/cb19994c156541a792c8cbd4b541fb26/dpdk/mk/rte.sdkinstall.mk:60: recipe for target 'pre_install' failed
make[1]: *** [pre_install] Error 2
/root/UB1604-64_K4.4.0_Clang3.8.0/x86_64-native-linuxapp-clang/cb19994c156541a792c8cbd4b541fb26/dpdk/mk/rte.sdkroot.mk:77: recipe for target 'install' failed
make: *** [install] Error 2


*Make Build Failed #2:
OS: UB1604-32
Target: i686-native-linuxapp-gcc
     txd = &txr[tx_id];
            ^
/root/UB1604-32_K4.4.0_GCC5.4.0/i686-native-linuxapp-gcc/cb19994c156541a792c8cbd4b541fb26/dpdk/drivers/net/ice/ice_rxtx.c:2615:12: note: each undeclared identifier is reported only once for each function it appears in
/root/UB1604-32_K4.4.0_GCC5.4.0/i686-native-linuxapp-gcc/cb19994c156541a792c8cbd4b541fb26/dpdk/drivers/net/ice/ice_rxtx.c: At top level:
cc1: warning: unrecognized command line option ‘-Wno-address-of-packed-member’
/root/UB1604-32_K4.4.0_GCC5.4.0/i686-native-linuxapp-gcc/cb19994c156541a792c8cbd4b541fb26/dpdk/mk/internal/rte.compile-pre.mk:114: recipe for target 'ice_rxtx.o' failed
make[6]: *** [ice_rxtx.o] Error 1
make[6]: *** Waiting for unfinished jobs....
  CC tap_tcmsgs.o
  AR librte_pmd_ixgbe.a
  INSTALL-LIB librte_pmd_ixgbe.a
  CC tap_bpf_api.o
--
== Build drivers/net/vmxnet3
  PMDINFO ice_ethdev.o.pmd.c
  CC ice_ethdev.o.pmd.o
  LD ice_ethdev.o
  CC otx2_ptp.o
/root/UB1604-32_K4.4.0_GCC5.4.0/i686-native-linuxapp-gcc/cb19994c156541a792c8cbd4b541fb26/dpdk/mk/rte.subdir.mk:35: recipe for target 'ice' failed
make[5]: *** [ice] Error 2
make[5]: *** Waiting for unfinished jobs....
  CC otx2_flow.o
  CC otx2_link.o
  AR librte_pmd_tap.a
  INSTALL-LIB librte_pmd_tap.a
--
  PMDINFO qede_ethdev.o.pmd.c
  CC qede_ethdev.o.pmd.o
  LD qede_ethdev.o
  AR librte_pmd_qede.a
  INSTALL-LIB librte_pmd_qede.a
/root/UB1604-32_K4.4.0_GCC5.4.0/i686-native-linuxapp-gcc/cb19994c156541a792c8cbd4b541fb26/dpdk/mk/rte.subdir.mk:35: recipe for target 'net' failed
make[4]: *** [net] Error 2
/root/UB1604-32_K4.4.0_GCC5.4.0/i686-native-linuxapp-gcc/cb19994c156541a792c8cbd4b541fb26/dpdk/mk/rte.sdkbuild.mk:46: recipe for target 'drivers' failed
make[3]: *** [drivers] Error 2
/root/UB1604-32_K4.4.0_GCC5.4.0/i686-native-linuxapp-gcc/cb19994c156541a792c8cbd4b541fb26/dpdk/mk/rte.sdkroot.mk:98: recipe for target 'all' failed
make[2]: *** [all] Error 2
/root/UB1604-32_K4.4.0_GCC5.4.0/i686-native-linuxapp-gcc/cb19994c156541a792c8cbd4b541fb26/dpdk/mk/rte.sdkinstall.mk:60: recipe for target 'pre_install' failed
make[1]: *** [pre_install] Error 2
/root/UB1604-32_K4.4.0_GCC5.4.0/i686-native-linuxapp-gcc/cb19994c156541a792c8cbd4b541fb26/dpdk/mk/rte.sdkroot.mk:77: recipe for target 'install' failed
make: *** [install] Error 2


*Make Build Failed #3:
OS: UB1910-64
Target: x86_64-native-linuxapp-gcc
/root/UB1910-64_K5.3.0_GCC9.2.1/x86_64-native-linuxapp-gcc/cb19994c156541a792c8cbd4b541fb26/dpdk/drivers/net/ice/ice_rxtx.c:2615:12: error: ‘txr’ undeclared (first use in this function); did you mean ‘txn’?
 2615 |     txd = &txr[tx_id];
      |            ^~~
      |            txn
/root/UB1910-64_K5.3.0_GCC9.2.1/x86_64-native-linuxapp-gcc/cb19994c156541a792c8cbd4b541fb26/dpdk/drivers/net/ice/ice_rxtx.c:2615:12: note: each undeclared identifier is reported only once for each function it appears in
make[6]: *** [/root/UB1910-64_K5.3.0_GCC9.2.1/x86_64-native-linuxapp-gcc/cb19994c156541a792c8cbd4b541fb26/dpdk/mk/internal/rte.compile-pre.mk:116: ice_rxtx.o] Error 1
make[6]: *** Waiting for unfinished jobs....
  CC nfp_nffw.o
  PMDINFO bnxt_ethdev.o.pmd.c
  CC octeontx_bgx.o
  CC bnxt_ethdev.o.pmd.o
--
  PMDINFO ice_ethdev.o.pmd.c
  CC ice_ethdev.o.pmd.o
  LD ice_ethdev.o
  CC i40e_rxtx_vec_avx2.o
== Build drivers/net/ring
make[5]: *** [/root/UB1910-64_K5.3.0_GCC9.2.1/x86_64-native-linuxapp-gcc/cb19994c156541a792c8cbd4b541fb26/dpdk/mk/rte.subdir.mk:37: ice] Error 2
make[5]: *** Waiting for unfinished jobs....
  CC nfp_rtsym.o
  CC bnxt_flow.o
  CC ixgbe_ethdev.o
  CC nfp_nsp.o
--
  AR librte_pmd_octeontx2.a
  INSTALL-LIB librte_pmd_octeontx2.a
  LD qede_ethdev.o
  AR librte_pmd_qede.a
  INSTALL-LIB librte_pmd_qede.a
make[4]: *** [/root/UB1910-64_K5.3.0_GCC9.2.1/x86_64-native-linuxapp-gcc/cb19994c156541a792c8cbd4b541fb26/dpdk/mk/rte.subdir.mk:35: net] Error 2
make[3]: *** [/root/UB1910-64_K5.3.0_GCC9.2.1/x86_64-native-linuxapp-gcc/cb19994c156541a792c8cbd4b541fb26/dpdk/mk/rte.sdkbuild.mk:46: drivers] Error 2
make[2]: *** [/root/UB1910-64_K5.3.0_GCC9.2.1/x86_64-native-linuxapp-gcc/cb19994c156541a792c8cbd4b541fb26/dpdk/mk/rte.sdkroot.mk:99: all] Error 2
make[1]: *** [/root/UB1910-64_K5.3.0_GCC9.2.1/x86_64-native-linuxapp-gcc/cb19994c156541a792c8cbd4b541fb26/dpdk/mk/rte.sdkinstall.mk:61: pre_install] Error 2
make: *** [/root/UB1910-64_K5.3.0_GCC9.2.1/x86_64-native-linuxapp-gcc/cb19994c156541a792c8cbd4b541fb26/dpdk/mk/rte.sdkroot.mk:77: install] Error 2


*Make Build Failed #4:
OS: UB1804-64
Target: x86_64-native-linuxapp-icc
/root/UB1804-64_K4.15.0_ICC19.0.0/x86_64-native-linuxapp-icc/cb19994c156541a792c8cbd4b541fb26/dpdk/drivers/net/ice/ice_rxtx.c(2615): error: identifier "txr" is undefined
  				txd = &txr[tx_id];
  				       ^

compilation aborted for /root/UB1804-64_K4.15.0_ICC19.0.0/x86_64-native-linuxapp-icc/cb19994c156541a792c8cbd4b541fb26/dpdk/drivers/net/ice/ice_rxtx.c (code 2)
/root/UB1804-64_K4.15.0_ICC19.0.0/x86_64-native-linuxapp-icc/cb19994c156541a792c8cbd4b541fb26/dpdk/mk/internal/rte.compile-pre.mk:114: recipe for target 'ice_rxtx.o' failed
make[6]: *** [ice_rxtx.o] Error 2
make[6]: *** Waiting for unfinished jobs....
  CC i40e_ethdev_vf.o
  CC bnxt_rxq.o
  CC ixgbe_dcb.o
  CC nfp_crc.o
--
  CC ice_ethdev.o.pmd.o
  PMDINFO i40e_ethdev_vf.o.pmd.c
  CC i40e_ethdev_vf.o.pmd.o
  LD ice_ethdev.o
  LD i40e_ethdev_vf.o
/root/UB1804-64_K4.15.0_ICC19.0.0/x86_64-native-linuxapp-icc/cb19994c156541a792c8cbd4b541fb26/dpdk/mk/rte.subdir.mk:35: recipe for target 'ice' failed
make[5]: *** [ice] Error 2
make[5]: *** Waiting for unfinished jobs....
  CC nfp_nsp_cmds.o
make[6]: Warning: File 'ixgbe_rxtx.c' has modification time 4347 s in the future
  CC ixgbe_mbx.o
  CC i40e_fdir.o
--
  AR librte_pmd_nfp.a
  INSTALL-LIB librte_pmd_nfp.a
  AR librte_pmd_ixgbe.a
  INSTALL-LIB librte_pmd_ixgbe.a
make[6]: warning:  Clock skew detected.  Your build may be incomplete.
/root/UB1804-64_K4.15.0_ICC19.0.0/x86_64-native-linuxapp-icc/cb19994c156541a792c8cbd4b541fb26/dpdk/mk/rte.subdir.mk:35: recipe for target 'net' failed
make[4]: *** [net] Error 2
/root/UB1804-64_K4.15.0_ICC19.0.0/x86_64-native-linuxapp-icc/cb19994c156541a792c8cbd4b541fb26/dpdk/mk/rte.sdkbuild.mk:46: recipe for target 'drivers' failed
make[3]: *** [drivers] Error 2
/root/UB1804-64_K4.15.0_ICC19.0.0/x86_64-native-linuxapp-icc/cb19994c156541a792c8cbd4b541fb26/dpdk/mk/rte.sdkroot.mk:98: recipe for target 'all' failed
make[2]: *** [all] Error 2
/root/UB1804-64_K4.15.0_ICC19.0.0/x86_64-native-linuxapp-icc/cb19994c156541a792c8cbd4b541fb26/dpdk/mk/rte.sdkinstall.mk:60: recipe for target 'pre_install' failed
make[1]: *** [pre_install] Error 2
/root/UB1804-64_K4.15.0_ICC19.0.0/x86_64-native-linuxapp-icc/cb19994c156541a792c8cbd4b541fb26/dpdk/mk/rte.sdkroot.mk:77: recipe for target 'install' failed
make: *** [install] Error 2


*Make Build Failed #5:
OS: UB1804-64
Target: x86_64-native-linuxapp-clang
  CC rte_eth_memif.o.pmd.o
/root/UB1804-64_K4.15.0_Clang6.0.0/x86_64-native-linuxapp-clang/cb19994c156541a792c8cbd4b541fb26/dpdk/drivers/net/ice/ice_rxtx.c:2615:12: error: use of undeclared identifier 'txr'
                                txd = &txr[tx_id];
                                       ^
2 errors generated.
/root/UB1804-64_K4.15.0_Clang6.0.0/x86_64-native-linuxapp-clang/cb19994c156541a792c8cbd4b541fb26/dpdk/mk/internal/rte.compile-pre.mk:114: recipe for target 'ice_rxtx.o' failed
make[6]: *** [ice_rxtx.o] Error 1
make[6]: *** Waiting for unfinished jobs....
  CC nfp_resource.o
  LD rte_eth_memif.o
  CC hn_rndis.o
  CC memif_socket.o
--
  CC rte_eth_null.o
  LD ice_ethdev.o
  CC hn_nvs.o
  CC nfp_hwinfo.o
  CC octeontx_rxtx.o
/root/UB1804-64_K4.15.0_Clang6.0.0/x86_64-native-linuxapp-clang/cb19994c156541a792c8cbd4b541fb26/dpdk/mk/rte.subdir.mk:35: recipe for target 'ice' failed
make[5]: *** [ice] Error 2
make[5]: *** Waiting for unfinished jobs....
  CC octeontx_pkovf.o
  CC nfp_rtsym.o
  PMDINFO octeontx_pkovf.o.pmd.c
  CC octeontx_pkovf.o.pmd.o
--
  AR librte_pmd_ixgbe.a
  INSTALL-LIB librte_pmd_ixgbe.a
make[6]: warning:  Clock skew detected.  Your build may be incomplete.
  AR librte_pmd_bnxt.a
  INSTALL-LIB librte_pmd_bnxt.a
/root/UB1804-64_K4.15.0_Clang6.0.0/x86_64-native-linuxapp-clang/cb19994c156541a792c8cbd4b541fb26/dpdk/mk/rte.subdir.mk:35: recipe for target 'net' failed
make[4]: *** [net] Error 2
/root/UB1804-64_K4.15.0_Clang6.0.0/x86_64-native-linuxapp-clang/cb19994c156541a792c8cbd4b541fb26/dpdk/mk/rte.sdkbuild.mk:46: recipe for target 'drivers' failed
make[3]: *** [drivers] Error 2
/root/UB1804-64_K4.15.0_Clang6.0.0/x86_64-native-linuxapp-clang/cb19994c156541a792c8cbd4b541fb26/dpdk/mk/rte.sdkroot.mk:98: recipe for target 'all' failed
make[2]: *** [all] Error 2
/root/UB1804-64_K4.15.0_Clang6.0.0/x86_64-native-linuxapp-clang/cb19994c156541a792c8cbd4b541fb26/dpdk/mk/rte.sdkinstall.mk:60: recipe for target 'pre_install' failed
make[1]: *** [pre_install] Error 2
/root/UB1804-64_K4.15.0_Clang6.0.0/x86_64-native-linuxapp-clang/cb19994c156541a792c8cbd4b541fb26/dpdk/mk/rte.sdkroot.mk:77: recipe for target 'install' failed
make: *** [install] Error 2


*Make Build Failed #6:
OS: CENTOS77-64
Target: x86_64-native-linuxapp-gcc
  CC octeontx_rxtx.o
  CC nfp_nsp.o
  CC nfp_nsp_cmds.o
/root/CENTOS77-64_K3.10.0_GCC4.8.5/x86_64-native-linuxapp-gcc/cb19994c156541a792c8cbd4b541fb26/dpdk/drivers/net/ice/ice_rxtx.c: At top level:
cc1: warning: unrecognized command line option "-Wno-address-of-packed-member" [enabled by default]
make[6]: *** [ice_rxtx.o] Error 1
make[5]: *** [ice] Error 2
make[5]: *** Waiting for unfinished jobs....
  CC otx2_rx.o
  CC bnxt_hwrm.o
  CC otx2_tx.o
  CC ixgbe_rxtx.o
--
  LD otx2_ethdev.o
  AR librte_pmd_octeontx2.a
  INSTALL-LIB librte_pmd_octeontx2.a
  AR librte_pmd_i40e.a
  INSTALL-LIB librte_pmd_i40e.a
make[4]: *** [net] Error 2
make[3]: *** [drivers] Error 2
make[2]: *** [all] Error 2
make[1]: *** [pre_install] Error 2
make: *** [install] Error 2


*Make Build Failed #7:
OS: CENTOS80-64
Target: x86_64-native-linuxapp-gcc
            txn
/root/CENTOS80-64_K4.18.0_GCC8.2.1/x86_64-native-linuxapp-gcc/cb19994c156541a792c8cbd4b541fb26/dpdk/drivers/net/ice/ice_rxtx.c:2615:12: note: each undeclared identifier is reported only once for each function it appears in
  CC bnxt_rxr.o
/root/CENTOS80-64_K4.18.0_GCC8.2.1/x86_64-native-linuxapp-gcc/cb19994c156541a792c8cbd4b541fb26/dpdk/drivers/net/ice/ice_rxtx.c: At top level:
cc1: warning: unrecognized command line option ‘-Wno-address-of-packed-member’
make[6]: *** [/root/CENTOS80-64_K4.18.0_GCC8.2.1/x86_64-native-linuxapp-gcc/cb19994c156541a792c8cbd4b541fb26/dpdk/mk/internal/rte.compile-pre.mk:114: ice_rxtx.o] Error 1
make[5]: *** [/root/CENTOS80-64_K4.18.0_GCC8.2.1/x86_64-native-linuxapp-gcc/cb19994c156541a792c8cbd4b541fb26/dpdk/mk/rte.subdir.mk:35: ice] Error 2
make[5]: *** Waiting for unfinished jobs....
  CC bnxt_stats.o
  CC sfc_mcdi.o
  CC nicvf_hw.o
  AR librte_pmd_i40e.a
--
== Build drivers/crypto/nitrox
  CC caam_jr_hw.o
  CC caam_jr_uio.o
  AR librte_pmd_sfc_efx.a
  INSTALL-LIB librte_pmd_sfc_efx.a
make[4]: *** [/root/CENTOS80-64_K4.18.0_GCC8.2.1/x86_64-native-linuxapp-gcc/cb19994c156541a792c8cbd4b541fb26/dpdk/mk/rte.subdir.mk:35: net] Error 2
make[4]: *** Waiting for unfinished jobs....
  CC virtqueue.o
  CC virtio_pci.o
  CC virtio_rxtx.o
  CC virtio_cryptodev.o
--
  INSTALL-LIB librte_pmd_virtio_crypto.a
  AR librte_pmd_caam_jr.a
  INSTALL-LIB librte_pmd_caam_jr.a
  AR librte_pmd_nitrox.a
  INSTALL-LIB librte_pmd_nitrox.a
make[3]: *** [/root/CENTOS80-64_K4.18.0_GCC8.2.1/x86_64-native-linuxapp-gcc/cb19994c156541a792c8cbd4b541fb26/dpdk/mk/rte.sdkbuild.mk:46: drivers] Error 2
make[2]: *** [/root/CENTOS80-64_K4.18.0_GCC8.2.1/x86_64-native-linuxapp-gcc/cb19994c156541a792c8cbd4b541fb26/dpdk/mk/rte.sdkroot.mk:99: all] Error 2
make[1]: *** [/root/CENTOS80-64_K4.18.0_GCC8.2.1/x86_64-native-linuxapp-gcc/cb19994c156541a792c8cbd4b541fb26/dpdk/mk/rte.sdkinstall.mk:61: pre_install] Error 2
make: *** [/root/CENTOS80-64_K4.18.0_GCC8.2.1/x86_64-native-linuxapp-gcc/cb19994c156541a792c8cbd4b541fb26/dpdk/mk/rte.sdkroot.mk:77: install] Error 2


*Make Build Failed #8:
OS: CENTOS77-64
Target: x86_64-native-linuxapp-gcc+shared
     txd = &txr[tx_id];
            ^
/root/CENTOS77-64_K3.10.0_GCC4.8.5/x86_64-native-linuxapp-gcc+shared/cb19994c156541a792c8cbd4b541fb26/dpdk/drivers/net/ice/ice_rxtx.c:2615:12: note: each undeclared identifier is reported only once for each function it appears in
/root/CENTOS77-64_K3.10.0_GCC4.8.5/x86_64-native-linuxapp-gcc+shared/cb19994c156541a792c8cbd4b541fb26/dpdk/drivers/net/ice/ice_rxtx.c: At top level:
cc1: warning: unrecognized command line option "-Wno-address-of-packed-member" [enabled by default]
make[6]: *** [ice_rxtx.o] Error 1
make[6]: *** Waiting for unfinished jobs....
  CC ixgbe_ipsec.o
  PMDINFO nfp_net.o.pmd.c
  CC nfp_net.o.pmd.o
  PMDINFO rte_eth_pcap.o.pmd.c
--
  CC ice_ethdev.o.pmd.o
  LD ice_ethdev.o
  CC bnxt_stats.o
  CC otx2_tx.o
  CC bnxt_txq.o
make[5]: *** [ice] Error 2
make[5]: *** Waiting for unfinished jobs....
  CC bnxt_txr.o
  CC ixgbe_tm.o
  CC i40e_rxtx_vec_sse.o
  CC ecore_dev.o
--
  CC medford2_nic.o
  LD librte_pmd_sfc_efx.so.20.0.1
  INSTALL-LIB librte_pmd_sfc_efx.so.20.0.1
  LD librte_pmd_qede.so.20.0.1
  INSTALL-LIB librte_pmd_qede.so.20.0.1
make[4]: *** [net] Error 2
make[3]: *** [drivers] Error 2
make[2]: *** [all] Error 2
make[1]: *** [pre_install] Error 2
make: *** [install] Error 2


*Make Build Failed #9:
OS: CENTOS77-64
Target: x86_64-native-linuxapp-gcc+debug
            ^
/root/CENTOS77-64_K3.10.0_GCC4.8.5/x86_64-native-linuxapp-gcc+debug/cb19994c156541a792c8cbd4b541fb26/dpdk/drivers/net/ice/ice_rxtx.c:2615:12: note: each undeclared identifier is reported only once for each function it appears in
  CC ecore_init_fw_funcs.o
/root/CENTOS77-64_K3.10.0_GCC4.8.5/x86_64-native-linuxapp-gcc+debug/cb19994c156541a792c8cbd4b541fb26/dpdk/drivers/net/ice/ice_rxtx.c: At top level:
cc1: warning: unrecognized command line option "-Wno-address-of-packed-member" [enabled by default]
make[6]: *** [ice_rxtx.o] Error 1
make[6]: *** Waiting for unfinished jobs....
  CC tap_tcmsgs.o
  CC sfc_filter.o
  CC ixgbe_tm.o
  CC tap_bpf_api.o
--
  CC ecore_spq.o
  CC sfc_dp.o
  INSTALL-LIB librte_pmd_ixgbe.a
== Build drivers/net/vdev_netvsc
  AR librte_pmd_tap.a
make[5]: *** [ice] Error 2
make[5]: *** Waiting for unfinished jobs....
  CC bnxt_vnic.o
  INSTALL-LIB librte_pmd_tap.a
  CC bnxt_irq.o
  CC sfc_ef10_rx.o
--
  INSTALL-LIB librte_pmd_sfc_efx.a
  AR librte_pmd_octeontx2.a
  INSTALL-LIB librte_pmd_octeontx2.a
  AR librte_pmd_qede.a
  INSTALL-LIB librte_pmd_qede.a
make[4]: *** [net] Error 2
make[3]: *** [drivers] Error 2
make[2]: *** [all] Error 2
make[1]: *** [pre_install] Error 2
make: *** [install] Error 2


*Make Build Failed #10:
OS: CENTOS77-64
Target: x86_64-native-linuxapp-clang
                                txd = &txr[tx_id];
                                       ^
2 errors generated.
  CC bnxt_ethdev.o.pmd.o
  CC ice_rxtx_vec_sse.o
make[6]: *** [ice_rxtx.o] Error 1
make[6]: *** Waiting for unfinished jobs....
  LD bnxt_ethdev.o
  CC bnxt_filter.o
  CC ixgbe_rxtx.o
  CC rte_eth_pcap.o
--
  CC bnxt_rxq.o
  PMDINFO rte_eth_ring.o.pmd.c
  CC rte_eth_ring.o.pmd.o
  LD rte_eth_ring.o
  CC sfc.o
make[5]: *** [ice] Error 2
make[5]: *** Waiting for unfinished jobs....
  CC ecore_hw.o
  AR librte_pmd_ring.a
  PMDINFO sfc_ethdev.o.pmd.c
  CC sfc_ethdev.o.pmd.o
--
  CC hunt_nic.o
  CC medford_nic.o
  CC medford2_nic.o
  AR librte_pmd_sfc_efx.a
  INSTALL-LIB librte_pmd_sfc_efx.a
make[4]: *** [net] Error 2
make[3]: *** [drivers] Error 2
make[2]: *** [all] Error 2
make[1]: *** [pre_install] Error 2
make: *** [install] Error 2


*Make Build Failed #11:
OS: CENTOS77-64
Target: x86_64-native-linuxapp-icc
/root/CENTOS77-64_K3.10.0_ICC19.0.0/x86_64-native-linuxapp-icc/cb19994c156541a792c8cbd4b541fb26/dpdk/drivers/net/ice/ice_rxtx.c(2615): error: identifier "txr" is undefined
  				txd = &txr[tx_id];
  				       ^

compilation aborted for /root/CENTOS77-64_K3.10.0_ICC19.0.0/x86_64-native-linuxapp-icc/cb19994c156541a792c8cbd4b541fb26/dpdk/drivers/net/ice/ice_rxtx.c (code 2)
make[6]: *** [ice_rxtx.o] Error 2
make[5]: *** [ice] Error 2
make[5]: *** Waiting for unfinished jobs....
  CC bnxt_txq.o
  AR librte_pmd_pcap.a
  INSTALL-LIB librte_pmd_pcap.a
  CC bnxt_txr.o
--
  LD qede_ethdev.o
  AR librte_pmd_qede.a
  INSTALL-LIB librte_pmd_qede.a
  AR librte_pmd_octeontx2.a
  INSTALL-LIB librte_pmd_octeontx2.a
make[4]: *** [net] Error 2
make[3]: *** [drivers] Error 2
make[2]: *** [all] Error 2
make[1]: *** [pre_install] Error 2
make: *** [install] Error 2


*Make Build Failed #12:
OS: FC31-64
Target: x86_64-native-linuxapp-gcc
/root/FC31-64_K5.3.14_GCC9.2.1/x86_64-native-linuxapp-gcc/cb19994c156541a792c8cbd4b541fb26/dpdk/drivers/net/ice/ice_rxtx.c:2615:12: error: ‘txr’ undeclared (first use in this function); did you mean ‘txn’?
 2615 |     txd = &txr[tx_id];
      |            ^~~
      |            txn
/root/FC31-64_K5.3.14_GCC9.2.1/x86_64-native-linuxapp-gcc/cb19994c156541a792c8cbd4b541fb26/dpdk/drivers/net/ice/ice_rxtx.c:2615:12: note: each undeclared identifier is reported only once for each function it appears in
make[6]: *** [/root/FC31-64_K5.3.14_GCC9.2.1/x86_64-native-linuxapp-gcc/cb19994c156541a792c8cbd4b541fb26/dpdk/mk/internal/rte.compile-pre.mk:116: ice_rxtx.o] Error 1
make[6]: *** Waiting for unfinished jobs....
  CC lio_23xx_vf.o
  CC ixgbe_fdir.o
  AR librte_pmd_hinic.a
  INSTALL-LIB librte_pmd_hinic.a
--
  CC rte_eth_memif.o.pmd.o
  PMDINFO hn_ethdev.o.pmd.c
  LD rte_eth_memif.o
  CC hn_ethdev.o.pmd.o
  LD hn_ethdev.o
make[5]: *** [/root/FC31-64_K5.3.14_GCC9.2.1/x86_64-native-linuxapp-gcc/cb19994c156541a792c8cbd4b541fb26/dpdk/mk/rte.subdir.mk:37: ice] Error 2
make[5]: *** Waiting for unfinished jobs....
  CC hn_nvs.o
  CC hn_vf.o
  CC memif_socket.o
  AR librte_pmd_lio.a
--
  PMDINFO nfp_net.o.pmd.c
  CC nfp_net.o.pmd.o
  LD nfp_net.o
  AR librte_pmd_nfp.a
  INSTALL-LIB librte_pmd_nfp.a
make[4]: *** [/root/FC31-64_K5.3.14_GCC9.2.1/x86_64-native-linuxapp-gcc/cb19994c156541a792c8cbd4b541fb26/dpdk/mk/rte.subdir.mk:35: net] Error 2
make[3]: *** [/root/FC31-64_K5.3.14_GCC9.2.1/x86_64-native-linuxapp-gcc/cb19994c156541a792c8cbd4b541fb26/dpdk/mk/rte.sdkbuild.mk:46: drivers] Error 2
make[2]: *** [/root/FC31-64_K5.3.14_GCC9.2.1/x86_64-native-linuxapp-gcc/cb19994c156541a792c8cbd4b541fb26/dpdk/mk/rte.sdkroot.mk:99: all] Error 2
make[1]: *** [/root/FC31-64_K5.3.14_GCC9.2.1/x86_64-native-linuxapp-gcc/cb19994c156541a792c8cbd4b541fb26/dpdk/mk/rte.sdkinstall.mk:61: pre_install] Error 2
make: *** [/root/FC31-64_K5.3.14_GCC9.2.1/x86_64-native-linuxapp-gcc/cb19994c156541a792c8cbd4b541fb26/dpdk/mk/rte.sdkroot.mk:77: install] Error 2


*Make Build Failed #13:
OS: SUSE15-64
Target: x86_64-native-linuxapp-gcc
            ^~~
            txn
/root/SUSE15-64_K4.12.14_GCC7.3.1/x86_64-native-linuxapp-gcc/cb19994c156541a792c8cbd4b541fb26/dpdk/drivers/net/ice/ice_rxtx.c:2615:12: note: each undeclared identifier is reported only once for each function it appears in
/root/SUSE15-64_K4.12.14_GCC7.3.1/x86_64-native-linuxapp-gcc/cb19994c156541a792c8cbd4b541fb26/dpdk/drivers/net/ice/ice_rxtx.c: At top level:
cc1: warning: unrecognized command line option ‘-Wno-address-of-packed-member’
make[6]: *** [/root/SUSE15-64_K4.12.14_GCC7.3.1/x86_64-native-linuxapp-gcc/cb19994c156541a792c8cbd4b541fb26/dpdk/mk/internal/rte.compile-pre.mk:116: ice_rxtx.o] Error 1
make[6]: *** Waiting for unfinished jobs....
  CC bnxt_filter.o
== Build drivers/net/octeontx2
== Build drivers/net/pcap
  CC nfp_rtsym.o
--
  CC bnxt_ethdev.o.pmd.o
  LD bnxt_ethdev.o
  CC nfp_nsp_cmds.o
  CC otx2_rx.o
  CC rte_eth_pcap.o
make[5]: *** [/root/SUSE15-64_K4.12.14_GCC7.3.1/x86_64-native-linuxapp-gcc/cb19994c156541a792c8cbd4b541fb26/dpdk/mk/rte.subdir.mk:37: ice] Error 2
make[5]: *** Waiting for unfinished jobs....
  CC otx2_tx.o
  CC nfp_nsp_eth.o
  SYMLINK-FILE include/rte_eth_ring.h
  CC rte_eth_ring.o
--
  CC hunt_nic.o
  CC medford_nic.o
  CC medford2_nic.o
  AR librte_pmd_sfc_efx.a
  INSTALL-LIB librte_pmd_sfc_efx.a
make[4]: *** [/root/SUSE15-64_K4.12.14_GCC7.3.1/x86_64-native-linuxapp-gcc/cb19994c156541a792c8cbd4b541fb26/dpdk/mk/rte.subdir.mk:35: net] Error 2
make[3]: *** [/root/SUSE15-64_K4.12.14_GCC7.3.1/x86_64-native-linuxapp-gcc/cb19994c156541a792c8cbd4b541fb26/dpdk/mk/rte.sdkbuild.mk:46: drivers] Error 2
make[2]: *** [/root/SUSE15-64_K4.12.14_GCC7.3.1/x86_64-native-linuxapp-gcc/cb19994c156541a792c8cbd4b541fb26/dpdk/mk/rte.sdkroot.mk:99: all] Error 2
make[1]: *** [/root/SUSE15-64_K4.12.14_GCC7.3.1/x86_64-native-linuxapp-gcc/cb19994c156541a792c8cbd4b541fb26/dpdk/mk/rte.sdkinstall.mk:61: pre_install] Error 2
make: *** [/root/SUSE15-64_K4.12.14_GCC7.3.1/x86_64-native-linuxapp-gcc/cb19994c156541a792c8cbd4b541fb26/dpdk/mk/rte.sdkroot.mk:77: install] Error 2


*Make Build Failed #14:
OS: RHEL80-64
Target: x86_64-native-linuxapp-gcc
            ^~~
            txn
/root/RHEL80-64_K3.10.0_GCC8.2.1/x86_64-native-linuxapp-gcc/cb19994c156541a792c8cbd4b541fb26/dpdk/drivers/net/ice/ice_rxtx.c:2615:12: note: each undeclared identifier is reported only once for each function it appears in
/root/RHEL80-64_K3.10.0_GCC8.2.1/x86_64-native-linuxapp-gcc/cb19994c156541a792c8cbd4b541fb26/dpdk/drivers/net/ice/ice_rxtx.c: At top level:
cc1: warning: unrecognized command line option ‘-Wno-address-of-packed-member’
make[6]: *** [/root/RHEL80-64_K3.10.0_GCC8.2.1/x86_64-native-linuxapp-gcc/cb19994c156541a792c8cbd4b541fb26/dpdk/mk/internal/rte.compile-pre.mk:116: ice_rxtx.o] Error 1
make[5]: *** [/root/RHEL80-64_K3.10.0_GCC8.2.1/x86_64-native-linuxapp-gcc/cb19994c156541a792c8cbd4b541fb26/dpdk/mk/rte.subdir.mk:35: ice] Error 2
make[5]: *** Waiting for unfinished jobs....
  CC ecore_spq.o
  CC tap_bpf_api.o
  CC bnxt_rxq.o
  CC ixgbe_phy.o
--
  CC hunt_nic.o
  CC medford_nic.o
  CC medford2_nic.o
  AR librte_pmd_sfc_efx.a
  INSTALL-LIB librte_pmd_sfc_efx.a
make[4]: *** [/root/RHEL80-64_K3.10.0_GCC8.2.1/x86_64-native-linuxapp-gcc/cb19994c156541a792c8cbd4b541fb26/dpdk/mk/rte.subdir.mk:35: net] Error 2
make[3]: *** [/root/RHEL80-64_K3.10.0_GCC8.2.1/x86_64-native-linuxapp-gcc/cb19994c156541a792c8cbd4b541fb26/dpdk/mk/rte.sdkbuild.mk:46: drivers] Error 2
make[2]: *** [/root/RHEL80-64_K3.10.0_GCC8.2.1/x86_64-native-linuxapp-gcc/cb19994c156541a792c8cbd4b541fb26/dpdk/mk/rte.sdkroot.mk:99: all] Error 2
make[1]: *** [/root/RHEL80-64_K3.10.0_GCC8.2.1/x86_64-native-linuxapp-gcc/cb19994c156541a792c8cbd4b541fb26/dpdk/mk/rte.sdkinstall.mk:61: pre_install] Error 2
make: *** [/root/RHEL80-64_K3.10.0_GCC8.2.1/x86_64-native-linuxapp-gcc/cb19994c156541a792c8cbd4b541fb26/dpdk/mk/rte.sdkroot.mk:77: install] Error 2


*Make Build Failed #15:
OS: RHEL77-64
Target: x86_64-native-linuxapp-gcc
            ^
/root/RHEL77-64_K3.10.0_GCC4.8.5/x86_64-native-linuxapp-gcc/cb19994c156541a792c8cbd4b541fb26/dpdk/drivers/net/ice/ice_rxtx.c:2615:12: note: each undeclared identifier is reported only once for each function it appears in
  CC rte_pmd_ixgbe.o
/root/RHEL77-64_K3.10.0_GCC4.8.5/x86_64-native-linuxapp-gcc/cb19994c156541a792c8cbd4b541fb26/dpdk/drivers/net/ice/ice_rxtx.c: At top level:
cc1: warning: unrecognized command line option "-Wno-address-of-packed-member" [enabled by default]
make[6]: *** [ice_rxtx.o] Error 1
make[5]: *** [ice] Error 2
make[5]: *** Waiting for unfinished jobs....
  CC tap_intr.o
  CC sfc_tso.o
  CC sfc_filter.o
  AR librte_pmd_kni.a
--
  CC medford2_nic.o
  AR librte_pmd_sfc_efx.a
  INSTALL-LIB librte_pmd_sfc_efx.a
  AR librte_pmd_qede.a
  INSTALL-LIB librte_pmd_qede.a
make[4]: *** [net] Error 2
make[3]: *** [drivers] Error 2
make[2]: *** [all] Error 2
make[1]: *** [pre_install] Error 2
make: *** [install] Error 2


*Make Build Failed #16:
OS: SUSE15-64
Target: x86_64-native-linuxapp-clang
               ^
/root/SUSE15-64_K4.12.14_Clang5.0.1/x86_64-native-linuxapp-clang/cb19994c156541a792c8cbd4b541fb26/dpdk/drivers/net/ice/ice_rxtx.c:2615:12: error: use of undeclared identifier 'txr'
                                txd = &txr[tx_id];
                                       ^
2 errors generated.
make[6]: *** [/root/SUSE15-64_K4.12.14_Clang5.0.1/x86_64-native-linuxapp-clang/cb19994c156541a792c8cbd4b541fb26/dpdk/mk/internal/rte.compile-pre.mk:116: ice_rxtx.o] Error 1
make[5]: *** [/root/SUSE15-64_K4.12.14_Clang5.0.1/x86_64-native-linuxapp-clang/cb19994c156541a792c8cbd4b541fb26/dpdk/mk/rte.subdir.mk:37: ice] Error 2
make[5]: *** Waiting for unfinished jobs....
  CC nfp_nsp_cmds.o
  CC bnxt_hwrm.o
  CC ixgbe_fdir.o
  CC nfp_nsp_eth.o
--
  INSTALL-LIB librte_pmd_ixgbe.a
  AR librte_pmd_i40e.a
  INSTALL-LIB librte_pmd_i40e.a
  AR librte_pmd_bnxt.a
  INSTALL-LIB librte_pmd_bnxt.a
make[4]: *** [/root/SUSE15-64_K4.12.14_Clang5.0.1/x86_64-native-linuxapp-clang/cb19994c156541a792c8cbd4b541fb26/dpdk/mk/rte.subdir.mk:35: net] Error 2
make[3]: *** [/root/SUSE15-64_K4.12.14_Clang5.0.1/x86_64-native-linuxapp-clang/cb19994c156541a792c8cbd4b541fb26/dpdk/mk/rte.sdkbuild.mk:46: drivers] Error 2
make[2]: *** [/root/SUSE15-64_K4.12.14_Clang5.0.1/x86_64-native-linuxapp-clang/cb19994c156541a792c8cbd4b541fb26/dpdk/mk/rte.sdkroot.mk:99: all] Error 2
make[1]: *** [/root/SUSE15-64_K4.12.14_Clang5.0.1/x86_64-native-linuxapp-clang/cb19994c156541a792c8cbd4b541fb26/dpdk/mk/rte.sdkinstall.mk:61: pre_install] Error 2
make: *** [/root/SUSE15-64_K4.12.14_Clang5.0.1/x86_64-native-linuxapp-clang/cb19994c156541a792c8cbd4b541fb26/dpdk/mk/rte.sdkroot.mk:77: install] Error 2


*Make Build Failed #17:
OS: FC31-64
Target: x86_64-native-linuxapp-clang
               ^
/root/FC31-64_K5.3.14_Clang9.0.0/x86_64-native-linuxapp-clang/cb19994c156541a792c8cbd4b541fb26/dpdk/drivers/net/ice/ice_rxtx.c:2615:12: error: use of undeclared identifier 'txr'
                                txd = &txr[tx_id];
                                       ^
2 errors generated.
make[6]: *** [/root/FC31-64_K5.3.14_Clang9.0.0/x86_64-native-linuxapp-clang/cb19994c156541a792c8cbd4b541fb26/dpdk/mk/internal/rte.compile-pre.mk:116: ice_rxtx.o] Error 1
make[6]: *** Waiting for unfinished jobs....
  CC bnxt_rxtx_vec_sse.o
  CC ixgbe_ipsec.o
  CC otx2_stats.o
  CC rte_pmd_ixgbe.o
--
  CC sfc_ethdev.o
  AR librte_pmd_nfp.a
  INSTALL-LIB librte_pmd_nfp.a
  AR librte_pmd_ixgbe.a
  INSTALL-LIB librte_pmd_ixgbe.a
make[5]: *** [/root/FC31-64_K5.3.14_Clang9.0.0/x86_64-native-linuxapp-clang/cb19994c156541a792c8cbd4b541fb26/dpdk/mk/rte.subdir.mk:37: ice] Error 2
make[5]: *** Waiting for unfinished jobs....
== Build drivers/net/tap
  CC ecore_hw.o
  CC otx2_flow_utils.o
  CC sfc_kvargs.o
--
  CC hunt_nic.o
  CC medford_nic.o
  CC medford2_nic.o
  AR librte_pmd_sfc_efx.a
  INSTALL-LIB librte_pmd_sfc_efx.a
make[4]: *** [/root/FC31-64_K5.3.14_Clang9.0.0/x86_64-native-linuxapp-clang/cb19994c156541a792c8cbd4b541fb26/dpdk/mk/rte.subdir.mk:35: net] Error 2
make[3]: *** [/root/FC31-64_K5.3.14_Clang9.0.0/x86_64-native-linuxapp-clang/cb19994c156541a792c8cbd4b541fb26/dpdk/mk/rte.sdkbuild.mk:46: drivers] Error 2
make[2]: *** [/root/FC31-64_K5.3.14_Clang9.0.0/x86_64-native-linuxapp-clang/cb19994c156541a792c8cbd4b541fb26/dpdk/mk/rte.sdkroot.mk:99: all] Error 2
make[1]: *** [/root/FC31-64_K5.3.14_Clang9.0.0/x86_64-native-linuxapp-clang/cb19994c156541a792c8cbd4b541fb26/dpdk/mk/rte.sdkinstall.mk:61: pre_install] Error 2
make: *** [/root/FC31-64_K5.3.14_Clang9.0.0/x86_64-native-linuxapp-clang/cb19994c156541a792c8cbd4b541fb26/dpdk/mk/rte.sdkroot.mk:77: install] Error 2


*Make Build Failed #18:
OS: UB1604-64
Target: x86_64-native-linuxapp-gcc
/root/UB1604-64_K4.4.0_GCC5.4.0/x86_64-native-linuxapp-gcc/cb19994c156541a792c8cbd4b541fb26/dpdk/drivers/net/ice/ice_rxtx.c:2615:12: note: each undeclared identifier is reported only once for each function it appears in
  CC otx2_tx.o
  CC otx2_tm.o
/root/UB1604-64_K4.4.0_GCC5.4.0/x86_64-native-linuxapp-gcc/cb19994c156541a792c8cbd4b541fb26/dpdk/drivers/net/ice/ice_rxtx.c: At top level:
cc1: warning: unrecognized command line option ‘-Wno-address-of-packed-member’
/root/UB1604-64_K4.4.0_GCC5.4.0/x86_64-native-linuxapp-gcc/cb19994c156541a792c8cbd4b541fb26/dpdk/mk/internal/rte.compile-pre.mk:114: recipe for target 'ice_rxtx.o' failed
make[6]: *** [ice_rxtx.o] Error 1
make[6]: *** Waiting for unfinished jobs....
  CC otx2_rss.o
  CC bnxt_rxq.o
  CC rte_eth_pcap.o
  CC ixgbe_ipsec.o
--
  CC ice_ethdev.o.pmd.o
  LD ice_ethdev.o
  CC otx2_flow.o
  CC otx2_link.o
  AR librte_pmd_ixgbe.a
/root/UB1604-64_K4.4.0_GCC5.4.0/x86_64-native-linuxapp-gcc/cb19994c156541a792c8cbd4b541fb26/dpdk/mk/rte.subdir.mk:35: recipe for target 'ice' failed
make[5]: *** [ice] Error 2
make[5]: *** Waiting for unfinished jobs....
  INSTALL-LIB librte_pmd_ixgbe.a
  CC bnxt_txr.o
  CC bnxt_vnic.o
  CC otx2_vlan.o
--
  PMDINFO qede_ethdev.o.pmd.c
  CC qede_ethdev.o.pmd.o
  LD qede_ethdev.o
  AR librte_pmd_qede.a
  INSTALL-LIB librte_pmd_qede.a
/root/UB1604-64_K4.4.0_GCC5.4.0/x86_64-native-linuxapp-gcc/cb19994c156541a792c8cbd4b541fb26/dpdk/mk/rte.subdir.mk:35: recipe for target 'net' failed
make[4]: *** [net] Error 2
/root/UB1604-64_K4.4.0_GCC5.4.0/x86_64-native-linuxapp-gcc/cb19994c156541a792c8cbd4b541fb26/dpdk/mk/rte.sdkbuild.mk:46: recipe for target 'drivers' failed
make[3]: *** [drivers] Error 2
/root/UB1604-64_K4.4.0_GCC5.4.0/x86_64-native-linuxapp-gcc/cb19994c156541a792c8cbd4b541fb26/dpdk/mk/rte.sdkroot.mk:98: recipe for target 'all' failed
make[2]: *** [all] Error 2
/root/UB1604-64_K4.4.0_GCC5.4.0/x86_64-native-linuxapp-gcc/cb19994c156541a792c8cbd4b541fb26/dpdk/mk/rte.sdkinstall.mk:60: recipe for target 'pre_install' failed
make[1]: *** [pre_install] Error 2
/root/UB1604-64_K4.4.0_GCC5.4.0/x86_64-native-linuxapp-gcc/cb19994c156541a792c8cbd4b541fb26/dpdk/mk/rte.sdkroot.mk:77: recipe for target 'install' failed
make: *** [install] Error 2


*Make Build Failed #19:
OS: UB1804-64
Target: x86_64-native-linuxapp-gcc
            ^~~
            txn
/root/UB1804-64_K4.15.0_GCC7.3.0/x86_64-native-linuxapp-gcc/cb19994c156541a792c8cbd4b541fb26/dpdk/drivers/net/ice/ice_rxtx.c:2615:12: note: each undeclared identifier is reported only once for each function it appears in
/root/UB1804-64_K4.15.0_GCC7.3.0/x86_64-native-linuxapp-gcc/cb19994c156541a792c8cbd4b541fb26/dpdk/drivers/net/ice/ice_rxtx.c: At top level:
cc1: warning: unrecognized command line option ‘-Wno-address-of-packed-member’
/root/UB1804-64_K4.15.0_GCC7.3.0/x86_64-native-linuxapp-gcc/cb19994c156541a792c8cbd4b541fb26/dpdk/mk/internal/rte.compile-pre.mk:114: recipe for target 'ice_rxtx.o' failed
make[6]: *** [ice_rxtx.o] Error 1
make[6]: *** Waiting for unfinished jobs....
  CC ixgbe_ipsec.o
  CC rte_pmd_ixgbe.o
== Build drivers/net/octeontx
== Build drivers/net/octeontx2
--
  CC octeontx_pkivf.o
  LD ice_ethdev.o
  AR librte_pmd_nfp.a
  INSTALL-LIB librte_pmd_nfp.a
  CC octeontx_bgx.o
/root/UB1804-64_K4.15.0_GCC7.3.0/x86_64-native-linuxapp-gcc/cb19994c156541a792c8cbd4b541fb26/dpdk/mk/rte.subdir.mk:35: recipe for target 'ice' failed
make[5]: *** [ice] Error 2
make[5]: *** Waiting for unfinished jobs....
  CC octeontx_ethdev.o
  PMDINFO octeontx_pkivf.o.pmd.c
  CC octeontx_pkivf.o.pmd.o
  LD octeontx_pkivf.o
--
  LD otx2_ethdev.o
  AR librte_pmd_i40e.a
  INSTALL-LIB librte_pmd_i40e.a
  AR librte_pmd_octeontx2.a
  INSTALL-LIB librte_pmd_octeontx2.a
/root/UB1804-64_K4.15.0_GCC7.3.0/x86_64-native-linuxapp-gcc/cb19994c156541a792c8cbd4b541fb26/dpdk/mk/rte.subdir.mk:35: recipe for target 'net' failed
make[4]: *** [net] Error 2
/root/UB1804-64_K4.15.0_GCC7.3.0/x86_64-native-linuxapp-gcc/cb19994c156541a792c8cbd4b541fb26/dpdk/mk/rte.sdkbuild.mk:46: recipe for target 'drivers' failed
make[3]: *** [drivers] Error 2
/root/UB1804-64_K4.15.0_GCC7.3.0/x86_64-native-linuxapp-gcc/cb19994c156541a792c8cbd4b541fb26/dpdk/mk/rte.sdkroot.mk:98: recipe for target 'all' failed
make[2]: *** [all] Error 2
/root/UB1804-64_K4.15.0_GCC7.3.0/x86_64-native-linuxapp-gcc/cb19994c156541a792c8cbd4b541fb26/dpdk/mk/rte.sdkinstall.mk:60: recipe for target 'pre_install' failed
make[1]: *** [pre_install] Error 2
/root/UB1804-64_K4.15.0_GCC7.3.0/x86_64-native-linuxapp-gcc/cb19994c156541a792c8cbd4b541fb26/dpdk/mk/rte.sdkroot.mk:77: recipe for target 'install' failed
make: *** [install] Error 2


*Make Build Failed #20:
OS: FreeBSD1201-64
Target: x86_64-native-bsdapp-gcc+debug
/root/FreeBSD1201-64_K12.1_GCC7.3.0/x86_64-native-bsdapp-gcc+debug/cb19994c156541a792c8cbd4b541fb26/dpdk/drivers/net/ice/ice_rxtx.c:2615:12: error: 'txr' undeclared (first use in this function); did you mean 'txn'?
 2615 |     txd = &txr[tx_id];
      |            ^~~
      |            txn
/root/FreeBSD1201-64_K12.1_GCC7.3.0/x86_64-native-bsdapp-gcc+debug/cb19994c156541a792c8cbd4b541fb26/dpdk/drivers/net/ice/ice_rxtx.c:2615:12: note: each undeclared identifier is reported only once for each function it appears in
gmake[6]: *** [/root/FreeBSD1201-64_K12.1_GCC7.3.0/x86_64-native-bsdapp-gcc+debug/cb19994c156541a792c8cbd4b541fb26/dpdk/mk/internal/rte.compile-pre.mk:116: ice_rxtx.o] Error 1
gmake[5]: *** [/root/FreeBSD1201-64_K12.1_GCC7.3.0/x86_64-native-bsdapp-gcc+debug/cb19994c156541a792c8cbd4b541fb26/dpdk/mk/rte.subdir.mk:37: ice] Error 2
gmake[5]: *** Waiting for unfinished jobs....
  CC otx2_ptp.o
  PMDINFO ixgbe_ethdev.o.pmd.c
  CC ixgbe_ethdev.o.pmd.o
  LD ixgbe_ethdev.o
--
  CC hunt_nic.o
  CC medford_nic.o
  CC medford2_nic.o
  AR librte_pmd_sfc_efx.a
  INSTALL-LIB librte_pmd_sfc_efx.a
gmake[4]: *** [/root/FreeBSD1201-64_K12.1_GCC7.3.0/x86_64-native-bsdapp-gcc+debug/cb19994c156541a792c8cbd4b541fb26/dpdk/mk/rte.subdir.mk:35: net] Error 2
gmake[3]: *** [/root/FreeBSD1201-64_K12.1_GCC7.3.0/x86_64-native-bsdapp-gcc+debug/cb19994c156541a792c8cbd4b541fb26/dpdk/mk/rte.sdkbuild.mk:46: drivers] Error 2
gmake[2]: *** [/root/FreeBSD1201-64_K12.1_GCC7.3.0/x86_64-native-bsdapp-gcc+debug/cb19994c156541a792c8cbd4b541fb26/dpdk/mk/rte.sdkroot.mk:99: all] Error 2
gmake[1]: *** [/root/FreeBSD1201-64_K12.1_GCC7.3.0/x86_64-native-bsdapp-gcc+debug/cb19994c156541a792c8cbd4b541fb26/dpdk/mk/rte.sdkinstall.mk:61: pre_install] Error 2
gmake: *** [/root/FreeBSD1201-64_K12.1_GCC7.3.0/x86_64-native-bsdapp-gcc+debug/cb19994c156541a792c8cbd4b541fb26/dpdk/mk/rte.sdkroot.mk:77: install] Error 2


*Make Build Failed #21:
OS: FreeBSD1201-64
Target: x86_64-native-bsdapp-gcc+shared
/root/FreeBSD1201-64_K12.1_GCC7.3.0/x86_64-native-bsdapp-gcc+shared/cb19994c156541a792c8cbd4b541fb26/dpdk/drivers/net/ice/ice_rxtx.c:2615:12: error: 'txr' undeclared (first use in this function); did you mean 'txn'?
 2615 |     txd = &txr[tx_id];
      |            ^~~
      |            txn
/root/FreeBSD1201-64_K12.1_GCC7.3.0/x86_64-native-bsdapp-gcc+shared/cb19994c156541a792c8cbd4b541fb26/dpdk/drivers/net/ice/ice_rxtx.c:2615:12: note: each undeclared identifier is reported only once for each function it appears in
gmake[6]: *** [/root/FreeBSD1201-64_K12.1_GCC7.3.0/x86_64-native-bsdapp-gcc+shared/cb19994c156541a792c8cbd4b541fb26/dpdk/mk/internal/rte.compile-pre.mk:116: ice_rxtx.o] Error 1
  PMDINFO ice_ethdev.o.pmd.c
  CC ice_ethdev.o.pmd.o
gmake[6]: *** Waiting for unfinished jobs....
  CC otx2_flow.o
  CC ecore_spq.o
  LD ice_ethdev.o
  CC otx2_link.o
== Build drivers/net/virtio
  CC ixgbe_rxtx_vec_sse.o
  CC ecore_init_ops.o
gmake[5]: *** [/root/FreeBSD1201-64_K12.1_GCC7.3.0/x86_64-native-bsdapp-gcc+shared/cb19994c156541a792c8cbd4b541fb26/dpdk/mk/rte.subdir.mk:37: ice] Error 2
gmake[5]: *** Waiting for unfinished jobs....
  CC rte_pmd_i40e.o
  CC otx2_vlan.o
  CC ixgbe_ipsec.o
  CC otx2_stats.o
--
  CC hunt_nic.o
  CC medford_nic.o
  CC medford2_nic.o
  LD librte_pmd_sfc_efx.so.20.0.1
  INSTALL-LIB librte_pmd_sfc_efx.so.20.0.1
gmake[4]: *** [/root/FreeBSD1201-64_K12.1_GCC7.3.0/x86_64-native-bsdapp-gcc+shared/cb19994c156541a792c8cbd4b541fb26/dpdk/mk/rte.subdir.mk:35: net] Error 2
gmake[3]: *** [/root/FreeBSD1201-64_K12.1_GCC7.3.0/x86_64-native-bsdapp-gcc+shared/cb19994c156541a792c8cbd4b541fb26/dpdk/mk/rte.sdkbuild.mk:46: drivers] Error 2
gmake[2]: *** [/root/FreeBSD1201-64_K12.1_GCC7.3.0/x86_64-native-bsdapp-gcc+shared/cb19994c156541a792c8cbd4b541fb26/dpdk/mk/rte.sdkroot.mk:99: all] Error 2
gmake[1]: *** [/root/FreeBSD1201-64_K12.1_GCC7.3.0/x86_64-native-bsdapp-gcc+shared/cb19994c156541a792c8cbd4b541fb26/dpdk/mk/rte.sdkinstall.mk:61: pre_install] Error 2
gmake: *** [/root/FreeBSD1201-64_K12.1_GCC7.3.0/x86_64-native-bsdapp-gcc+shared/cb19994c156541a792c8cbd4b541fb26/dpdk/mk/rte.sdkroot.mk:77: install] Error 2


*Make Build Failed #22:
OS: FreeBSD1201-64
Target: x86_64-native-bsdapp-clang
/root/FreeBSD1201-64_K12.1_Clang8.0.1/x86_64-native-bsdapp-clang/cb19994c156541a792c8cbd4b541fb26/dpdk/drivers/net/ice/ice_rxtx.c:2615:12: error: use of undeclared identifier 'txr'
                                txd = &txr[tx_id];
                                       ^
2 errors generated.
  PMDINFO rte_eth_ring.o.pmd.c
gmake[6]: *** [/root/FreeBSD1201-64_K12.1_Clang8.0.1/x86_64-native-bsdapp-clang/cb19994c156541a792c8cbd4b541fb26/dpdk/mk/internal/rte.compile-pre.mk:116: ice_rxtx.o] Error 1
  CC rte_eth_ring.o.pmd.o
gmake[6]: *** Waiting for unfinished jobs....
  CC ixgbe_rxtx.o
  LD rte_eth_ring.o
  CC ecore_l2.o
--
  CC bnxt_vnic.o
== Build drivers/net/thunderx
  CC ecore_sp_commands.o
  CC i40e_tm.o
  CC ecore_init_fw_funcs.o
gmake[5]: *** [/root/FreeBSD1201-64_K12.1_Clang8.0.1/x86_64-native-bsdapp-clang/cb19994c156541a792c8cbd4b541fb26/dpdk/mk/rte.subdir.mk:37: ice] Error 2
gmake[5]: *** Waiting for unfinished jobs....
  CC bnxt_irq.o
  CC otx2_link.o
  CC nicvf_rxtx.o
  PMDINFO sfc_ethdev.o.pmd.c
--
  CC hunt_nic.o
  CC medford_nic.o
  CC medford2_nic.o
  AR librte_pmd_sfc_efx.a
  INSTALL-LIB librte_pmd_sfc_efx.a
gmake[4]: *** [/root/FreeBSD1201-64_K12.1_Clang8.0.1/x86_64-native-bsdapp-clang/cb19994c156541a792c8cbd4b541fb26/dpdk/mk/rte.subdir.mk:35: net] Error 2
gmake[3]: *** [/root/FreeBSD1201-64_K12.1_Clang8.0.1/x86_64-native-bsdapp-clang/cb19994c156541a792c8cbd4b541fb26/dpdk/mk/rte.sdkbuild.mk:46: drivers] Error 2
gmake[2]: *** [/root/FreeBSD1201-64_K12.1_Clang8.0.1/x86_64-native-bsdapp-clang/cb19994c156541a792c8cbd4b541fb26/dpdk/mk/rte.sdkroot.mk:99: all] Error 2
gmake[1]: *** [/root/FreeBSD1201-64_K12.1_Clang8.0.1/x86_64-native-bsdapp-clang/cb19994c156541a792c8cbd4b541fb26/dpdk/mk/rte.sdkinstall.mk:61: pre_install] Error 2
gmake: *** [/root/FreeBSD1201-64_K12.1_Clang8.0.1/x86_64-native-bsdapp-clang/cb19994c156541a792c8cbd4b541fb26/dpdk/mk/rte.sdkroot.mk:77: install] Error 2


*Make Build Failed #23:
OS: FreeBSD1201-64
Target: x86_64-native-bsdapp-gcc
/root/FreeBSD1201-64_K12.1_GCC9.2.0/x86_64-native-bsdapp-gcc/cb19994c156541a792c8cbd4b541fb26/dpdk/drivers/net/ice/ice_rxtx.c:2615:12: error: 'txr' undeclared (first use in this function); did you mean 'txn'?
 2615 |     txd = &txr[tx_id];
      |            ^~~
      |            txn
/root/FreeBSD1201-64_K12.1_GCC9.2.0/x86_64-native-bsdapp-gcc/cb19994c156541a792c8cbd4b541fb26/dpdk/drivers/net/ice/ice_rxtx.c:2615:12: note: each undeclared identifier is reported only once for each function it appears in
gmake[6]: *** [/root/FreeBSD1201-64_K12.1_GCC9.2.0/x86_64-native-bsdapp-gcc/cb19994c156541a792c8cbd4b541fb26/dpdk/mk/internal/rte.compile-pre.mk:116: ice_rxtx.o] Error 1
gmake[6]: *** Waiting for unfinished jobs....
== Build drivers/net/qede
  CC bnxt_util.o
  CC i40e_fdir.o
  PMDINFO ixgbe_ethdev.o.pmd.c
--
  PMDINFO ice_ethdev.o.pmd.c
  CC ice_ethdev.o.pmd.o
  CC ixgbe_flow.o
  LD ice_ethdev.o
  CC i40e_flow.o
gmake[5]: *** [/root/FreeBSD1201-64_K12.1_GCC9.2.0/x86_64-native-bsdapp-gcc/cb19994c156541a792c8cbd4b541fb26/dpdk/mk/rte.subdir.mk:37: ice] Error 2
gmake[5]: *** Waiting for unfinished jobs....
  CC otx2_rss.o
  CC rte_eth_pcap.o
  CC rte_pmd_i40e.o
  AR librte_pmd_bnxt.a
--
  CC otx2_ethdev_devargs.o
  AR librte_pmd_octeontx2.a
  INSTALL-LIB librte_pmd_octeontx2.a
  AR librte_pmd_qede.a
  INSTALL-LIB librte_pmd_qede.a
gmake[4]: *** [/root/FreeBSD1201-64_K12.1_GCC9.2.0/x86_64-native-bsdapp-gcc/cb19994c156541a792c8cbd4b541fb26/dpdk/mk/rte.subdir.mk:35: net] Error 2
gmake[3]: *** [/root/FreeBSD1201-64_K12.1_GCC9.2.0/x86_64-native-bsdapp-gcc/cb19994c156541a792c8cbd4b541fb26/dpdk/mk/rte.sdkbuild.mk:46: drivers] Error 2
gmake[2]: *** [/root/FreeBSD1201-64_K12.1_GCC9.2.0/x86_64-native-bsdapp-gcc/cb19994c156541a792c8cbd4b541fb26/dpdk/mk/rte.sdkroot.mk:99: all] Error 2
gmake[1]: *** [/root/FreeBSD1201-64_K12.1_GCC9.2.0/x86_64-native-bsdapp-gcc/cb19994c156541a792c8cbd4b541fb26/dpdk/mk/rte.sdkinstall.mk:61: pre_install] Error 2
gmake: *** [/root/FreeBSD1201-64_K12.1_GCC9.2.0/x86_64-native-bsdapp-gcc/cb19994c156541a792c8cbd4b541fb26/dpdk/mk/rte.sdkroot.mk:77: install] Error 2

*Meson Build Failed #1:
OS: CENTOS77-64
Target:./build-gcc-static
FAILED: drivers/a715181@@tmp_rte_pmd_ice@sta/net_ice_ice_rxtx.c.o 
gcc -Idrivers/a715181@@tmp_rte_pmd_ice@sta -Idrivers -I../drivers -Idrivers/net/ice -I../drivers/net/ice -Idrivers/net/ice/base -I../drivers/net/ice/base -Ilib/librte_ethdev -I../lib/librte_ethdev -I. -I../ -Iconfig -I../config -Ilib/librte_eal/common/include -I../lib/librte_eal/common/include -I../lib/librte_eal/linux/eal/include -Ilib/librte_eal/common -I../lib/librte_eal/common -Ilib/librte_eal/common/include/arch/x86 -I../lib/librte_eal/common/include/arch/x86 -Ilib/librte_eal -I../lib/librte_eal -Ilib/librte_kvargs -I../lib/librte_kvargs -Ilib/librte_net -I../lib/librte_net -Ilib/librte_mbuf -I../lib/librte_mbuf -Ilib/librte_mempool -I../lib/librte_mempool -Ilib/librte_ring -I../lib/librte_ring -Ilib/librte_meter -I../lib/librte_meter -Idrivers/bus/pci -I../drivers/bus/pci -I../drivers/bus/pci/linux -Ilib/librte_pci -I../lib/librte_pci -Idrivers/bus/vdev -I../drivers/bus/vdev -Ilib/librte_hash -I../lib/librte_hash -pipe -D_FILE_OFFSET_BITS=64 -Wall -Winvalid-pch -Werror -O3 -include rte_config.h -Wextra -Wcast-qual -Wdeprecated -Wformat-nonliteral -Wformat-security -Wmissing-declarations -Wmissing-prototypes -Wnested-externs -Wold-style-definition -Wpointer-arith -Wsign-compare -Wstrict-prototypes -Wundef -Wwrite-strings -Wno-missing-field-initializers -D_GNU_SOURCE -fPIC -march=native -DALLOW_EXPERIMENTAL_API -MD -MQ 'drivers/a715181@@tmp_rte_pmd_ice@sta/net_ice_ice_rxtx.c.o' -MF 'drivers/a715181@@tmp_rte_pmd_ice@sta/net_ice_ice_rxtx.c.o.d' -o 'drivers/a715181@@tmp_rte_pmd_ice@sta/net_ice_ice_rxtx.c.o' -c ../drivers/net/ice/ice_rxtx.c
../drivers/net/ice/ice_rxtx.c: In function ‘ice_xmit_pkts’:
../drivers/net/ice/ice_rxtx.c:2599:8: error: ‘volatile struct ice_tx_desc’ has no member named ‘buffer_addr’
     txd->buffer_addr =
        ^
../drivers/net/ice/ice_rxtx.c:2615:12: error: ‘txr’ undeclared (first use in this function)
     txd = &txr[tx_id];
            ^
../drivers/net/ice/ice_rxtx.c:2615:12: note: each undeclared identifier is reported only once for each function it appears in
[1038/2204] Compiling C object 'drivers/net/ice/base/39545a2@@ice_base@sta/ice_dcb.c.o'.
[1039/2204] Compiling C object 'drivers/net/ice/base/39545a2@@ice_base@sta/ice_flow.c.o'.
[1040/2204] Compiling C object 'drivers/net/ice/base/39545a2@@ice_base@sta/ice_flex_pipe.c.o'.
[1041/2204] Compiling C object 'drivers/net/ice/base/39545a2@@ice_base@sta/ice_switch.c.o'.
[1042/2204] Compiling C object 'drivers/a715181@@tmp_rte_pmd_ice@sta/net_ice_ice_ethdev.c.o'.
ninja: build stopped: subcommand failed




*Meson Build Failed #2:
OS: SUSE15-64
Target:./build-gcc-static
FAILED: drivers/a715181@@tmp_rte_pmd_ice@sta/net_ice_ice_rxtx.c.o 
gcc -Idrivers/a715181@@tmp_rte_pmd_ice@sta -Idrivers -I../drivers -Idrivers/net/ice -I../drivers/net/ice -Idrivers/net/ice/base -I../drivers/net/ice/base -Ilib/librte_ethdev -I../lib/librte_ethdev -I. -I../ -Iconfig -I../config -Ilib/librte_eal/common/include -I../lib/librte_eal/common/include -I../lib/librte_eal/linux/eal/include -Ilib/librte_eal/common -I../lib/librte_eal/common -Ilib/librte_eal/common/include/arch/x86 -I../lib/librte_eal/common/include/arch/x86 -Ilib/librte_eal -I../lib/librte_eal -Ilib/librte_kvargs -I../lib/librte_kvargs -Ilib/librte_net -I../lib/librte_net -Ilib/librte_mbuf -I../lib/librte_mbuf -Ilib/librte_mempool -I../lib/librte_mempool -Ilib/librte_ring -I../lib/librte_ring -Ilib/librte_meter -I../lib/librte_meter -Idrivers/bus/pci -I../drivers/bus/pci -I../drivers/bus/pci/linux -Ilib/librte_pci -I../lib/librte_pci -Idrivers/bus/vdev -I../drivers/bus/vdev -Ilib/librte_hash -I../lib/librte_hash -fdiagnostics-color=always -pipe -D_FILE_OFFSET_BITS=64 -Wall -Winvalid-pch -Werror -O3 -include rte_config.h -Wextra -Wcast-qual -Wdeprecated -Wformat-nonliteral -Wformat-security -Wmissing-declarations -Wmissing-prototypes -Wnested-externs -Wold-style-definition -Wpointer-arith -Wsign-compare -Wstrict-prototypes -Wundef -Wwrite-strings -Wno-missing-field-initializers -D_GNU_SOURCE -fPIC -march=native -Wno-format-truncation -DALLOW_EXPERIMENTAL_API -MD -MQ 'drivers/a715181@@tmp_rte_pmd_ice@sta/net_ice_ice_rxtx.c.o' -MF 'drivers/a715181@@tmp_rte_pmd_ice@sta/net_ice_ice_rxtx.c.o.d' -o 'drivers/a715181@@tmp_rte_pmd_ice@sta/net_ice_ice_rxtx.c.o' -c ../drivers/net/ice/ice_rxtx.c
../drivers/net/ice/ice_rxtx.c: In function ‘ice_xmit_pkts’:
../drivers/net/ice/ice_rxtx.c:2599:10: error: ‘volatile struct ice_tx_desc’ has no member named ‘buffer_addr’; did you mean ‘buf_addr’?
     txd->buffer_addr =
          ^~~~~~~~~~~
          buf_addr
../drivers/net/ice/ice_rxtx.c:2615:12: error: ‘txr’ undeclared (first use in this function); did you mean ‘txn’?
     txd = &txr[tx_id];
            ^~~
            txn
../drivers/net/ice/ice_rxtx.c:2615:12: note: each undeclared identifier is reported only once for each function it appears in
[1033/2194] Compiling C object 'drivers/a715181@@tmp_rte_pmd_ice@sta/net_ice_ice_hash.c.o'.
[1034/2194] Compiling C object 'drivers/net/ice/base/39545a2@@ice_base@sta/ice_common.c.o'.
[1035/2194] Compiling C object 'drivers/net/ice/base/39545a2@@ice_base@sta/ice_fdir.c.o'.
[1036/2194] Compiling C object 'drivers/net/ice/base/39545a2@@ice_base@sta/ice_switch.c.o'.
[1037/2194] Compiling C object 'drivers/a715181@@tmp_rte_pmd_ice@sta/net_ice_ice_switch_filter.c.o'.
[1038/2194] Compiling C object 'drivers/a715181@@tmp_rte_pmd_ice@sta/net_ice_ice_ethdev.c.o'.
[1039/2194] Compiling C object 'drivers/net/ice/base/39545a2@@ice_base@sta/ice_sched.c.o'.
ninja: build stopped: subcommand failed




*Meson Build Failed #3:
OS: UB1604-32
Target:./build-gcc-static
FAILED: drivers/a715181@@tmp_rte_pmd_ice@sta/net_ice_ice_rxtx.c.o 
gcc -Idrivers/a715181@@tmp_rte_pmd_ice@sta -Idrivers -I../drivers -Idrivers/net/ice -I../drivers/net/ice -Idrivers/net/ice/base -I../drivers/net/ice/base -Ilib/librte_ethdev -I../lib/librte_ethdev -I. -I../ -Iconfig -I../config -Ilib/librte_eal/common/include -I../lib/librte_eal/common/include -I../lib/librte_eal/linux/eal/include -Ilib/librte_eal/common -I../lib/librte_eal/common -Ilib/librte_eal/common/include/arch/x86 -I../lib/librte_eal/common/include/arch/x86 -Ilib/librte_eal -I../lib/librte_eal -Ilib/librte_kvargs -I../lib/librte_kvargs -Ilib/librte_net -I../lib/librte_net -Ilib/librte_mbuf -I../lib/librte_mbuf -Ilib/librte_mempool -I../lib/librte_mempool -Ilib/librte_ring -I../lib/librte_ring -Ilib/librte_meter -I../lib/librte_meter -Idrivers/bus/pci -I../drivers/bus/pci -I../drivers/bus/pci/linux -Ilib/librte_pci -I../lib/librte_pci -Idrivers/bus/vdev -I../drivers/bus/vdev -Ilib/librte_hash -I../lib/librte_hash -fdiagnostics-color=always -pipe -D_FILE_OFFSET_BITS=64 -Wall -Winvalid-pch -Werror -O3 -include rte_config.h -Wextra -Wcast-qual -Wdeprecated -Wformat-nonliteral -Wformat-security -Wmissing-declarations -Wmissing-prototypes -Wnested-externs -Wold-style-definition -Wpointer-arith -Wsign-compare -Wstrict-prototypes -Wundef -Wwrite-strings -Wno-missing-field-initializers -Wno-pointer-to-int-cast -D_GNU_SOURCE -fPIC -march=native -DALLOW_EXPERIMENTAL_API -MD -MQ 'drivers/a715181@@tmp_rte_pmd_ice@sta/net_ice_ice_rxtx.c.o' -MF 'drivers/a715181@@tmp_rte_pmd_ice@sta/net_ice_ice_rxtx.c.o.d' -o 'drivers/a715181@@tmp_rte_pmd_ice@sta/net_ice_ice_rxtx.c.o' -c ../drivers/net/ice/ice_rxtx.c
../drivers/net/ice/ice_rxtx.c: In function ‘ice_xmit_pkts’:
../drivers/net/ice/ice_rxtx.c:2599:8: error: ‘volatile struct ice_tx_desc’ has no member named ‘buffer_addr’
     txd->buffer_addr =
        ^
../drivers/net/ice/ice_rxtx.c:2615:12: error: ‘txr’ undeclared (first use in this function)
     txd = &txr[tx_id];
            ^
../drivers/net/ice/ice_rxtx.c:2615:12: note: each undeclared identifier is reported only once for each function it appears in
[993/1958] Compiling C object 'drivers/net/ice/base/39545a2@@ice_base@sta/ice_flex_pipe.c.o'.
[994/1958] Compiling C object 'drivers/net/ice/base/39545a2@@ice_base@sta/ice_sched.c.o'.
[995/1958] Compiling C object 'drivers/a715181@@tmp_rte_pmd_ice@sta/net_ice_ice_switch_filter.c.o'.
[996/1958] Compiling C object 'drivers/a715181@@tmp_rte_pmd_ice@sta/net_ice_ice_generic_flow.c.o'.
[997/1958] Compiling C object 'drivers/net/ice/base/39545a2@@ice_base@sta/ice_switch.c.o'.
ninja: build stopped: subcommand failed




*Meson Build Failed #4:
OS: FC31-64
Target:./build-gcc-static
FAILED: drivers/a715181@@tmp_rte_pmd_ice@sta/net_ice_ice_rxtx.c.o 
gcc -Idrivers/a715181@@tmp_rte_pmd_ice@sta -Idrivers -I../drivers -Idrivers/net/ice -I../drivers/net/ice -Idrivers/net/ice/base -I../drivers/net/ice/base -Ilib/librte_ethdev -I../lib/librte_ethdev -I. -I../ -Iconfig -I../config -Ilib/librte_eal/common/include -I../lib/librte_eal/common/include -I../lib/librte_eal/linux/eal/include -Ilib/librte_eal/common -I../lib/librte_eal/common -Ilib/librte_eal/common/include/arch/x86 -I../lib/librte_eal/common/include/arch/x86 -Ilib/librte_eal -I../lib/librte_eal -Ilib/librte_kvargs -I../lib/librte_kvargs -Ilib/librte_net -I../lib/librte_net -Ilib/librte_mbuf -I../lib/librte_mbuf -Ilib/librte_mempool -I../lib/librte_mempool -Ilib/librte_ring -I../lib/librte_ring -Ilib/librte_meter -I../lib/librte_meter -Idrivers/bus/pci -I../drivers/bus/pci -I../drivers/bus/pci/linux -Ilib/librte_pci -I../lib/librte_pci -Idrivers/bus/vdev -I../drivers/bus/vdev -Ilib/librte_hash -I../lib/librte_hash -fdiagnostics-color=always -pipe -D_FILE_OFFSET_BITS=64 -Wall -Winvalid-pch -Werror -O3 -include rte_config.h -Wextra -Wcast-qual -Wdeprecated -Wformat-nonliteral -Wformat-security -Wmissing-declarations -Wmissing-prototypes -Wnested-externs -Wold-style-definition -Wpointer-arith -Wsign-compare -Wstrict-prototypes -Wundef -Wwrite-strings -Wno-address-of-packed-member -Wno-packed-not-aligned -Wno-missing-field-initializers -D_GNU_SOURCE -fPIC -march=native -Wno-format-truncation -DALLOW_EXPERIMENTAL_API -MD -MQ 'drivers/a715181@@tmp_rte_pmd_ice@sta/net_ice_ice_rxtx.c.o' -MF 'drivers/a715181@@tmp_rte_pmd_ice@sta/net_ice_ice_rxtx.c.o.d' -o 'drivers/a715181@@tmp_rte_pmd_ice@sta/net_ice_ice_rxtx.c.o' -c ../drivers/net/ice/ice_rxtx.c
../drivers/net/ice/ice_rxtx.c: In function ‘ice_xmit_pkts’:
../drivers/net/ice/ice_rxtx.c:2599:10: error: ‘volatile struct ice_tx_desc’ has no member named ‘buffer_addr’; did you mean ‘buf_addr’?
 2599 |     txd->buffer_addr =
      |          ^~~~~~~~~~~
      |          buf_addr
../drivers/net/ice/ice_rxtx.c:2615:12: error: ‘txr’ undeclared (first use in this function); did you mean ‘txn’?
 2615 |     txd = &txr[tx_id];
      |            ^~~
      |            txn
../drivers/net/ice/ice_rxtx.c:2615:12: note: each undeclared identifier is reported only once for each function it appears in
[1036/2207] Compiling C object 'drivers/a715181@@tmp_rte_pmd_ice@sta/net_ice_ice_hash.c.o'.
[1037/2207] Compiling C object 'drivers/net/ice/base/39545a2@@ice_base@sta/ice_sched.c.o'.
[1038/2207] Compiling C object 'drivers/a715181@@tmp_rte_pmd_ice@sta/net_ice_ice_generic_flow.c.o'.
[1039/2207] Compiling C object 'drivers/a715181@@tmp_rte_pmd_ice@sta/net_ice_ice_switch_filter.c.o'.
[1040/2207] Compiling C object 'drivers/a715181@@tmp_rte_pmd_ice@sta/net_ice_ice_fdir_filter.c.o'.
[1041/2207] Compiling C object 'drivers/a715181@@tmp_rte_pmd_ice@sta/net_ice_ice_ethdev.c.o'.
[1042/2207] Compiling C object 'drivers/a715181@@tmp_rte_pmd_ice@sta/net_ice_ice_rxtx_vec_sse.c.o'.
ninja: build stopped: subcommand failed




*Meson Build Failed #5:
OS: UB1804-64
Target:./build-gcc-static
FAILED: drivers/a715181@@tmp_rte_pmd_ice@sta/net_ice_ice_rxtx.c.o 
gcc -Idrivers/a715181@@tmp_rte_pmd_ice@sta -Idrivers -I../drivers -Idrivers/net/ice -I../drivers/net/ice -Idrivers/net/ice/base -I../drivers/net/ice/base -Ilib/librte_ethdev -I../lib/librte_ethdev -I. -I../ -Iconfig -I../config -Ilib/librte_eal/common/include -I../lib/librte_eal/common/include -I../lib/librte_eal/linux/eal/include -Ilib/librte_eal/common -I../lib/librte_eal/common -Ilib/librte_eal/common/include/arch/x86 -I../lib/librte_eal/common/include/arch/x86 -Ilib/librte_eal -I../lib/librte_eal -Ilib/librte_kvargs -I../lib/librte_kvargs -Ilib/librte_net -I../lib/librte_net -Ilib/librte_mbuf -I../lib/librte_mbuf -Ilib/librte_mempool -I../lib/librte_mempool -Ilib/librte_ring -I../lib/librte_ring -Ilib/librte_meter -I../lib/librte_meter -Idrivers/bus/pci -I../drivers/bus/pci -I../drivers/bus/pci/linux -Ilib/librte_pci -I../lib/librte_pci -Idrivers/bus/vdev -I../drivers/bus/vdev -Ilib/librte_hash -I../lib/librte_hash -fdiagnostics-color=always -pipe -D_FILE_OFFSET_BITS=64 -Wall -Winvalid-pch -Werror -O3 -include rte_config.h -Wextra -Wcast-qual -Wdeprecated -Wformat-nonliteral -Wformat-security -Wmissing-declarations -Wmissing-prototypes -Wnested-externs -Wold-style-definition -Wpointer-arith -Wsign-compare -Wstrict-prototypes -Wundef -Wwrite-strings -Wno-missing-field-initializers -D_GNU_SOURCE -fPIC -march=native -mno-avx512f -Wno-format-truncation -DALLOW_EXPERIMENTAL_API -MD -MQ 'drivers/a715181@@tmp_rte_pmd_ice@sta/net_ice_ice_rxtx.c.o' -MF 'drivers/a715181@@tmp_rte_pmd_ice@sta/net_ice_ice_rxtx.c.o.d' -o 'drivers/a715181@@tmp_rte_pmd_ice@sta/net_ice_ice_rxtx.c.o' -c ../drivers/net/ice/ice_rxtx.c
../drivers/net/ice/ice_rxtx.c: In function ‘ice_xmit_pkts’:
../drivers/net/ice/ice_rxtx.c:2599:10: error: ‘volatile struct ice_tx_desc’ has no member named ‘buffer_addr’; did you mean ‘buf_addr’?
     txd->buffer_addr =
          ^~~~~~~~~~~
          buf_addr
../drivers/net/ice/ice_rxtx.c:2615:12: error: ‘txr’ undeclared (first use in this function); did you mean ‘txn’?
     txd = &txr[tx_id];
            ^~~
            txn
../drivers/net/ice/ice_rxtx.c:2615:12: note: each undeclared identifier is reported only once for each function it appears in
[1035/2146] Compiling C object 'drivers/net/ice/base/39545a2@@ice_base@sta/ice_flow.c.o'.
[1036/2146] Compiling C object 'drivers/a715181@@tmp_rte_pmd_ice@sta/net_ice_ice_hash.c.o'.
[1037/2146] Compiling C object 'drivers/a715181@@tmp_rte_pmd_ice@sta/net_ice_ice_generic_flow.c.o'.
[1038/2146] Compiling C object 'drivers/a715181@@tmp_rte_pmd_ice@sta/net_ice_ice_switch_filter.c.o'.
[1039/2146] Compiling C object 'drivers/a715181@@tmp_rte_pmd_ice@sta/net_ice_ice_ethdev.c.o'.
ninja: build stopped: subcommand failed




*Meson Build Failed #6:
OS: FreeBSD1201-64
Target:./build-gcc-static
FAILED: drivers/a715181@@tmp_rte_pmd_ice@sta/net_ice_ice_rxtx.c.o 
gcc -Idrivers/a715181@@tmp_rte_pmd_ice@sta -Idrivers -I../drivers -Idrivers/net/ice -I../drivers/net/ice -Idrivers/net/ice/base -I../drivers/net/ice/base -Ilib/librte_ethdev -I../lib/librte_ethdev -I. -I../ -Iconfig -I../config -Ilib/librte_eal/common/include -I../lib/librte_eal/common/include -I../lib/librte_eal/freebsd/eal/include -Ilib/librte_eal/common -I../lib/librte_eal/common -Ilib/librte_eal/common/include/arch/x86 -I../lib/librte_eal/common/include/arch/x86 -Ilib/librte_eal -I../lib/librte_eal -Ilib/librte_kvargs -I../lib/librte_kvargs -Ilib/librte_net -I../lib/librte_net -Ilib/librte_mbuf -I../lib/librte_mbuf -Ilib/librte_mempool -I../lib/librte_mempool -Ilib/librte_ring -I../lib/librte_ring -Ilib/librte_meter -I../lib/librte_meter -Idrivers/bus/pci -I../drivers/bus/pci -I../drivers/bus/pci/bsd -Ilib/librte_pci -I../lib/librte_pci -Idrivers/bus/vdev -I../drivers/bus/vdev -Ilib/librte_hash -I../lib/librte_hash -fdiagnostics-color=always -pipe -D_FILE_OFFSET_BITS=64 -Wall -Winvalid-pch -Werror -O3 -include rte_config.h -Wextra -Wcast-qual -Wdeprecated -Wformat-nonliteral -Wformat-security -Wmissing-declarations -Wmissing-prototypes -Wnested-externs -Wold-style-definition -Wpointer-arith -Wsign-compare -Wstrict-prototypes -Wundef -Wwrite-strings -Wno-address-of-packed-member -Wno-packed-not-aligned -Wno-missing-field-initializers -D_GNU_SOURCE -D__BSD_VISIBLE -fPIC -march=native -Wno-format-truncation -DALLOW_EXPERIMENTAL_API -MD -MQ 'drivers/a715181@@tmp_rte_pmd_ice@sta/net_ice_ice_rxtx.c.o' -MF 'drivers/a715181@@tmp_rte_pmd_ice@sta/net_ice_ice_rxtx.c.o.d' -o 'drivers/a715181@@tmp_rte_pmd_ice@sta/net_ice_ice_rxtx.c.o' -c ../drivers/net/ice/ice_rxtx.c
../drivers/net/ice/ice_rxtx.c: In function 'ice_xmit_pkts':
../drivers/net/ice/ice_rxtx.c:2599:10: error: 'volatile struct ice_tx_desc' has no member named 'buffer_addr'; did you mean 'buf_addr'?
 2599 |     txd->buffer_addr =
      |          ^~~~~~~~~~~
      |          buf_addr
../drivers/net/ice/ice_rxtx.c:2615:12: error: 'txr' undeclared (first use in this function); did you mean 'txn'?
 2615 |     txd = &txr[tx_id];
      |            ^~~
      |            txn
../drivers/net/ice/ice_rxtx.c:2615:12: note: each undeclared identifier is reported only once for each function it appears in
[650/1623] Compiling C object 'drivers/a715181@@tmp_rte_pmd_ice@sta/net_ice_ice_switch_filter.c.o'.
[651/1623] Compiling C object 'drivers/a715181@@tmp_rte_pmd_ice@sta/net_ice_ice_hash.c.o'.
[652/1623] Compiling C object 'drivers/a715181@@tmp_rte_pmd_ice@sta/net_ice_ice_generic_flow.c.o'.
[653/1623] Compiling C object 'drivers/a715181@@tmp_rte_pmd_ice@sta/net_ice_ice_fdir_filter.c.o'.
[654/1623] Compiling C object 'drivers/a715181@@tmp_rte_pmd_ice@sta/net_ice_ice_ethdev.c.o'.
ninja: build stopped: subcommand failed



DPDK STV team

^ permalink raw reply	[flat|nested] only message in thread

only message in thread, back to index

Thread overview: (only message) (download: mbox.gz / follow: Atom feed)
-- links below jump to the message on this page --
2020-01-15  1:12 [dpdk-test-report] |FAILURE| pw64135net/ice: fix TSO pkt exceeds allowed buf size issue sys_stv

automatic DPDK test reports

Archives are clonable:
	git clone --mirror http://inbox.dpdk.org/test-report/0 test-report/git/0.git

	# If you have public-inbox 1.1+ installed, you may
	# initialize and index your mirror using the following commands:
	public-inbox-init -V2 test-report test-report/ http://inbox.dpdk.org/test-report \
		test-report@dpdk.org
	public-inbox-index test-report


Newsgroup available over NNTP:
	nntp://inbox.dpdk.org/inbox.dpdk.test-report


AGPL code for this site: git clone https://public-inbox.org/ public-inbox