automatic DPDK test reports
 help / color / Atom feed
* [dpdk-test-report]  |FAILURE| pw64132[v1, 1/3] drivers: introduce vDPA class
@ 2020-01-15  1:53 sys_stv
  0 siblings, 0 replies; only message in thread
From: sys_stv @ 2020-01-15  1:53 UTC (permalink / raw)
  To: test-report

[-- Attachment #1: Type: text/plain, Size: 10845 bytes --]

Test-Label: Intel-compilation
Test-Status: FAILURE
http://dpdk.org/patch/64132

_Compilation issues_

Submitter: Matan Azrad <matan@mellanox.com>
Date: 2019-12-25 15:19:19
Reply_mail: 1577287161-10321-2-git-send-email-matan@mellanox.com
DPDK git baseline: Repo:dpdk-next-net-intel, CommitID: 95edbfebfa116dffd3db7fac9a1776317acd7dd9

Makefile build Summary: 23 Builds Done, 23 Successful, 0 Failures

Meson build Summary: 8 Builds Done, 7 Successful, 1 Failures

               +==============================================+===========+==========+
               |                   Makefile                   |   Meson   | Document |
+----------------+------+-------+------+------------+-----------+-----------+----------+
| os             | gcc  | clang | icc  | gcc+shared | gcc+debug | gcc/clang | pdf/html |
+----------------+------+-------+------+------------+-----------+-----------+----------+
| RHEL80-64      | pass |       |      |            |           |           |          |
| UB1804-64      | pass | pass  | pass |            |           | pass      | pass     |
| UB1604-32      | pass |       |      |            |           | pass      |          |
| CENTOS77-64    | pass | pass  | pass | pass       | pass      | FAIL      |          |
| UB1604-64      | pass | pass  |      |            |           |           |          |
| WIN10-64       |      |       |      |            |           | pass      |          |
| UB1910-64      | pass |       |      |            |           |           |          |
| FC31-64        | pass | pass  |      |            |           | pass      |          |
| CENTOS80-64    | pass |       |      |            |           |           |          |
| FreeBSD1201-64 | pass | pass  |      | pass       | pass      | pass      |          |
| RHEL77-64      | pass |       |      |            |           |           |          |
| SUSE15-64      | pass | pass  |      |            |           | pass      |          |
+----------------+------+-------+------+------------+-----------+-----------+----------+

Test environment and configuration as below:

** Makefile build **


OS: UB1804-64
	Kernel Version: 4.15.0-20-generic
	CPU info: Intel(R) Xeon(R) CPU E5-2699 v3 @ 2.30GHz
	GCC Version: gcc (Ubuntu 7.3.0-16ubuntu3) 7.3.0
	Clang Version: 6.0.0-1ubuntu2 (tags/RELEASE_600/final)
	x86_64-native-linuxapp-clang
	x86_64-native-linuxapp-icc
	x86_64-native-linuxapp-gcc


OS: UB1604-32
	Kernel Version: 4.4.0-131-generic
	CPU info: Intel(R) Xeon(R) CPU E5-2699 v3 @ 2.30GHz
	GCC Version: gcc (Ubuntu 5.4.0-6ubuntu1~16.04.11) 5.4.0 20160609
	Clang Version: 3.8.0-2ubuntu4 (tags/RELEASE_380/final)
	i686-native-linuxapp-gcc


OS: CENTOS77-64
	Kernel Version: 3.10.0-1062.9.1.el7.x86_64
	CPU info: Intel(R) Xeon(R) CPU E5-2699 v4 @ 2.20GHz
	GCC Version: gcc (GCC) 4.8.5 20150623 (Red Hat 4.8.5-39)
	Clang Version: 3.4.2 (tags/RELEASE_34/dot2-final)
	x86_64-native-linuxapp-gcc
	x86_64-native-linuxapp-clang
	x86_64-native-linuxapp-gcc+debug
	x86_64-native-linuxapp-gcc+shared
	x86_64-native-linuxapp-icc


OS: UB1910-64
	Kernel Version: 5.3.0-18-generic
	CPU info: Intel(R) Xeon(R) CPU E5-2699 v3 @ 2.30GHz
	GCC Version: gcc (Ubuntu 9.2.1-9ubuntu2) 9.2.1 20191008
	Clang Version: 9.0.0-2 (tags/RELEASE_900/final)
	x86_64-native-linuxapp-gcc


OS: CENTOS80-64
	Kernel Version: 4.18.0-80.11.2.el8_0.x86_64
	CPU info: Intel(R) Xeon(R) CPU E5-2699 v4 @ 2.20GHz
	GCC Version: gcc (GCC) 8.2.1 20180905 (Red Hat 8.2.1-3)
	Clang Version: 7.0.1 (tags/RELEASE_701/final)
	x86_64-native-linuxapp-gcc


OS: UB1604-64
	Kernel Version: 4.4.0-170-generic
	CPU info: Intel(R) Xeon(R) CPU E5-2699 v3 @ 2.30GHz
	GCC Version: gcc (Ubuntu 5.4.0-6ubuntu1~16.04.12) 5.4.0 20160609
	Clang Version: 3.8.0-2ubuntu4 (tags/RELEASE_380/final)
	x86_64-native-linuxapp-clang
	x86_64-native-linuxapp-gcc


OS: FC31-64
	Kernel Version: 5.3.15-300.fc31.x86_64
	CPU info: Intel(R) Xeon(R) CPU E5-2699 v4 @ 2.20GHz
	GCC Version: gcc (GCC) 9.2.1 20190827 (Red Hat 9.2.1-1)
	Clang Version: 9.0.0 (Fedora 9.0.0-1.fc31)
	x86_64-native-linuxapp-gcc
	x86_64-native-linuxapp-clang


OS: RHEL80-64
	Kernel Version: 4.18.0-80.el8.x86_64
	CPU info: Intel(R) Xeon(R) CPU E5-2699 v4 @ 2.20GHz
	GCC Version: gcc (GCC) 8.2.1 20180905 (Red Hat 8.2.1-3)
	Clang Version: 6.0.1 (tags/RELEASE_601/final)
	x86_64-native-linuxapp-gcc


OS: FreeBSD1201-64
	Kernel Version: 12.1-RELEASE
	CPU info: Intel(R) Xeon(R) CPU E5-2699 v4 @ 2.20GHz (2194.98-MHz K8-class CPU)
	GCC Version: gcc (FreeBSD Ports Collection) 9.2.0
	Clang Version: 8.0.1 (tags/RELEASE_801/final 366581) (based on LLVM 8.0.1)
	x86_64-native-bsdapp-gcc+debug
	x86_64-native-bsdapp-gcc+shared
	x86_64-native-bsdapp-clang
	x86_64-native-bsdapp-gcc


OS: RHEL77-64
	Kernel Version: 3.10.0-1062.9.1.el7.x86_64
	CPU info: Intel(R) Xeon(R) CPU E5-2699 v4 @ 2.20GHz
	GCC Version: gcc (GCC) 4.8.5 20150623 (Red Hat 4.8.5-39)
	Clang Version: 3.4.2 (tags/RELEASE_34/dot2-final)
	x86_64-native-linuxapp-gcc


OS: SUSE15-64
	Kernel Version: 4.12.14-lp150.11-default
	CPU info: Intel(R) Xeon(R) CPU E5-2699 v4 @ 2.20GHz
	GCC Version: gcc (SUSE Linux) 7.3.1 20180323 [gcc-7-branch revision 258812]
	Clang Version: 5.0.1 (tags/RELEASE_501/final 312548)
	x86_64-native-linuxapp-gcc
	x86_64-native-linuxapp-clang


** Meson build **


OS: UB1804-64
	Kernel Version: 4.15.0-20-generic
	CPU info: Intel(R) Xeon(R) CPU E5-2699 v4 @ 2.20GHz
	GCC Version: gcc (Ubuntu 7.3.0-27ubuntu1~18.04) 7.3.0
	Clang Version: 6.0.0-1ubuntu2 (tags/RELEASE_600/final)
	x86_64-native-linuxapp-doc
	./build-gcc-static
	./build-gcc-shared
	./build-clang-static
	./build-clang-shared
	./build-x86-default


OS: UB1604-32
	Kernel Version: 4.4.0-131-generic
	CPU info: Intel(R) Xeon(R) CPU E5-2699 v4 @ 2.20GHz
	GCC Version: gcc (Ubuntu 5.4.0-6ubuntu1~16.04.11) 5.4.0 20160609
	Clang Version: 3.8.0-2ubuntu4 (tags/RELEASE_380/final)
	./build-gcc-static
	./build-gcc-shared
	./build-clang-static
	./build-clang-shared
	./build-x86-default


OS: CENTOS77-64
	Kernel Version: 3.10.0-1062.9.1.el7.x86_64
	CPU info: Intel(R) Xeon(R) CPU E5-2699 v4 @ 2.20GHz
	GCC Version: gcc (GCC) 4.8.5 20150623 (Red Hat 4.8.5-39)
	Clang Version: 3.4.2 (tags/RELEASE_34/dot2-final)
	./build-gcc-static
	./build-gcc-shared
	./build-clang-static
	./build-clang-shared
	./build-x86-default


OS: WIN10-64
	Kernel Version: N/A
	CPU info: N/A
	GCC Version: N/A
	Clang Version: Clang 8.0.0
	x86_64-windows-clang


OS: FC31-64
	Kernel Version: 5.3.14-300.fc31.x86_64
	CPU info: Intel(R) Xeon(R) CPU E5-2699 v4 @ 2.20GHz
	GCC Version: gcc (GCC) 9.2.1 20190827 (Red Hat 9.2.1-1)
	Clang Version: 9.0.0 (Fedora 9.0.0-1.fc31)
	./build-gcc-static
	./build-gcc-shared
	./build-clang-static
	./build-clang-shared
	./build-x86-default


OS: FreeBSD1201-64
	Kernel Version: 12.1-RELEASE
	CPU info: Intel(R) Xeon(R) CPU E5-2699 v4 @ 2.20GHz (2194.97-MHz K8-class CPU)
	GCC Version: gcc (FreeBSD Ports Collection) 9.2.0
	Clang Version: 8.0.1 (tags/RELEASE_801/final 366581) (based on LLVM 8.0.1)
	./build-gcc-static
	./build-gcc-shared
	./build-clang-static
	./build-clang-shared
	./build-x86-default


OS: SUSE15-64
	Kernel Version: 4.12.14-lp150.11-default
	CPU info: Intel(R) Xeon(R) CPU E5-2699 v4 @ 2.20GHz
	GCC Version: gcc (SUSE Linux) 7.3.1 20180323 [gcc-7-branch revision 258812]
	Clang Version: 5.0.1 (tags/RELEASE_501/final 312548)
	./build-gcc-static
	./build-gcc-shared
	./build-clang-static
	./build-clang-shared
	./build-x86-default


*Meson Build Failed #1:
OS: CENTOS77-64
Target:./build-gcc-static
FAILED: drivers/a715181@@tmp_rte_pmd_ixgbe@sta/net_ixgbe_ixgbe_rxtx.c.o 
gcc -Idrivers/a715181@@tmp_rte_pmd_ixgbe@sta -Idrivers -I../drivers -Idrivers/net/ixgbe -I../drivers/net/ixgbe -Idrivers/net/ixgbe/base -I../drivers/net/ixgbe/base -Ilib/librte_ethdev -I../lib/librte_ethdev -I. -I../ -Iconfig -I../config -Ilib/librte_eal/common/include -I../lib/librte_eal/common/include -I../lib/librte_eal/linux/eal/include -Ilib/librte_eal/common -I../lib/librte_eal/common -Ilib/librte_eal/common/include/arch/x86 -I../lib/librte_eal/common/include/arch/x86 -Ilib/librte_eal -I../lib/librte_eal -Ilib/librte_kvargs -I../lib/librte_kvargs -Ilib/librte_net -I../lib/librte_net -Ilib/librte_mbuf -I../lib/librte_mbuf -Ilib/librte_mempool -I../lib/librte_mempool -Ilib/librte_ring -I../lib/librte_ring -Ilib/librte_meter -I../lib/librte_meter -Idrivers/bus/pci -I../drivers/bus/pci -I../drivers/bus/pci/linux -Ilib/librte_pci -I../lib/librte_pci -Idrivers/bus/vdev -I../drivers/bus/vdev -Ilib/librte_hash -I../lib/librte_hash -Ilib/librte_security -I../lib/librte_security -Ilib/librte_cryptodev -I../lib/librte_cryptodev -pipe -D_FILE_OFFSET_BITS=64 -Wall -Winvalid-pch -Werror -O3 -include rte_config.h -Wextra -Wcast-qual -Wdeprecated -Wformat-nonliteral -Wformat-security -Wmissing-declarations -Wmissing-prototypes -Wnested-externs -Wold-style-definition -Wpointer-arith -Wsign-compare -Wstrict-prototypes -Wundef -Wwrite-strings -Wno-missing-field-initializers -D_GNU_SOURCE -fPIC -march=native -DRTE_LIBRTE_IXGBE_BYPASS -DALLOW_EXPERIMENTAL_API -MD -MQ 'drivers/a715181@@tmp_rte_pmd_ixgbe@sta/net_ixgbe_ixgbe_rxtx.c.o' -MF 'drivers/a715181@@tmp_rte_pmd_ixgbe@sta/net_ixgbe_ixgbe_rxtx.c.o.d' -o 'drivers/a715181@@tmp_rte_pmd_ixgbe@sta/net_ixgbe_ixgbe_rxtx.c.o' -c ../drivers/net/ixgbe/ixgbe_rxtx.c
../drivers/net/ixgbe/ixgbe_rxtx.c: In function ‘ixgbe_recv_pkts_lro_bulk_alloc’:
../drivers/net/ixgbe/ixgbe_rxtx.c:2209:24: error: ‘next_sc_entry’ may be used uninitialized in this function [-Werror=maybe-uninitialized]
    next_sc_entry->fbuf = first_seg;
                        ^
../drivers/net/ixgbe/ixgbe_rxtx.c:2031:36: note: ‘next_sc_entry’ was declared here
   struct ixgbe_scattered_rx_entry *next_sc_entry;
                                    ^
../drivers/net/ixgbe/ixgbe_rxtx.c: In function ‘ixgbe_recv_pkts_lro_single_alloc’:
../drivers/net/ixgbe/ixgbe_rxtx.c:2209:24: error: ‘next_sc_entry’ may be used uninitialized in this function [-Werror=maybe-uninitialized]
    next_sc_entry->fbuf = first_seg;
                        ^
../drivers/net/ixgbe/ixgbe_rxtx.c:2031:36: note: ‘next_sc_entry’ was declared here
   struct ixgbe_scattered_rx_entry *next_sc_entry;
                                    ^
cc1: all warnings being treated as errors
[1089/2204] Compiling C object 'drivers/a715181@@rte_pmd_kni@sta/meson-generated_.._rte_pmd_kni.pmd.c.o'.
[1090/2204] Compiling C object 'drivers/a715181@@rte_pmd_kni@sha/meson-generated_.._rte_pmd_kni.pmd.c.o'.
[1091/2204] Compiling C object 'drivers/a715181@@tmp_rte_pmd_liquidio@sta/net_liquidio_base_lio_mbox.c.o'.
[1092/2204] Compiling C object 'drivers/a715181@@tmp_rte_pmd_liquidio@sta/net_liquidio_lio_ethdev.c.o'.
[1093/2204] Compiling C object 'drivers/a715181@@tmp_rte_pmd_ixgbe@sta/net_ixgbe_ixgbe_ethdev.c.o'.
ninja: build stopped: subcommand failed



DPDK STV team

^ permalink raw reply	[flat|nested] only message in thread

only message in thread, back to index

Thread overview: (only message) (download: mbox.gz / follow: Atom feed)
-- links below jump to the message on this page --
2020-01-15  1:53 [dpdk-test-report] |FAILURE| pw64132[v1, 1/3] drivers: introduce vDPA class sys_stv

automatic DPDK test reports

Archives are clonable:
	git clone --mirror http://inbox.dpdk.org/test-report/0 test-report/git/0.git

	# If you have public-inbox 1.1+ installed, you may
	# initialize and index your mirror using the following commands:
	public-inbox-init -V2 test-report test-report/ http://inbox.dpdk.org/test-report \
		test-report@dpdk.org
	public-inbox-index test-report


Newsgroup available over NNTP:
	nntp://inbox.dpdk.org/inbox.dpdk.test-report


AGPL code for this site: git clone https://public-inbox.org/ public-inbox