automatic DPDK test reports
 help / color / mirror / Atom feed
* [dpdk-test-report]  |FAILURE| pw66481[v2, 1/7] net/iavf: stop the PCI probe in DCF mode
@ 2020-03-10 13:13 sys_stv
  0 siblings, 0 replies; only message in thread
From: sys_stv @ 2020-03-10 13:13 UTC (permalink / raw)
  To: test-report

[-- Attachment #1: Type: text/plain, Size: 89777 bytes --]

Test-Label: Intel-compilation
Test-Status: FAILURE
http://dpdk.org/patch/66481

_Compilation issues_

Submitter: Haiyue Wang <haiyue.wang@intel.com>
Date: 2020-03-10 06:50:23
Reply_mail: 20200310065029.40966-2-haiyue.wang@intel.com
DPDK git baseline: Repo:dpdk-next-net-intel, CommitID: 518a54a50d7fba590dd1c9b2fc3d819f90ee996e

Makefile build Summary: 23 Builds Done, 0 Successful, 23 Failures

Meson build Summary: 8 Builds Done, 2 Successful, 6 Failures

               +==============================================+===========+==========+
               |                   Makefile                   |   Meson   | Document |
+----------------+------+-------+------+------------+-----------+-----------+----------+
| os             | gcc  | clang | icc  | gcc+shared | gcc+debug | gcc/clang | pdf/html |
+----------------+------+-------+------+------------+-----------+-----------+----------+
| RHEL80-64      | FAIL |       |      |            |           |           |          |
| UB1804-64      | FAIL | FAIL  | FAIL |            |           | FAIL      | pass     |
| UB1604-32      | FAIL |       |      |            |           | FAIL      |          |
| CENTOS77-64    | FAIL | FAIL  | FAIL | FAIL       | FAIL      | FAIL      |          |
| UB1604-64      | FAIL | FAIL  |      |            |           |           |          |
| WIN10-64       |      |       |      |            |           | pass      |          |
| UB1910-64      | FAIL |       |      |            |           |           |          |
| FC31-64        | FAIL | FAIL  |      |            |           | FAIL      |          |
| CENTOS80-64    | FAIL |       |      |            |           |           |          |
| FreeBSD1201-64 | FAIL | FAIL  |      | FAIL       | FAIL      | FAIL      |          |
| RHEL77-64      | FAIL |       |      |            |           |           |          |
| SUSE15-64      | FAIL | FAIL  |      |            |           | FAIL      |          |
+----------------+------+-------+------+------------+-----------+-----------+----------+

Test environment and configuration as below:

** Makefile build **


OS: UB1804-64
	Kernel Version: 4.15.0-20-generic
	CPU info: Intel(R) Xeon(R) CPU E5-2699 v3 @ 2.30GHz
	GCC Version: gcc (Ubuntu 7.3.0-27ubuntu1~18.04) 7.3.0
	Clang Version: 6.0.0-1ubuntu2 (tags/RELEASE_600/final)
	x86_64-native-linuxapp-icc
	x86_64-native-linuxapp-clang
	x86_64-native-linuxapp-gcc


OS: UB1604-32
	Kernel Version: 4.4.0-131-generic
	CPU info: Intel(R) Xeon(R) CPU E5-2699 v3 @ 2.30GHz
	GCC Version: gcc (Ubuntu 5.4.0-6ubuntu1~16.04.11) 5.4.0 20160609
	Clang Version: 3.8.0-2ubuntu4 (tags/RELEASE_380/final)
	i686-native-linuxapp-gcc


OS: CENTOS77-64
	Kernel Version: 3.10.0-1062.9.1.el7.x86_64
	CPU info: Intel(R) Xeon(R) CPU E5-2699 v4 @ 2.20GHz
	GCC Version: gcc (GCC) 4.8.5 20150623 (Red Hat 4.8.5-39)
	Clang Version: 3.4.2 (tags/RELEASE_34/dot2-final)
	x86_64-native-linuxapp-gcc+debug
	x86_64-native-linuxapp-gcc
	x86_64-native-linuxapp-clang
	x86_64-native-linuxapp-gcc+shared
	x86_64-native-linuxapp-icc


OS: UB1910-64
	Kernel Version: 5.3.0-18-generic
	CPU info: Intel(R) Xeon(R) CPU E5-2699 v3 @ 2.30GHz
	GCC Version: gcc (Ubuntu 9.2.1-9ubuntu2) 9.2.1 20191008
	Clang Version: 9.0.0-2 (tags/RELEASE_900/final)
	x86_64-native-linuxapp-gcc


OS: CENTOS80-64
	Kernel Version: 4.18.0-80.11.2.el8_0.x86_64
	CPU info: Intel(R) Xeon(R) CPU E5-2699 v4 @ 2.20GHz
	GCC Version: gcc (GCC) 8.2.1 20180905 (Red Hat 8.2.1-3)
	Clang Version: 7.0.1 (tags/RELEASE_701/final)
	x86_64-native-linuxapp-gcc


OS: UB1604-64
	Kernel Version: 4.4.0-170-generic
	CPU info: Intel(R) Xeon(R) CPU E5-2699 v3 @ 2.30GHz
	GCC Version: gcc (Ubuntu 5.4.0-6ubuntu1~16.04.12) 5.4.0 20160609
	Clang Version: 3.8.0-2ubuntu4 (tags/RELEASE_380/final)
	x86_64-native-linuxapp-clang
	x86_64-native-linuxapp-gcc


OS: FC31-64
	Kernel Version: 5.3.15-300.fc31.x86_64
	CPU info: Intel(R) Xeon(R) CPU E5-2699 v4 @ 2.20GHz
	GCC Version: gcc (GCC) 9.2.1 20190827 (Red Hat 9.2.1-1)
	Clang Version: 9.0.0 (Fedora 9.0.0-1.fc31)
	x86_64-native-linuxapp-gcc
	x86_64-native-linuxapp-clang


OS: RHEL80-64
	Kernel Version: 4.18.0-80.el8.x86_64
	CPU info: Intel(R) Xeon(R) CPU E5-2699 v4 @ 2.20GHz
	GCC Version: gcc (GCC) 8.2.1 20180905 (Red Hat 8.2.1-3)
	Clang Version: 6.0.1 (tags/RELEASE_601/final)
	x86_64-native-linuxapp-gcc


OS: FreeBSD1201-64
	Kernel Version: 12.1-RELEASE
	CPU info: Intel(R) Xeon(R) CPU E5-2699 v4 @ 2.20GHz (2194.96-MHz K8-class CPU)
	GCC Version: gcc (FreeBSD Ports Collection) 9.2.0
	Clang Version: 8.0.1 (tags/RELEASE_801/final 366581) (based on LLVM 8.0.1)
	x86_64-native-bsdapp-clang
	x86_64-native-bsdapp-gcc
	x86_64-native-bsdapp-gcc+debug
	x86_64-native-bsdapp-gcc+shared


OS: RHEL77-64
	Kernel Version: 3.10.0-1062.9.1.el7.x86_64
	CPU info: Intel(R) Xeon(R) CPU E5-2699 v4 @ 2.20GHz
	GCC Version: gcc (GCC) 4.8.5 20150623 (Red Hat 4.8.5-39)
	Clang Version: 3.4.2 (tags/RELEASE_34/dot2-final)
	x86_64-native-linuxapp-gcc


OS: SUSE15-64
	Kernel Version: 4.12.14-lp150.11-default
	CPU info: Intel(R) Xeon(R) CPU E5-2699 v4 @ 2.20GHz
	GCC Version: gcc (SUSE Linux) 7.3.1 20180323 [gcc-7-branch revision 258812]
	Clang Version: 5.0.1 (tags/RELEASE_501/final 312548)
	x86_64-native-linuxapp-gcc
	x86_64-native-linuxapp-clang


** Meson build **


OS: UB1804-64
	Kernel Version: 4.15.0-20-generic
	CPU info: Intel(R) Xeon(R) CPU E5-2699 v4 @ 2.20GHz
	GCC Version: gcc (Ubuntu 7.3.0-27ubuntu1~18.04) 7.3.0
	Clang Version: 6.0.0-1ubuntu2 (tags/RELEASE_600/final)
	x86_64-native-linuxapp-doc
	./build-gcc-static
	./build-gcc-shared
	./build-clang-static
	./build-clang-shared
	./build-x86-default


OS: UB1604-32
	Kernel Version: 4.4.0-131-generic
	CPU info: Intel(R) Xeon(R) CPU E5-2699 v4 @ 2.20GHz
	GCC Version: gcc (Ubuntu 5.4.0-6ubuntu1~16.04.11) 5.4.0 20160609
	Clang Version: 3.8.0-2ubuntu4 (tags/RELEASE_380/final)
	./build-gcc-static
	./build-gcc-shared
	./build-clang-static
	./build-clang-shared
	./build-x86-default


OS: CENTOS77-64
	Kernel Version: 3.10.0-1062.12.1.el7.x86_64
	CPU info: Intel(R) Xeon(R) CPU E5-2699 v4 @ 2.20GHz
	GCC Version: gcc (GCC) 4.8.5 20150623 (Red Hat 4.8.5-39)
	Clang Version: 3.4.2 (tags/RELEASE_34/dot2-final)
	./build-gcc-static
	./build-gcc-shared
	./build-clang-static
	./build-clang-shared
	./build-x86-default


OS: WIN10-64
	Kernel Version: N/A
	CPU info: N/A
	GCC Version: N/A
	Clang Version: Clang 8.0.0
	x86_64-windows-clang


OS: FC31-64
	Kernel Version: 5.4.18-200.fc31.x86_64
	CPU info: Intel(R) Xeon(R) CPU E5-2699 v4 @ 2.20GHz
	GCC Version: gcc (GCC) 9.2.1 20190827 (Red Hat 9.2.1-1)
	Clang Version: 9.0.0 (Fedora 9.0.0-1.fc31)
	./build-gcc-static
	./build-gcc-shared
	./build-clang-static
	./build-clang-shared
	./build-x86-default


OS: FreeBSD1201-64
	Kernel Version: 12.1-RELEASE
	CPU info: Intel(R) Xeon(R) CPU E5-2699 v4 @ 2.20GHz (2194.98-MHz K8-class CPU)
	GCC Version: gcc (FreeBSD Ports Collection) 9.2.0
	Clang Version: 8.0.1 (tags/RELEASE_801/final 366581) (based on LLVM 8.0.1)
	./build-gcc-static
	./build-gcc-shared
	./build-clang-static
	./build-clang-shared
	./build-x86-default


OS: SUSE15-64
	Kernel Version: 4.12.14-lp150.12.82-default
	CPU info: Intel(R) Xeon(R) CPU E5-2699 v4 @ 2.20GHz
	GCC Version: gcc (SUSE Linux) 7.4.1 20190905 [gcc-7-branch revision 275407]
	Clang Version: 5.0.1 (tags/RELEASE_501/final 312548)
	./build-gcc-static
	./build-gcc-shared
	./build-clang-static
	./build-clang-shared
	./build-x86-default


*Make Build Failed #1:
OS: UB1604-32
Target: i686-native-linuxapp-gcc
/root/UB1604-32_K4.4.0_GCC5.4.0/i686-native-linuxapp-gcc/d5ccfec769d64aafa7cf996de2274007/dpdk/drivers/net/ice/ice_dcf.c:486:18: error: ‘VIRTCHNL_OP_DCF_CMD_BUFF’ undeclared (first use in this function)
  buff_cmd.v_op = VIRTCHNL_OP_DCF_CMD_BUFF;
                  ^
/root/UB1604-32_K4.4.0_GCC5.4.0/i686-native-linuxapp-gcc/d5ccfec769d64aafa7cf996de2274007/dpdk/drivers/net/ice/ice_dcf.c: At top level:
cc1: warning: unrecognized command line option ‘-Wno-address-of-packed-member’
/root/UB1604-32_K4.4.0_GCC5.4.0/i686-native-linuxapp-gcc/d5ccfec769d64aafa7cf996de2274007/dpdk/mk/internal/rte.compile-pre.mk:114: recipe for target 'ice_dcf.o' failed
make[6]: *** [ice_dcf.o] Error 1
make[6]: *** Waiting for unfinished jobs....
  CC i40e_vf_representor.o
  CC bnxt_ring.o
  PMDINFO virtio_cryptodev.o.pmd.c
  CC virtio_cryptodev.o.pmd.o
--
  INSTALL-LIB librte_pmd_nitrox.a
  LD ice_dcf_ethdev.o
  CC ixgbe_pf.o
  CC ixgbe_flow.o
  CC bnxt_rxq.o
/root/UB1604-32_K4.4.0_GCC5.4.0/i686-native-linuxapp-gcc/d5ccfec769d64aafa7cf996de2274007/dpdk/mk/rte.subdir.mk:35: recipe for target 'ice' failed
make[5]: *** [ice] Error 2
make[5]: *** Waiting for unfinished jobs....
  CC bnxt_rxr.o
  CC ixgbe_rxtx_vec_sse.o
  CC ixgbe_ipsec.o
  CC rte_pmd_ixgbe.o
--
  PMDINFO otx2_ethdev.o.pmd.c
  CC otx2_ethdev.o.pmd.o
  LD otx2_ethdev.o
  AR librte_pmd_octeontx2.a
  INSTALL-LIB librte_pmd_octeontx2.a
/root/UB1604-32_K4.4.0_GCC5.4.0/i686-native-linuxapp-gcc/d5ccfec769d64aafa7cf996de2274007/dpdk/mk/rte.subdir.mk:35: recipe for target 'net' failed
make[4]: *** [net] Error 2
/root/UB1604-32_K4.4.0_GCC5.4.0/i686-native-linuxapp-gcc/d5ccfec769d64aafa7cf996de2274007/dpdk/mk/rte.sdkbuild.mk:46: recipe for target 'drivers' failed
make[3]: *** [drivers] Error 2
/root/UB1604-32_K4.4.0_GCC5.4.0/i686-native-linuxapp-gcc/d5ccfec769d64aafa7cf996de2274007/dpdk/mk/rte.sdkroot.mk:98: recipe for target 'all' failed
make[2]: *** [all] Error 2
/root/UB1604-32_K4.4.0_GCC5.4.0/i686-native-linuxapp-gcc/d5ccfec769d64aafa7cf996de2274007/dpdk/mk/rte.sdkinstall.mk:60: recipe for target 'pre_install' failed
make[1]: *** [pre_install] Error 2
/root/UB1604-32_K4.4.0_GCC5.4.0/i686-native-linuxapp-gcc/d5ccfec769d64aafa7cf996de2274007/dpdk/mk/rte.sdkroot.mk:77: recipe for target 'install' failed
make: *** [install] Error 2


*Make Build Failed #2:
OS: UB1604-64
Target: x86_64-native-linuxapp-clang
  CC efx_port.o
/root/UB1604-64_K4.4.0_Clang3.8.0/x86_64-native-linuxapp-clang/d5ccfec769d64aafa7cf996de2274007/dpdk/drivers/net/ice/ice_dcf.c:486:18: error: use of undeclared identifier 'VIRTCHNL_OP_DCF_CMD_BUFF'
        buff_cmd.v_op = VIRTCHNL_OP_DCF_CMD_BUFF;
                        ^
19 errors generated.
/root/UB1604-64_K4.4.0_Clang3.8.0/x86_64-native-linuxapp-clang/d5ccfec769d64aafa7cf996de2274007/dpdk/mk/internal/rte.compile-pre.mk:114: recipe for target 'ice_dcf.o' failed
make[6]: *** [ice_dcf.o] Error 1
make[6]: *** Waiting for unfinished jobs....
  PMDINFO ice_dcf_ethdev.o.pmd.c
  CC ice_dcf_ethdev.o.pmd.o
  CC efx_proxy.o
  LD ice_dcf_ethdev.o
  CC virtio_rxtx_simple_sse.o
  CC otx2_flow_utils.o
/root/UB1604-64_K4.4.0_Clang3.8.0/x86_64-native-linuxapp-clang/d5ccfec769d64aafa7cf996de2274007/dpdk/mk/rte.subdir.mk:35: recipe for target 'ice' failed
make[5]: *** [ice] Error 2
make[5]: *** Waiting for unfinished jobs....
  CC otx2_ethdev_irq.o
  CC otx2_ethdev_ops.o
  CC efx_rx.o
  CC efx_sram.o
--
  AR librte_pmd_sfc_efx.a
  INSTALL-LIB librte_pmd_sfc_efx.a
make[6]: warning:  Clock skew detected.  Your build may be incomplete.
  AR librte_pmd_softnic.a
  INSTALL-LIB librte_pmd_softnic.a
/root/UB1604-64_K4.4.0_Clang3.8.0/x86_64-native-linuxapp-clang/d5ccfec769d64aafa7cf996de2274007/dpdk/mk/rte.subdir.mk:35: recipe for target 'net' failed
make[4]: *** [net] Error 2
/root/UB1604-64_K4.4.0_Clang3.8.0/x86_64-native-linuxapp-clang/d5ccfec769d64aafa7cf996de2274007/dpdk/mk/rte.sdkbuild.mk:46: recipe for target 'drivers' failed
make[3]: *** [drivers] Error 2
/root/UB1604-64_K4.4.0_Clang3.8.0/x86_64-native-linuxapp-clang/d5ccfec769d64aafa7cf996de2274007/dpdk/mk/rte.sdkroot.mk:98: recipe for target 'all' failed
make[2]: *** [all] Error 2
/root/UB1604-64_K4.4.0_Clang3.8.0/x86_64-native-linuxapp-clang/d5ccfec769d64aafa7cf996de2274007/dpdk/mk/rte.sdkinstall.mk:60: recipe for target 'pre_install' failed
make[1]: *** [pre_install] Error 2
/root/UB1604-64_K4.4.0_Clang3.8.0/x86_64-native-linuxapp-clang/d5ccfec769d64aafa7cf996de2274007/dpdk/mk/rte.sdkroot.mk:77: recipe for target 'install' failed
make: *** [install] Error 2


*Make Build Failed #3:
OS: UB1910-64
Target: x86_64-native-linuxapp-gcc
      |                  ^~~~~~~~~~~~~~~~~~~~~~~~
/root/UB1910-64_K5.3.0_GCC9.2.1/x86_64-native-linuxapp-gcc/d5ccfec769d64aafa7cf996de2274007/dpdk/drivers/net/ice/ice_dcf.c:486:18: error: ‘VIRTCHNL_OP_DCF_CMD_BUFF’ undeclared (first use in this function)
  486 |  buff_cmd.v_op = VIRTCHNL_OP_DCF_CMD_BUFF;
      |                  ^~~~~~~~~~~~~~~~~~~~~~~~
  CC otx2_link.o
make[6]: *** [/root/UB1910-64_K5.3.0_GCC9.2.1/x86_64-native-linuxapp-gcc/d5ccfec769d64aafa7cf996de2274007/dpdk/mk/internal/rte.compile-pre.mk:116: ice_dcf.o] Error 1
make[6]: *** Waiting for unfinished jobs....
  CC sfc_tso.o
  PMDINFO ice_dcf_ethdev.o.pmd.c
  CC ice_dcf_ethdev.o.pmd.o
  LD ice_dcf_ethdev.o
  PMDINFO vdev_netvsc.o.pmd.c
  CC vdev_netvsc.o.pmd.o
== Build drivers/net/kni
  CC virtqueue.o
  LD vdev_netvsc.o
make[5]: *** [/root/UB1910-64_K5.3.0_GCC9.2.1/x86_64-native-linuxapp-gcc/d5ccfec769d64aafa7cf996de2274007/dpdk/mk/rte.subdir.mk:37: ice] Error 2
make[5]: *** Waiting for unfinished jobs....
  CC virtio_pci.o
  AR librte_pmd_vdev_netvsc.a
  CC sfc_filter.o
  INSTALL-LIB librte_pmd_vdev_netvsc.a
--
  CC medford_nic.o
  CC medford2_nic.o
  AR librte_pmd_sfc_efx.a
  INSTALL-LIB librte_pmd_sfc_efx.a
make[6]: warning:  Clock skew detected.  Your build may be incomplete.
make[4]: *** [/root/UB1910-64_K5.3.0_GCC9.2.1/x86_64-native-linuxapp-gcc/d5ccfec769d64aafa7cf996de2274007/dpdk/mk/rte.subdir.mk:35: net] Error 2
make[3]: *** [/root/UB1910-64_K5.3.0_GCC9.2.1/x86_64-native-linuxapp-gcc/d5ccfec769d64aafa7cf996de2274007/dpdk/mk/rte.sdkbuild.mk:46: drivers] Error 2
make[2]: *** [/root/UB1910-64_K5.3.0_GCC9.2.1/x86_64-native-linuxapp-gcc/d5ccfec769d64aafa7cf996de2274007/dpdk/mk/rte.sdkroot.mk:99: all] Error 2
make[1]: *** [/root/UB1910-64_K5.3.0_GCC9.2.1/x86_64-native-linuxapp-gcc/d5ccfec769d64aafa7cf996de2274007/dpdk/mk/rte.sdkinstall.mk:61: pre_install] Error 2
make: *** [/root/UB1910-64_K5.3.0_GCC9.2.1/x86_64-native-linuxapp-gcc/d5ccfec769d64aafa7cf996de2274007/dpdk/mk/rte.sdkroot.mk:77: install] Error 2


*Make Build Failed #4:
OS: UB1804-64
Target: x86_64-native-linuxapp-icc
/root/UB1804-64_K4.15.0_ICC19.0.0/x86_64-native-linuxapp-icc/d5ccfec769d64aafa7cf996de2274007/dpdk/drivers/net/ice/ice_dcf.c(486): error: identifier "VIRTCHNL_OP_DCF_CMD_BUFF" is undefined
  	buff_cmd.v_op = VIRTCHNL_OP_DCF_CMD_BUFF;
  	                ^

compilation aborted for /root/UB1804-64_K4.15.0_ICC19.0.0/x86_64-native-linuxapp-icc/d5ccfec769d64aafa7cf996de2274007/dpdk/drivers/net/ice/ice_dcf.c (code 2)
/root/UB1804-64_K4.15.0_ICC19.0.0/x86_64-native-linuxapp-icc/d5ccfec769d64aafa7cf996de2274007/dpdk/mk/internal/rte.compile-pre.mk:114: recipe for target 'ice_dcf.o' failed
make[6]: *** [ice_dcf.o] Error 2
make[6]: *** Waiting for unfinished jobs....
== Build drivers/net/vmxnet3
  CC bnxt_irq.o
  CC bnxt_util.o
  CC rte_eth_tap.o
/root/UB1804-64_K4.15.0_ICC19.0.0/x86_64-native-linuxapp-icc/d5ccfec769d64aafa7cf996de2274007/dpdk/mk/rte.subdir.mk:35: recipe for target 'ice' failed
make[5]: *** [ice] Error 2
make[5]: *** Waiting for unfinished jobs....
  CC tap_flow.o
  CC rte_pmd_bnxt.o
  CC bnxt_rxtx_vec_sse.o
  CC nicvf_rxtx.o
--
  LD virtio_user_ethdev.o
  AR librte_pmd_virtio.a
  INSTALL-LIB librte_pmd_virtio.a
  AR librte_pmd_octeontx2.a
  INSTALL-LIB librte_pmd_octeontx2.a
/root/UB1804-64_K4.15.0_ICC19.0.0/x86_64-native-linuxapp-icc/d5ccfec769d64aafa7cf996de2274007/dpdk/mk/rte.subdir.mk:35: recipe for target 'net' failed
make[4]: *** [net] Error 2
/root/UB1804-64_K4.15.0_ICC19.0.0/x86_64-native-linuxapp-icc/d5ccfec769d64aafa7cf996de2274007/dpdk/mk/rte.sdkbuild.mk:46: recipe for target 'drivers' failed
make[3]: *** [drivers] Error 2
/root/UB1804-64_K4.15.0_ICC19.0.0/x86_64-native-linuxapp-icc/d5ccfec769d64aafa7cf996de2274007/dpdk/mk/rte.sdkroot.mk:98: recipe for target 'all' failed
make[2]: *** [all] Error 2
/root/UB1804-64_K4.15.0_ICC19.0.0/x86_64-native-linuxapp-icc/d5ccfec769d64aafa7cf996de2274007/dpdk/mk/rte.sdkinstall.mk:60: recipe for target 'pre_install' failed
make[1]: *** [pre_install] Error 2
/root/UB1804-64_K4.15.0_ICC19.0.0/x86_64-native-linuxapp-icc/d5ccfec769d64aafa7cf996de2274007/dpdk/mk/rte.sdkroot.mk:77: recipe for target 'install' failed
make: *** [install] Error 2


*Make Build Failed #5:
OS: UB1804-64
Target: x86_64-native-linuxapp-clang
  CC bnxt_txr.o
/root/UB1804-64_K4.15.0_Clang6.0.0/x86_64-native-linuxapp-clang/d5ccfec769d64aafa7cf996de2274007/dpdk/drivers/net/ice/ice_dcf.c:486:18: error: use of undeclared identifier 'VIRTCHNL_OP_DCF_CMD_BUFF'
        buff_cmd.v_op = VIRTCHNL_OP_DCF_CMD_BUFF;
                        ^
19 errors generated.
/root/UB1804-64_K4.15.0_Clang6.0.0/x86_64-native-linuxapp-clang/d5ccfec769d64aafa7cf996de2274007/dpdk/mk/internal/rte.compile-pre.mk:114: recipe for target 'ice_dcf.o' failed
make[6]: *** [ice_dcf.o] Error 1
/root/UB1804-64_K4.15.0_Clang6.0.0/x86_64-native-linuxapp-clang/d5ccfec769d64aafa7cf996de2274007/dpdk/mk/rte.subdir.mk:35: recipe for target 'ice' failed
make[5]: *** [ice] Error 2
make[5]: *** Waiting for unfinished jobs....
  CC bnxt_vnic.o
  CC sfc_tso.o
  CC sfc_filter.o
  CC virtio_user/vhost_user.o
--
  CC medford_nic.o
  CC medford2_nic.o
  AR librte_pmd_sfc_efx.a
  INSTALL-LIB librte_pmd_sfc_efx.a
make[6]: warning:  Clock skew detected.  Your build may be incomplete.
/root/UB1804-64_K4.15.0_Clang6.0.0/x86_64-native-linuxapp-clang/d5ccfec769d64aafa7cf996de2274007/dpdk/mk/rte.subdir.mk:35: recipe for target 'net' failed
make[4]: *** [net] Error 2
/root/UB1804-64_K4.15.0_Clang6.0.0/x86_64-native-linuxapp-clang/d5ccfec769d64aafa7cf996de2274007/dpdk/mk/rte.sdkbuild.mk:46: recipe for target 'drivers' failed
make[3]: *** [drivers] Error 2
/root/UB1804-64_K4.15.0_Clang6.0.0/x86_64-native-linuxapp-clang/d5ccfec769d64aafa7cf996de2274007/dpdk/mk/rte.sdkroot.mk:98: recipe for target 'all' failed
make[2]: *** [all] Error 2
/root/UB1804-64_K4.15.0_Clang6.0.0/x86_64-native-linuxapp-clang/d5ccfec769d64aafa7cf996de2274007/dpdk/mk/rte.sdkinstall.mk:60: recipe for target 'pre_install' failed
make[1]: *** [pre_install] Error 2
/root/UB1804-64_K4.15.0_Clang6.0.0/x86_64-native-linuxapp-clang/d5ccfec769d64aafa7cf996de2274007/dpdk/mk/rte.sdkroot.mk:77: recipe for target 'install' failed
make: *** [install] Error 2


*Make Build Failed #6:
OS: CENTOS77-64
Target: x86_64-native-linuxapp-gcc+debug
/root/CENTOS77-64_K3.10.0_GCC4.8.5/x86_64-native-linuxapp-gcc+debug/d5ccfec769d64aafa7cf996de2274007/dpdk/drivers/net/ice/ice_dcf.c:486:18: error: ‘VIRTCHNL_OP_DCF_CMD_BUFF’ undeclared (first use in this function)
  buff_cmd.v_op = VIRTCHNL_OP_DCF_CMD_BUFF;
                  ^
/root/CENTOS77-64_K3.10.0_GCC4.8.5/x86_64-native-linuxapp-gcc+debug/d5ccfec769d64aafa7cf996de2274007/dpdk/drivers/net/ice/ice_dcf.c: At top level:
cc1: warning: unrecognized command line option "-Wno-address-of-packed-member" [enabled by default]
make[6]: *** [ice_dcf.o] Error 1
make[6]: *** Waiting for unfinished jobs....
  CC nfp_nsp.o
  CC nfp_nsp_cmds.o
make[5]: *** [ice] Error 2
make[5]: *** Waiting for unfinished jobs....
  CC nfp_nsp_eth.o
  CC nfp_net.o
  CC bnxt_rxr.o
  CC i40e_tm.o
--
  PMDINFO ixgbe_ethdev.o.pmd.c
  CC ixgbe_ethdev.o.pmd.o
  LD ixgbe_ethdev.o
  AR librte_pmd_ixgbe.a
  INSTALL-LIB librte_pmd_ixgbe.a
make[4]: *** [net] Error 2
make[3]: *** [drivers] Error 2
make[2]: *** [all] Error 2
make[1]: *** [pre_install] Error 2
make: *** [install] Error 2


*Make Build Failed #7:
OS: CENTOS77-64
Target: x86_64-native-linuxapp-gcc
/root/CENTOS77-64_K3.10.0_GCC4.8.5/x86_64-native-linuxapp-gcc/d5ccfec769d64aafa7cf996de2274007/dpdk/drivers/net/ice/ice_dcf.c:486:18: error: ‘VIRTCHNL_OP_DCF_CMD_BUFF’ undeclared (first use in this function)
  buff_cmd.v_op = VIRTCHNL_OP_DCF_CMD_BUFF;
                  ^
/root/CENTOS77-64_K3.10.0_GCC4.8.5/x86_64-native-linuxapp-gcc/d5ccfec769d64aafa7cf996de2274007/dpdk/drivers/net/ice/ice_dcf.c: At top level:
cc1: warning: unrecognized command line option "-Wno-address-of-packed-member" [enabled by default]
make[6]: *** [ice_dcf.o] Error 1
make[6]: *** Waiting for unfinished jobs....
== Build drivers/net/octeontx2
  CC bnxt_txq.o
  CC octeontx_rxtx.o
== Build drivers/net/pcap
  CC ixgbe_flow.o
make[5]: *** [ice] Error 2
make[5]: *** Waiting for unfinished jobs....
  CC ixgbe_rxtx_vec_sse.o
  CC bnxt_txr.o
  CC octeontx_pkovf.o
  CC ixgbe_ipsec.o
--
  PMDINFO otx2_ethdev.o.pmd.c
  CC otx2_ethdev.o.pmd.o
  LD otx2_ethdev.o
  AR librte_pmd_octeontx2.a
  INSTALL-LIB librte_pmd_octeontx2.a
make[4]: *** [net] Error 2
make[3]: *** [drivers] Error 2
make[2]: *** [all] Error 2
make[1]: *** [pre_install] Error 2
make: *** [install] Error 2


*Make Build Failed #8:
OS: CENTOS80-64
Target: x86_64-native-linuxapp-gcc
  buff_cmd.v_op = VIRTCHNL_OP_DCF_CMD_BUFF;
                  ^~~~~~~~~~~~~~~~~~~~~~~~
                  VIRTCHNL_OP_DEL_ETH_ADDR
/root/CENTOS80-64_K4.18.0_GCC8.2.1/x86_64-native-linuxapp-gcc/d5ccfec769d64aafa7cf996de2274007/dpdk/drivers/net/ice/ice_dcf.c: At top level:
cc1: warning: unrecognized command line option ‘-Wno-address-of-packed-member’
make[6]: *** [/root/CENTOS80-64_K4.18.0_GCC8.2.1/x86_64-native-linuxapp-gcc/d5ccfec769d64aafa7cf996de2274007/dpdk/mk/internal/rte.compile-pre.mk:114: ice_dcf.o] Error 1
make[5]: *** [/root/CENTOS80-64_K4.18.0_GCC8.2.1/x86_64-native-linuxapp-gcc/d5ccfec769d64aafa7cf996de2274007/dpdk/mk/rte.subdir.mk:35: ice] Error 2
make[5]: *** Waiting for unfinished jobs....
  CC sfc_dp.o
  CC rte_eth_softnic_link.o
  CC otx2_ptp.o
  CC rte_eth_softnic_tm.o
--
  CC hunt_nic.o
  CC medford_nic.o
  CC medford2_nic.o
  AR librte_pmd_sfc_efx.a
  INSTALL-LIB librte_pmd_sfc_efx.a
make[4]: *** [/root/CENTOS80-64_K4.18.0_GCC8.2.1/x86_64-native-linuxapp-gcc/d5ccfec769d64aafa7cf996de2274007/dpdk/mk/rte.subdir.mk:35: net] Error 2
make[3]: *** [/root/CENTOS80-64_K4.18.0_GCC8.2.1/x86_64-native-linuxapp-gcc/d5ccfec769d64aafa7cf996de2274007/dpdk/mk/rte.sdkbuild.mk:46: drivers] Error 2
make[2]: *** [/root/CENTOS80-64_K4.18.0_GCC8.2.1/x86_64-native-linuxapp-gcc/d5ccfec769d64aafa7cf996de2274007/dpdk/mk/rte.sdkroot.mk:99: all] Error 2
make[1]: *** [/root/CENTOS80-64_K4.18.0_GCC8.2.1/x86_64-native-linuxapp-gcc/d5ccfec769d64aafa7cf996de2274007/dpdk/mk/rte.sdkinstall.mk:61: pre_install] Error 2
make: *** [/root/CENTOS80-64_K4.18.0_GCC8.2.1/x86_64-native-linuxapp-gcc/d5ccfec769d64aafa7cf996de2274007/dpdk/mk/rte.sdkroot.mk:77: install] Error 2


*Make Build Failed #9:
OS: CENTOS77-64
Target: x86_64-native-linuxapp-clang
  CC ecore_init_fw_funcs.o
/root/CENTOS77-64_K3.10.0_Clang3.4.2/x86_64-native-linuxapp-clang/d5ccfec769d64aafa7cf996de2274007/dpdk/drivers/net/ice/ice_dcf.c:486:18: error: use of undeclared identifier 'VIRTCHNL_OP_DCF_CMD_BUFF'
        buff_cmd.v_op = VIRTCHNL_OP_DCF_CMD_BUFF;
                        ^
19 errors generated.
make[6]: *** [ice_dcf.o] Error 1
make[6]: *** Waiting for unfinished jobs....
  CC ecore_spq.o
  CC sfc_port.o
  CC tap_intr.o
  PMDINFO nicvf_ethdev.o.pmd.c
--
  CC nicvf_bsvf.o
  CC ecore_init_ops.o
  AR librte_pmd_tap.a
  INSTALL-LIB librte_pmd_tap.a
  CC sfc_rx.o
make[5]: *** [ice] Error 2
make[5]: *** Waiting for unfinished jobs....
  CC nicvf_svf.o
  CC sfc_tx.o
  CC ecore_mcp.o
  CC ecore_int.o
--
  CC hunt_nic.o
  CC medford_nic.o
  CC medford2_nic.o
  AR librte_pmd_sfc_efx.a
  INSTALL-LIB librte_pmd_sfc_efx.a
make[4]: *** [net] Error 2
make[3]: *** [drivers] Error 2
make[2]: *** [all] Error 2
make[1]: *** [pre_install] Error 2
make: *** [install] Error 2


*Make Build Failed #10:
OS: CENTOS77-64
Target: x86_64-native-linuxapp-gcc+shared
/root/CENTOS77-64_K3.10.0_GCC4.8.5/x86_64-native-linuxapp-gcc+shared/d5ccfec769d64aafa7cf996de2274007/dpdk/drivers/net/ice/ice_dcf.c:486:18: error: ‘VIRTCHNL_OP_DCF_CMD_BUFF’ undeclared (first use in this function)
  buff_cmd.v_op = VIRTCHNL_OP_DCF_CMD_BUFF;
                  ^
/root/CENTOS77-64_K3.10.0_GCC4.8.5/x86_64-native-linuxapp-gcc+shared/d5ccfec769d64aafa7cf996de2274007/dpdk/drivers/net/ice/ice_dcf.c: At top level:
cc1: warning: unrecognized command line option "-Wno-address-of-packed-member" [enabled by default]
make[6]: *** [ice_dcf.o] Error 1
make[5]: *** [ice] Error 2
make[5]: *** Waiting for unfinished jobs....
  CC otx2_rss.o
  CC qede_rxtx.o
  CC qede_filter.o
  CC efx_mcdi.o
--
  CC medford2_nic.o
  LD librte_pmd_sfc_efx.so.20.0.2
  INSTALL-LIB librte_pmd_sfc_efx.so.20.0.2
  LD librte_pmd_octeontx2.so.20.0.2
  INSTALL-LIB librte_pmd_octeontx2.so.20.0.2
make[4]: *** [net] Error 2
make[3]: *** [drivers] Error 2
make[2]: *** [all] Error 2
make[1]: *** [pre_install] Error 2
make: *** [install] Error 2


*Make Build Failed #11:
OS: CENTOS77-64
Target: x86_64-native-linuxapp-icc
  	buff_cmd.v_op = VIRTCHNL_OP_DCF_CMD_BUFF;
  	                ^

compilation aborted for /root/CENTOS77-64_K3.10.0_ICC19.0.0/x86_64-native-linuxapp-icc/d5ccfec769d64aafa7cf996de2274007/dpdk/drivers/net/ice/ice_dcf.c (code 2)
  CC nicvf_rxtx.o
make[6]: *** [ice_dcf.o] Error 2
make[5]: *** [ice] Error 2
make[5]: *** Waiting for unfinished jobs....
  CC nicvf_hw.o
  CC otx2_lookup.o
  CC otx2_ethdev.o
  CC ecore_sp_commands.o
--
  LD qede_ethdev.o
  AR librte_pmd_qede.a
  INSTALL-LIB librte_pmd_qede.a
  AR librte_pmd_octeontx2.a
  INSTALL-LIB librte_pmd_octeontx2.a
make[4]: *** [net] Error 2
make[3]: *** [drivers] Error 2
make[2]: *** [all] Error 2
make[1]: *** [pre_install] Error 2
make: *** [install] Error 2


*Make Build Failed #12:
OS: SUSE15-64
Target: x86_64-native-linuxapp-gcc
  buff_cmd.v_op = VIRTCHNL_OP_DCF_CMD_BUFF;
                  ^~~~~~~~~~~~~~~~~~~~~~~~
                  VIRTCHNL_OP_DCF_CMD_DESC
/root/SUSE15-64_K4.12.14_GCC7.3.1/x86_64-native-linuxapp-gcc/d5ccfec769d64aafa7cf996de2274007/dpdk/drivers/net/ice/ice_dcf.c: At top level:
cc1: warning: unrecognized command line option ‘-Wno-address-of-packed-member’
make[6]: *** [/root/SUSE15-64_K4.12.14_GCC7.3.1/x86_64-native-linuxapp-gcc/d5ccfec769d64aafa7cf996de2274007/dpdk/mk/internal/rte.compile-pre.mk:116: ice_dcf.o] Error 1
make[6]: *** Waiting for unfinished jobs....
  LD ice_dcf_ethdev.o
  CC nfp_nsp.o
  CC rte_pmd_i40e.o
  CC ixgbe_ethdev.o
--
/root/SUSE15-64_K4.12.14_GCC7.3.1/x86_64-native-linuxapp-gcc/d5ccfec769d64aafa7cf996de2274007/dpdk/drivers/net/ice/ice_dcf_parent.c:296:11: error: ‘struct ice_hw’ has no member named ‘dcf_enabled’
  parent_hw->dcf_enabled = true;
           ^~
/root/SUSE15-64_K4.12.14_GCC7.3.1/x86_64-native-linuxapp-gcc/d5ccfec769d64aafa7cf996de2274007/dpdk/drivers/net/ice/ice_dcf_parent.c: At top level:
cc1: warning: unrecognized command line option ‘-Wno-address-of-packed-member’
make[6]: *** [/root/SUSE15-64_K4.12.14_GCC7.3.1/x86_64-native-linuxapp-gcc/d5ccfec769d64aafa7cf996de2274007/dpdk/mk/internal/rte.compile-pre.mk:116: ice_dcf_parent.o] Error 1
  CC i40e_tm.o
make[5]: *** [/root/SUSE15-64_K4.12.14_GCC7.3.1/x86_64-native-linuxapp-gcc/d5ccfec769d64aafa7cf996de2274007/dpdk/mk/rte.subdir.mk:35: ice] Error 2
make[5]: *** Waiting for unfinished jobs....
  CC ecore_cxt.o
  CC ixgbe_fdir.o
  CC nfp_nsp_cmds.o
  CC nfp_nsp_eth.o
--
  LD otx2_ethdev.o
  AR librte_pmd_octeontx2.a
  INSTALL-LIB librte_pmd_octeontx2.a
  AR librte_pmd_qede.a
  INSTALL-LIB librte_pmd_qede.a
make[4]: *** [/root/SUSE15-64_K4.12.14_GCC7.3.1/x86_64-native-linuxapp-gcc/d5ccfec769d64aafa7cf996de2274007/dpdk/mk/rte.subdir.mk:35: net] Error 2
make[3]: *** [/root/SUSE15-64_K4.12.14_GCC7.3.1/x86_64-native-linuxapp-gcc/d5ccfec769d64aafa7cf996de2274007/dpdk/mk/rte.sdkbuild.mk:46: drivers] Error 2
make[2]: *** [/root/SUSE15-64_K4.12.14_GCC7.3.1/x86_64-native-linuxapp-gcc/d5ccfec769d64aafa7cf996de2274007/dpdk/mk/rte.sdkroot.mk:99: all] Error 2
make[1]: *** [/root/SUSE15-64_K4.12.14_GCC7.3.1/x86_64-native-linuxapp-gcc/d5ccfec769d64aafa7cf996de2274007/dpdk/mk/rte.sdkinstall.mk:61: pre_install] Error 2
make: *** [/root/SUSE15-64_K4.12.14_GCC7.3.1/x86_64-native-linuxapp-gcc/d5ccfec769d64aafa7cf996de2274007/dpdk/mk/rte.sdkroot.mk:77: install] Error 2


*Make Build Failed #13:
OS: FC31-64
Target: x86_64-native-linuxapp-gcc
  475 |  desc_cmd.v_op = VIRTCHNL_OP_DCF_CMD_DESC;
      |                  ^~~~~~~~~~~~~~~~~~~~~~~~
/root/FC31-64_K5.3.14_GCC9.2.1/x86_64-native-linuxapp-gcc/d5ccfec769d64aafa7cf996de2274007/dpdk/drivers/net/ice/ice_dcf.c:486:18: error: ‘VIRTCHNL_OP_DCF_CMD_BUFF’ undeclared (first use in this function)
  486 |  buff_cmd.v_op = VIRTCHNL_OP_DCF_CMD_BUFF;
      |                  ^~~~~~~~~~~~~~~~~~~~~~~~
make[6]: *** [/root/FC31-64_K5.3.14_GCC9.2.1/x86_64-native-linuxapp-gcc/d5ccfec769d64aafa7cf996de2274007/dpdk/mk/internal/rte.compile-pre.mk:114: ice_dcf.o] Error 1
make[6]: *** Waiting for unfinished jobs....
  CC efx_bootcfg.o
  CC efx_crc32.o
  CC efx_ev.o
  CC efx_evb.o
make[5]: *** [/root/FC31-64_K5.3.14_GCC9.2.1/x86_64-native-linuxapp-gcc/d5ccfec769d64aafa7cf996de2274007/dpdk/mk/rte.subdir.mk:35: ice] Error 2
make[5]: *** Waiting for unfinished jobs....
  CC efx_filter.o
  CC otx2_rss.o
  CC efx_hash.o
  CC efx_intr.o
--
  CC medford2_nic.o
  AR librte_pmd_octeontx2.a
  INSTALL-LIB librte_pmd_octeontx2.a
  AR librte_pmd_sfc_efx.a
  INSTALL-LIB librte_pmd_sfc_efx.a
make[4]: *** [/root/FC31-64_K5.3.14_GCC9.2.1/x86_64-native-linuxapp-gcc/d5ccfec769d64aafa7cf996de2274007/dpdk/mk/rte.subdir.mk:35: net] Error 2
make[3]: *** [/root/FC31-64_K5.3.14_GCC9.2.1/x86_64-native-linuxapp-gcc/d5ccfec769d64aafa7cf996de2274007/dpdk/mk/rte.sdkbuild.mk:46: drivers] Error 2
make[2]: *** [/root/FC31-64_K5.3.14_GCC9.2.1/x86_64-native-linuxapp-gcc/d5ccfec769d64aafa7cf996de2274007/dpdk/mk/rte.sdkroot.mk:99: all] Error 2
make[1]: *** [/root/FC31-64_K5.3.14_GCC9.2.1/x86_64-native-linuxapp-gcc/d5ccfec769d64aafa7cf996de2274007/dpdk/mk/rte.sdkinstall.mk:61: pre_install] Error 2
make: *** [/root/FC31-64_K5.3.14_GCC9.2.1/x86_64-native-linuxapp-gcc/d5ccfec769d64aafa7cf996de2274007/dpdk/mk/rte.sdkroot.mk:77: install] Error 2


*Make Build Failed #14:
OS: RHEL77-64
Target: x86_64-native-linuxapp-gcc
/root/RHEL77-64_K3.10.0_GCC4.8.5/x86_64-native-linuxapp-gcc/d5ccfec769d64aafa7cf996de2274007/dpdk/drivers/net/ice/ice_dcf.c:486:18: error: ‘VIRTCHNL_OP_DCF_CMD_BUFF’ undeclared (first use in this function)
  buff_cmd.v_op = VIRTCHNL_OP_DCF_CMD_BUFF;
                  ^
/root/RHEL77-64_K3.10.0_GCC4.8.5/x86_64-native-linuxapp-gcc/d5ccfec769d64aafa7cf996de2274007/dpdk/drivers/net/ice/ice_dcf.c: At top level:
cc1: warning: unrecognized command line option "-Wno-address-of-packed-member" [enabled by default]
make[6]: *** [ice_dcf.o] Error 1
make[6]: *** Waiting for unfinished jobs....
  CC otx2_tx.o
== Build drivers/net/qede
== Build drivers/net/ring
make[5]: *** [ice] Error 2
make[5]: *** Waiting for unfinished jobs....
  CC otx2_tm.o
  AR librte_pmd_i40e.a
  INSTALL-LIB librte_pmd_i40e.a
  CC bnxt_rxr.o
--
  LD qede_ethdev.o
  AR librte_pmd_qede.a
  INSTALL-LIB librte_pmd_qede.a
  AR librte_pmd_octeontx2.a
  INSTALL-LIB librte_pmd_octeontx2.a
make[4]: *** [net] Error 2
make[3]: *** [drivers] Error 2
make[2]: *** [all] Error 2
make[1]: *** [pre_install] Error 2
make: *** [install] Error 2


*Make Build Failed #15:
OS: SUSE15-64
Target: x86_64-native-linuxapp-clang
                        ^
/root/SUSE15-64_K4.12.14_Clang5.0.1/x86_64-native-linuxapp-clang/d5ccfec769d64aafa7cf996de2274007/dpdk/drivers/net/ice/ice_dcf.c:486:18: error: use of undeclared identifier 'VIRTCHNL_OP_DCF_CMD_BUFF'
        buff_cmd.v_op = VIRTCHNL_OP_DCF_CMD_BUFF;
                        ^
19 errors generated.
make[6]: *** [/root/SUSE15-64_K4.12.14_Clang5.0.1/x86_64-native-linuxapp-clang/d5ccfec769d64aafa7cf996de2274007/dpdk/mk/internal/rte.compile-pre.mk:116: ice_dcf.o] Error 1
make[6]: *** Waiting for unfinished jobs....
  CC ixgbe_dcb_82598.o
  CC ixgbe_mbx.o
== Build drivers/net/null
== Build drivers/net/octeontx
--
  CC octeontx_pkivf.o.pmd.o
  LD octeontx_pkivf.o
  AR librte_pmd_null.a
  INSTALL-LIB librte_pmd_null.a
  CC octeontx_bgx.o
make[5]: *** [/root/SUSE15-64_K4.12.14_Clang5.0.1/x86_64-native-linuxapp-clang/d5ccfec769d64aafa7cf996de2274007/dpdk/mk/rte.subdir.mk:35: ice] Error 2
make[5]: *** Waiting for unfinished jobs....
  CC bnxt_flow.o
== Build drivers/net/pcap
  CC nfp_crc.o
  CC bnxt_hwrm.o
--
  INSTALL-LIB librte_pmd_bnxt.a
  AR librte_pmd_ixgbe.a
  INSTALL-LIB librte_pmd_ixgbe.a
  AR librte_pmd_octeontx2.a
  INSTALL-LIB librte_pmd_octeontx2.a
make[4]: *** [/root/SUSE15-64_K4.12.14_Clang5.0.1/x86_64-native-linuxapp-clang/d5ccfec769d64aafa7cf996de2274007/dpdk/mk/rte.subdir.mk:35: net] Error 2
make[3]: *** [/root/SUSE15-64_K4.12.14_Clang5.0.1/x86_64-native-linuxapp-clang/d5ccfec769d64aafa7cf996de2274007/dpdk/mk/rte.sdkbuild.mk:46: drivers] Error 2
make[2]: *** [/root/SUSE15-64_K4.12.14_Clang5.0.1/x86_64-native-linuxapp-clang/d5ccfec769d64aafa7cf996de2274007/dpdk/mk/rte.sdkroot.mk:99: all] Error 2
make[1]: *** [/root/SUSE15-64_K4.12.14_Clang5.0.1/x86_64-native-linuxapp-clang/d5ccfec769d64aafa7cf996de2274007/dpdk/mk/rte.sdkinstall.mk:61: pre_install] Error 2
make: *** [/root/SUSE15-64_K4.12.14_Clang5.0.1/x86_64-native-linuxapp-clang/d5ccfec769d64aafa7cf996de2274007/dpdk/mk/rte.sdkroot.mk:77: install] Error 2


*Make Build Failed #16:
OS: RHEL80-64
Target: x86_64-native-linuxapp-gcc
  AR librte_pmd_dpaa2_sec.a
  INSTALL-LIB librte_pmd_dpaa2_sec.a
== Build drivers/crypto/dpaa_sec
  CC ecore_l2.o
  AR librte_pmd_bnxt.a
make[6]: *** [/root/RHEL80-64_K3.10.0_GCC8.2.1/x86_64-native-linuxapp-gcc/d5ccfec769d64aafa7cf996de2274007/dpdk/mk/internal/rte.compile-pre.mk:114: ice_dcf.o] Error 1
make[6]: *** Waiting for unfinished jobs....
  CC ice_dcf_parent.o
  CC otx2_tm.o
  CC ecore_sp_commands.o
== Build drivers/crypto/caam_jr
--
/root/RHEL80-64_K3.10.0_GCC8.2.1/x86_64-native-linuxapp-gcc/d5ccfec769d64aafa7cf996de2274007/dpdk/drivers/net/ice/ice_dcf_parent.c:296:11: error: ‘struct ice_hw’ has no member named ‘dcf_enabled’
  parent_hw->dcf_enabled = true;
           ^~
/root/RHEL80-64_K3.10.0_GCC8.2.1/x86_64-native-linuxapp-gcc/d5ccfec769d64aafa7cf996de2274007/dpdk/drivers/net/ice/ice_dcf_parent.c: At top level:
cc1: warning: unrecognized command line option ‘-Wno-address-of-packed-member’
make[6]: *** [/root/RHEL80-64_K3.10.0_GCC8.2.1/x86_64-native-linuxapp-gcc/d5ccfec769d64aafa7cf996de2274007/dpdk/mk/internal/rte.compile-pre.mk:116: ice_dcf_parent.o] Error 1
make[5]: *** [/root/RHEL80-64_K3.10.0_GCC8.2.1/x86_64-native-linuxapp-gcc/d5ccfec769d64aafa7cf996de2274007/dpdk/mk/rte.subdir.mk:37: ice] Error 2
make[5]: *** Waiting for unfinished jobs....
  CC otx2_rss.o
== Build drivers/crypto/virtio
  CC ecore_init_fw_funcs.o
  CC ecore_spq.o
--
  PMDINFO otx2_ethdev.o.pmd.c
  CC otx2_ethdev.o.pmd.o
  LD otx2_ethdev.o
  AR librte_pmd_octeontx2.a
  INSTALL-LIB librte_pmd_octeontx2.a
make[4]: *** [/root/RHEL80-64_K3.10.0_GCC8.2.1/x86_64-native-linuxapp-gcc/d5ccfec769d64aafa7cf996de2274007/dpdk/mk/rte.subdir.mk:35: net] Error 2
make[3]: *** [/root/RHEL80-64_K3.10.0_GCC8.2.1/x86_64-native-linuxapp-gcc/d5ccfec769d64aafa7cf996de2274007/dpdk/mk/rte.sdkbuild.mk:46: drivers] Error 2
make[2]: *** [/root/RHEL80-64_K3.10.0_GCC8.2.1/x86_64-native-linuxapp-gcc/d5ccfec769d64aafa7cf996de2274007/dpdk/mk/rte.sdkroot.mk:99: all] Error 2
make[1]: *** [/root/RHEL80-64_K3.10.0_GCC8.2.1/x86_64-native-linuxapp-gcc/d5ccfec769d64aafa7cf996de2274007/dpdk/mk/rte.sdkinstall.mk:61: pre_install] Error 2
make: *** [/root/RHEL80-64_K3.10.0_GCC8.2.1/x86_64-native-linuxapp-gcc/d5ccfec769d64aafa7cf996de2274007/dpdk/mk/rte.sdkroot.mk:77: install] Error 2


*Make Build Failed #17:
OS: FC31-64
Target: x86_64-native-linuxapp-clang
                        ^
/root/FC31-64_K5.3.14_Clang9.0.0/x86_64-native-linuxapp-clang/d5ccfec769d64aafa7cf996de2274007/dpdk/drivers/net/ice/ice_dcf.c:486:18: error: use of undeclared identifier 'VIRTCHNL_OP_DCF_CMD_BUFF'
        buff_cmd.v_op = VIRTCHNL_OP_DCF_CMD_BUFF;
                        ^
19 errors generated.
make[6]: *** [/root/FC31-64_K5.3.14_Clang9.0.0/x86_64-native-linuxapp-clang/d5ccfec769d64aafa7cf996de2274007/dpdk/mk/internal/rte.compile-pre.mk:116: ice_dcf.o] Error 1
make[6]: *** Waiting for unfinished jobs....
== Build drivers/net/sfc
  CC ecore_dev.o
== Build drivers/net/tap
  CC ecore_hw.o
--
  LD rte_eth_ring.o
  AR librte_pmd_ring.a
  INSTALL-LIB librte_pmd_ring.a
  CC rte_eth_tap.o
  CC ecore_l2.o
make[5]: *** [/root/FC31-64_K5.3.14_Clang9.0.0/x86_64-native-linuxapp-clang/d5ccfec769d64aafa7cf996de2274007/dpdk/mk/rte.subdir.mk:37: ice] Error 2
make[5]: *** Waiting for unfinished jobs....
  CC sfc.o
== Build drivers/net/thunderx
  CC ecore_sp_commands.o
  CC sfc_mcdi.o
--
  CC hunt_nic.o
  CC medford_nic.o
  CC medford2_nic.o
  AR librte_pmd_sfc_efx.a
  INSTALL-LIB librte_pmd_sfc_efx.a
make[4]: *** [/root/FC31-64_K5.3.14_Clang9.0.0/x86_64-native-linuxapp-clang/d5ccfec769d64aafa7cf996de2274007/dpdk/mk/rte.subdir.mk:35: net] Error 2
make[3]: *** [/root/FC31-64_K5.3.14_Clang9.0.0/x86_64-native-linuxapp-clang/d5ccfec769d64aafa7cf996de2274007/dpdk/mk/rte.sdkbuild.mk:46: drivers] Error 2
make[2]: *** [/root/FC31-64_K5.3.14_Clang9.0.0/x86_64-native-linuxapp-clang/d5ccfec769d64aafa7cf996de2274007/dpdk/mk/rte.sdkroot.mk:99: all] Error 2
make[1]: *** [/root/FC31-64_K5.3.14_Clang9.0.0/x86_64-native-linuxapp-clang/d5ccfec769d64aafa7cf996de2274007/dpdk/mk/rte.sdkinstall.mk:61: pre_install] Error 2
make: *** [/root/FC31-64_K5.3.14_Clang9.0.0/x86_64-native-linuxapp-clang/d5ccfec769d64aafa7cf996de2274007/dpdk/mk/rte.sdkroot.mk:77: install] Error 2


*Make Build Failed #18:
OS: UB1604-64
Target: x86_64-native-linuxapp-gcc
/root/UB1604-64_K4.4.0_GCC5.4.0/x86_64-native-linuxapp-gcc/d5ccfec769d64aafa7cf996de2274007/dpdk/drivers/net/ice/ice_dcf.c:486:18: error: ‘VIRTCHNL_OP_DCF_CMD_BUFF’ undeclared (first use in this function)
  buff_cmd.v_op = VIRTCHNL_OP_DCF_CMD_BUFF;
                  ^
/root/UB1604-64_K4.4.0_GCC5.4.0/x86_64-native-linuxapp-gcc/d5ccfec769d64aafa7cf996de2274007/dpdk/drivers/net/ice/ice_dcf.c: At top level:
cc1: warning: unrecognized command line option ‘-Wno-address-of-packed-member’
/root/UB1604-64_K4.4.0_GCC5.4.0/x86_64-native-linuxapp-gcc/d5ccfec769d64aafa7cf996de2274007/dpdk/mk/internal/rte.compile-pre.mk:114: recipe for target 'ice_dcf.o' failed
make[6]: *** [ice_dcf.o] Error 1
make[6]: *** Waiting for unfinished jobs....
== Build drivers/net/qede
== Build drivers/net/ring
  CC otx2_rx.o
  PMDINFO octeontx_ethdev.o.pmd.c
--
  AR librte_pmd_octeontx.a
  INSTALL-LIB librte_pmd_octeontx.a
  CC ixgbe_tm.o
  CC otx2_tx.o
  AR librte_pmd_i40e.a
/root/UB1604-64_K4.4.0_GCC5.4.0/x86_64-native-linuxapp-gcc/d5ccfec769d64aafa7cf996de2274007/dpdk/mk/rte.subdir.mk:35: recipe for target 'ice' failed
make[5]: *** [ice] Error 2
make[5]: *** Waiting for unfinished jobs....
  INSTALL-LIB librte_pmd_i40e.a
  CC otx2_tm.o
  CC bnxt_ring.o
  CC rte_eth_pcap.o
--
  LD qede_ethdev.o
  AR librte_pmd_qede.a
  INSTALL-LIB librte_pmd_qede.a
  AR librte_pmd_octeontx2.a
  INSTALL-LIB librte_pmd_octeontx2.a
/root/UB1604-64_K4.4.0_GCC5.4.0/x86_64-native-linuxapp-gcc/d5ccfec769d64aafa7cf996de2274007/dpdk/mk/rte.subdir.mk:35: recipe for target 'net' failed
make[4]: *** [net] Error 2
/root/UB1604-64_K4.4.0_GCC5.4.0/x86_64-native-linuxapp-gcc/d5ccfec769d64aafa7cf996de2274007/dpdk/mk/rte.sdkbuild.mk:46: recipe for target 'drivers' failed
make[3]: *** [drivers] Error 2
/root/UB1604-64_K4.4.0_GCC5.4.0/x86_64-native-linuxapp-gcc/d5ccfec769d64aafa7cf996de2274007/dpdk/mk/rte.sdkroot.mk:98: recipe for target 'all' failed
make[2]: *** [all] Error 2
/root/UB1604-64_K4.4.0_GCC5.4.0/x86_64-native-linuxapp-gcc/d5ccfec769d64aafa7cf996de2274007/dpdk/mk/rte.sdkinstall.mk:60: recipe for target 'pre_install' failed
make[1]: *** [pre_install] Error 2
/root/UB1604-64_K4.4.0_GCC5.4.0/x86_64-native-linuxapp-gcc/d5ccfec769d64aafa7cf996de2274007/dpdk/mk/rte.sdkroot.mk:77: recipe for target 'install' failed
make: *** [install] Error 2


*Make Build Failed #19:
OS: UB1804-64
Target: x86_64-native-linuxapp-gcc
                  ^~~~~~~~~~~~~~~~~~~~~~~~
                  VIRTCHNL_OP_DCF_CMD_DESC
  CC bnxt_filter.o
/root/UB1804-64_K4.15.0_GCC7.3.0/x86_64-native-linuxapp-gcc/d5ccfec769d64aafa7cf996de2274007/dpdk/drivers/net/ice/ice_dcf.c: At top level:
cc1: warning: unrecognized command line option ‘-Wno-address-of-packed-member’
/root/UB1804-64_K4.15.0_GCC7.3.0/x86_64-native-linuxapp-gcc/d5ccfec769d64aafa7cf996de2274007/dpdk/mk/internal/rte.compile-pre.mk:114: recipe for target 'ice_dcf.o' failed
make[6]: *** [ice_dcf.o] Error 1
make[6]: *** Waiting for unfinished jobs....
  CC bnxt_flow.o
  CC bnxt_hwrm.o
  CC bnxt_ring.o
/root/UB1804-64_K4.15.0_GCC7.3.0/x86_64-native-linuxapp-gcc/d5ccfec769d64aafa7cf996de2274007/dpdk/mk/rte.subdir.mk:35: recipe for target 'ice' failed
make[5]: *** [ice] Error 2
make[5]: *** Waiting for unfinished jobs....
  CC bnxt_rxq.o
  CC hn_nvs.o
  CC hn_vf.o
  CC ixgbe_pf.o
--
  LD nfp_net.o
  AR librte_pmd_bnxt.a
  INSTALL-LIB librte_pmd_bnxt.a
  AR librte_pmd_nfp.a
  INSTALL-LIB librte_pmd_nfp.a
/root/UB1804-64_K4.15.0_GCC7.3.0/x86_64-native-linuxapp-gcc/d5ccfec769d64aafa7cf996de2274007/dpdk/mk/rte.subdir.mk:35: recipe for target 'net' failed
make[4]: *** [net] Error 2
/root/UB1804-64_K4.15.0_GCC7.3.0/x86_64-native-linuxapp-gcc/d5ccfec769d64aafa7cf996de2274007/dpdk/mk/rte.sdkbuild.mk:46: recipe for target 'drivers' failed
make[3]: *** [drivers] Error 2
/root/UB1804-64_K4.15.0_GCC7.3.0/x86_64-native-linuxapp-gcc/d5ccfec769d64aafa7cf996de2274007/dpdk/mk/rte.sdkroot.mk:98: recipe for target 'all' failed
make[2]: *** [all] Error 2
/root/UB1804-64_K4.15.0_GCC7.3.0/x86_64-native-linuxapp-gcc/d5ccfec769d64aafa7cf996de2274007/dpdk/mk/rte.sdkinstall.mk:60: recipe for target 'pre_install' failed
make[1]: *** [pre_install] Error 2
/root/UB1804-64_K4.15.0_GCC7.3.0/x86_64-native-linuxapp-gcc/d5ccfec769d64aafa7cf996de2274007/dpdk/mk/rte.sdkroot.mk:77: recipe for target 'install' failed
make: *** [install] Error 2


*Make Build Failed #20:
OS: FreeBSD1201-64
Target: x86_64-native-bsdapp-clang
  CC ice_dcf_ethdev.o.pmd.o
  CC otx2_mac.o
  LD ice_dcf_ethdev.o
  CC bnxt_vnic.o
  CC ixgbe_fdir.o
gmake[6]: *** [/root/FreeBSD1201-64_K12.1_Clang8.0.1/x86_64-native-bsdapp-clang/d5ccfec769d64aafa7cf996de2274007/dpdk/mk/internal/rte.compile-pre.mk:114: ice_dcf.o] Error 1
gmake[5]: *** [/root/FreeBSD1201-64_K12.1_Clang8.0.1/x86_64-native-bsdapp-clang/d5ccfec769d64aafa7cf996de2274007/dpdk/mk/rte.subdir.mk:35: ice] Error 2
gmake[5]: *** Waiting for unfinished jobs....
  CC otx2_ptp.o
  CC bnxt_irq.o
  CC ixgbe_pf.o
  AR librte_pmd_i40e.a
--
  CC otx2_ethdev_devargs.o
  AR librte_pmd_octeontx2.a
  INSTALL-LIB librte_pmd_octeontx2.a
  AR librte_pmd_qede.a
  INSTALL-LIB librte_pmd_qede.a
gmake[4]: *** [/root/FreeBSD1201-64_K12.1_Clang8.0.1/x86_64-native-bsdapp-clang/d5ccfec769d64aafa7cf996de2274007/dpdk/mk/rte.subdir.mk:35: net] Error 2
gmake[3]: *** [/root/FreeBSD1201-64_K12.1_Clang8.0.1/x86_64-native-bsdapp-clang/d5ccfec769d64aafa7cf996de2274007/dpdk/mk/rte.sdkbuild.mk:46: drivers] Error 2
gmake[2]: *** [/root/FreeBSD1201-64_K12.1_Clang8.0.1/x86_64-native-bsdapp-clang/d5ccfec769d64aafa7cf996de2274007/dpdk/mk/rte.sdkroot.mk:99: all] Error 2
gmake[1]: *** [/root/FreeBSD1201-64_K12.1_Clang8.0.1/x86_64-native-bsdapp-clang/d5ccfec769d64aafa7cf996de2274007/dpdk/mk/rte.sdkinstall.mk:61: pre_install] Error 2
gmake: *** [/root/FreeBSD1201-64_K12.1_Clang8.0.1/x86_64-native-bsdapp-clang/d5ccfec769d64aafa7cf996de2274007/dpdk/mk/rte.sdkroot.mk:77: install] Error 2


*Make Build Failed #21:
OS: FreeBSD1201-64
Target: x86_64-native-bsdapp-gcc
  475 |  desc_cmd.v_op = VIRTCHNL_OP_DCF_CMD_DESC;
      |                  ^~~~~~~~~~~~~~~~~~~~~~~~
/root/FreeBSD1201-64_K12.1_GCC9.2.0/x86_64-native-bsdapp-gcc/d5ccfec769d64aafa7cf996de2274007/dpdk/drivers/net/ice/ice_dcf.c:486:18: error: 'VIRTCHNL_OP_DCF_CMD_BUFF' undeclared (first use in this function)
  486 |  buff_cmd.v_op = VIRTCHNL_OP_DCF_CMD_BUFF;
      |                  ^~~~~~~~~~~~~~~~~~~~~~~~
gmake[6]: *** [/root/FreeBSD1201-64_K12.1_GCC9.2.0/x86_64-native-bsdapp-gcc/d5ccfec769d64aafa7cf996de2274007/dpdk/mk/internal/rte.compile-pre.mk:114: ice_dcf.o] Error 1
gmake[6]: *** Waiting for unfinished jobs....
== Build drivers/net/virtio
gmake[5]: *** [/root/FreeBSD1201-64_K12.1_GCC9.2.0/x86_64-native-bsdapp-gcc/d5ccfec769d64aafa7cf996de2274007/dpdk/mk/rte.subdir.mk:37: ice] Error 2
gmake[5]: *** Waiting for unfinished jobs....
  CC otx2_rss.o
  CC ixgbe_rxtx_vec_sse.o
  CC sfc.o
  CC sfc_mcdi.o
--
  CC hunt_nic.o
  CC medford_nic.o
  CC medford2_nic.o
  AR librte_pmd_sfc_efx.a
  INSTALL-LIB librte_pmd_sfc_efx.a
gmake[4]: *** [/root/FreeBSD1201-64_K12.1_GCC9.2.0/x86_64-native-bsdapp-gcc/d5ccfec769d64aafa7cf996de2274007/dpdk/mk/rte.subdir.mk:35: net] Error 2
gmake[3]: *** [/root/FreeBSD1201-64_K12.1_GCC9.2.0/x86_64-native-bsdapp-gcc/d5ccfec769d64aafa7cf996de2274007/dpdk/mk/rte.sdkbuild.mk:46: drivers] Error 2
gmake[2]: *** [/root/FreeBSD1201-64_K12.1_GCC9.2.0/x86_64-native-bsdapp-gcc/d5ccfec769d64aafa7cf996de2274007/dpdk/mk/rte.sdkroot.mk:99: all] Error 2
gmake[1]: *** [/root/FreeBSD1201-64_K12.1_GCC9.2.0/x86_64-native-bsdapp-gcc/d5ccfec769d64aafa7cf996de2274007/dpdk/mk/rte.sdkinstall.mk:61: pre_install] Error 2
gmake: *** [/root/FreeBSD1201-64_K12.1_GCC9.2.0/x86_64-native-bsdapp-gcc/d5ccfec769d64aafa7cf996de2274007/dpdk/mk/rte.sdkroot.mk:77: install] Error 2


*Make Build Failed #22:
OS: FreeBSD1201-64
Target: x86_64-native-bsdapp-gcc+debug
  475 |  desc_cmd.v_op = VIRTCHNL_OP_DCF_CMD_DESC;
      |                  ^~~~~~~~~~~~~~~~~~~~~~~~
/root/FreeBSD1201-64_K12.1_GCC7.3.0/x86_64-native-bsdapp-gcc+debug/d5ccfec769d64aafa7cf996de2274007/dpdk/drivers/net/ice/ice_dcf.c:486:18: error: 'VIRTCHNL_OP_DCF_CMD_BUFF' undeclared (first use in this function)
  486 |  buff_cmd.v_op = VIRTCHNL_OP_DCF_CMD_BUFF;
      |                  ^~~~~~~~~~~~~~~~~~~~~~~~
gmake[6]: *** [/root/FreeBSD1201-64_K12.1_GCC7.3.0/x86_64-native-bsdapp-gcc+debug/d5ccfec769d64aafa7cf996de2274007/dpdk/mk/internal/rte.compile-pre.mk:116: ice_dcf.o] Error 1
gmake[5]: *** [/root/FreeBSD1201-64_K12.1_GCC7.3.0/x86_64-native-bsdapp-gcc+debug/d5ccfec769d64aafa7cf996de2274007/dpdk/mk/rte.subdir.mk:35: ice] Error 2
gmake[5]: *** Waiting for unfinished jobs....
  CC sfc_tx.o
  CC vmxnet3_rxtx.o
  CC vmxnet3_ethdev.o
  CC otx2_stats.o
--
  CC hunt_nic.o
  CC medford_nic.o
  CC medford2_nic.o
  AR librte_pmd_sfc_efx.a
  INSTALL-LIB librte_pmd_sfc_efx.a
gmake[4]: *** [/root/FreeBSD1201-64_K12.1_GCC7.3.0/x86_64-native-bsdapp-gcc+debug/d5ccfec769d64aafa7cf996de2274007/dpdk/mk/rte.subdir.mk:35: net] Error 2
gmake[3]: *** [/root/FreeBSD1201-64_K12.1_GCC7.3.0/x86_64-native-bsdapp-gcc+debug/d5ccfec769d64aafa7cf996de2274007/dpdk/mk/rte.sdkbuild.mk:46: drivers] Error 2
gmake[2]: *** [/root/FreeBSD1201-64_K12.1_GCC7.3.0/x86_64-native-bsdapp-gcc+debug/d5ccfec769d64aafa7cf996de2274007/dpdk/mk/rte.sdkroot.mk:99: all] Error 2
gmake[1]: *** [/root/FreeBSD1201-64_K12.1_GCC7.3.0/x86_64-native-bsdapp-gcc+debug/d5ccfec769d64aafa7cf996de2274007/dpdk/mk/rte.sdkinstall.mk:61: pre_install] Error 2
gmake: *** [/root/FreeBSD1201-64_K12.1_GCC7.3.0/x86_64-native-bsdapp-gcc+debug/d5ccfec769d64aafa7cf996de2274007/dpdk/mk/rte.sdkroot.mk:77: install] Error 2


*Make Build Failed #23:
OS: FreeBSD1201-64
Target: x86_64-native-bsdapp-gcc+shared
      |                  ^~~~~~~~~~~~~~~~~~~~~~~~
  CC vmxnet3_rxtx.o
/root/FreeBSD1201-64_K12.1_GCC7.3.0/x86_64-native-bsdapp-gcc+shared/d5ccfec769d64aafa7cf996de2274007/dpdk/drivers/net/ice/ice_dcf.c:486:18: error: 'VIRTCHNL_OP_DCF_CMD_BUFF' undeclared (first use in this function)
  486 |  buff_cmd.v_op = VIRTCHNL_OP_DCF_CMD_BUFF;
      |                  ^~~~~~~~~~~~~~~~~~~~~~~~
gmake[6]: *** [/root/FreeBSD1201-64_K12.1_GCC7.3.0/x86_64-native-bsdapp-gcc+shared/d5ccfec769d64aafa7cf996de2274007/dpdk/mk/internal/rte.compile-pre.mk:116: ice_dcf.o] Error 1
gmake[5]: *** [/root/FreeBSD1201-64_K12.1_GCC7.3.0/x86_64-native-bsdapp-gcc+shared/d5ccfec769d64aafa7cf996de2274007/dpdk/mk/rte.subdir.mk:37: ice] Error 2
gmake[5]: *** Waiting for unfinished jobs....
  CC ixgbe_fdir.o
  PMDINFO nicvf_ethdev.o.pmd.c
  CC nicvf_ethdev.o.pmd.o
  LD nicvf_ethdev.o
--
  CC ef10_vpd.o
  CC medford_nic.o
  CC medford2_nic.o
  LD librte_pmd_sfc_efx.so.20.0.2
  INSTALL-LIB librte_pmd_sfc_efx.so.20.0.2
gmake[4]: *** [/root/FreeBSD1201-64_K12.1_GCC7.3.0/x86_64-native-bsdapp-gcc+shared/d5ccfec769d64aafa7cf996de2274007/dpdk/mk/rte.subdir.mk:35: net] Error 2
gmake[3]: *** [/root/FreeBSD1201-64_K12.1_GCC7.3.0/x86_64-native-bsdapp-gcc+shared/d5ccfec769d64aafa7cf996de2274007/dpdk/mk/rte.sdkbuild.mk:46: drivers] Error 2
gmake[2]: *** [/root/FreeBSD1201-64_K12.1_GCC7.3.0/x86_64-native-bsdapp-gcc+shared/d5ccfec769d64aafa7cf996de2274007/dpdk/mk/rte.sdkroot.mk:99: all] Error 2
gmake[1]: *** [/root/FreeBSD1201-64_K12.1_GCC7.3.0/x86_64-native-bsdapp-gcc+shared/d5ccfec769d64aafa7cf996de2274007/dpdk/mk/rte.sdkinstall.mk:61: pre_install] Error 2
gmake: *** [/root/FreeBSD1201-64_K12.1_GCC7.3.0/x86_64-native-bsdapp-gcc+shared/d5ccfec769d64aafa7cf996de2274007/dpdk/mk/rte.sdkroot.mk:77: install] Error 2

*Meson Build Failed #1:
OS: UB1604-32
Target:./build-gcc-static
FAILED: drivers/a715181@@tmp_rte_pmd_ice@sta/net_ice_ice_dcf.c.o 
gcc -Idrivers/a715181@@tmp_rte_pmd_ice@sta -Idrivers -I../drivers -Idrivers/net/ice -I../drivers/net/ice -Idrivers/net/ice/base -I../drivers/net/ice/base -Idrivers/net/ice/../../common/iavf -I../drivers/net/ice/../../common/iavf -Ilib/librte_ethdev -I../lib/librte_ethdev -I. -I../ -Iconfig -I../config -Ilib/librte_eal/common/include -I../lib/librte_eal/common/include -I../lib/librte_eal/linux/eal/include -Ilib/librte_eal/common -I../lib/librte_eal/common -Ilib/librte_eal/common/include/arch/x86 -I../lib/librte_eal/common/include/arch/x86 -Ilib/librte_eal -I../lib/librte_eal -Ilib/librte_kvargs -I../lib/librte_kvargs -Ilib/librte_net -I../lib/librte_net -Ilib/librte_mbuf -I../lib/librte_mbuf -Ilib/librte_mempool -I../lib/librte_mempool -Ilib/librte_ring -I../lib/librte_ring -Ilib/librte_meter -I../lib/librte_meter -Idrivers/bus/pci -I../drivers/bus/pci -I../drivers/bus/pci/linux -Ilib/librte_pci -I../lib/librte_pci -Idrivers/bus/vdev -I../drivers/bus/vdev -Ilib/librte_hash -I../lib/librte_hash -Idrivers/common/iavf -I../drivers/common/iavf -fdiagnostics-color=always -pipe -D_FILE_OFFSET_BITS=64 -Wall -Winvalid-pch -Werror -O2 -g -include rte_config.h -Wextra -Wcast-qual -Wdeprecated -Wformat-nonliteral -Wformat-security -Wmissing-declarations -Wmissing-prototypes -Wnested-externs -Wold-style-definition -Wpointer-arith -Wsign-compare -Wstrict-prototypes -Wundef -Wwrite-strings -Wno-missing-field-initializers -Wno-pointer-to-int-cast -D_GNU_SOURCE -fPIC -march=native -DALLOW_EXPERIMENTAL_API -MD -MQ 'drivers/a715181@@tmp_rte_pmd_ice@sta/net_ice_ice_dcf.c.o' -MF 'drivers/a715181@@tmp_rte_pmd_ice@sta/net_ice_ice_dcf.c.o.d' -o 'drivers/a715181@@tmp_rte_pmd_ice@sta/net_ice_ice_dcf.c.o' -c ../drivers/net/ice/ice_dcf.c
../drivers/net/ice/ice_dcf.c: In function ‘ice_dcf_get_vf_resource’:
../drivers/net/ice/ice_dcf.c:235:42: error: ‘VIRTCHNL_VF_CAP_DCF’ undeclared (first use in this function)
         VIRTCHNL_VF_CAP_ADV_LINK_SPEED | VIRTCHNL_VF_CAP_DCF |
                                          ^
../drivers/net/ice/ice_dcf.c:235:42: note: each undeclared identifier is reported only once for each function it appears in
../drivers/net/ice/ice_dcf.c: In function ‘ice_dcf_get_vf_vsi_map’:
../drivers/net/ice/ice_dcf.c:279:40: error: ‘VIRTCHNL_OP_DCF_GET_VSI_MAP’ undeclared (first use in this function)
  err = ice_dcf_send_cmd_req_no_irq(hw, VIRTCHNL_OP_DCF_GET_VSI_MAP,
                                        ^
../drivers/net/ice/ice_dcf.c:295:19: error: dereferencing pointer to incomplete type ‘struct virtchnl_dcf_vsi_map’
  if (len < sizeof(*vsi_map) || !vsi_map->num_vfs ||
                   ^
../drivers/net/ice/ice_dcf.c: In function ‘ice_dcf_mode_disable’:
../drivers/net/ice/ice_dcf.c:334:40: error: ‘VIRTCHNL_OP_DCF_DISABLE’ undeclared (first use in this function)
  err = ice_dcf_send_cmd_req_no_irq(hw, VIRTCHNL_OP_DCF_DISABLE,
                                        ^
../drivers/net/ice/ice_dcf.c: In function ‘ice_dcf_send_aq_cmd’:
../drivers/net/ice/ice_dcf.c:475:18: error: ‘VIRTCHNL_OP_DCF_CMD_DESC’ undeclared (first use in this function)
  desc_cmd.v_op = VIRTCHNL_OP_DCF_CMD_DESC;
                  ^
../drivers/net/ice/ice_dcf.c:486:18: error: ‘VIRTCHNL_OP_DCF_CMD_BUFF’ undeclared (first use in this function)
  buff_cmd.v_op = VIRTCHNL_OP_DCF_CMD_BUFF;
                  ^
[997/1975] Compiling C object 'drivers/a715181@@tmp_rte_pmd_ice@sta/net_ice_ice_dcf_parent.c.o'.
FAILED: drivers/a715181@@tmp_rte_pmd_ice@sta/net_ice_ice_dcf_parent.c.o 
gcc -Idrivers/a715181@@tmp_rte_pmd_ice@sta -Idrivers -I../drivers -Idrivers/net/ice -I../drivers/net/ice -Idrivers/net/ice/base -I../drivers/net/ice/base -Idrivers/net/ice/../../common/iavf -I../drivers/net/ice/../../common/iavf -Ilib/librte_ethdev -I../lib/librte_ethdev -I. -I../ -Iconfig -I../config -Ilib/librte_eal/common/include -I../lib/librte_eal/common/include -I../lib/librte_eal/linux/eal/include -Ilib/librte_eal/common -I../lib/librte_eal/common -Ilib/librte_eal/common/include/arch/x86 -I../lib/librte_eal/common/include/arch/x86 -Ilib/librte_eal -I../lib/librte_eal -Ilib/librte_kvargs -I../lib/librte_kvargs -Ilib/librte_net -I../lib/librte_net -Ilib/librte_mbuf -I../lib/librte_mbuf -Ilib/librte_mempool -I../lib/librte_mempool -Ilib/librte_ring -I../lib/librte_ring -Ilib/librte_meter -I../lib/librte_meter -Idrivers/bus/pci -I../drivers/bus/pci -I../drivers/bus/pci/linux -Ilib/librte_pci -I../lib/librte_pci -Idrivers/bus/vdev -I../drivers/bus/vdev -Ilib/librte_hash -I../lib/librte_hash -Idrivers/common/iavf -I../drivers/common/iavf -fdiagnostics-color=always -pipe -D_FILE_OFFSET_BITS=64 -Wall -Winvalid-pch -Werror -O2 -g -include rte_config.h -Wextra -Wcast-qual -Wdeprecated -Wformat-nonliteral -Wformat-security -Wmissing-declarations -Wmissing-prototypes -Wnested-externs -Wold-style-definition -Wpointer-arith -Wsign-compare -Wstrict-prototypes -Wundef -Wwrite-strings -Wno-missing-field-initializers -Wno-pointer-to-int-cast -D_GNU_SOURCE -fPIC -march=native -DALLOW_EXPERIMENTAL_API -MD -MQ 'drivers/a715181@@tmp_rte_pmd_ice@sta/net_ice_ice_dcf_parent.c.o' -MF 'drivers/a715181@@tmp_rte_pmd_ice@sta/net_ice_ice_dcf_parent.c.o.d' -o 'drivers/a715181@@tmp_rte_pmd_ice@sta/net_ice_ice_dcf_parent.c.o' -c ../drivers/net/ice/ice_dcf_parent.c
../drivers/net/ice/ice_dcf_parent.c: In function ‘ice_dcf_update_vsi_ctx’:
../drivers/net/ice/ice_dcf_parent.c:27:16: error: ‘VIRTCHNL_DCF_VF_VSI_VALID’ undeclared (first use in this function)
  if (vsi_map & VIRTCHNL_DCF_VF_VSI_VALID) {
                ^
../drivers/net/ice/ice_dcf_parent.c:27:16: note: each undeclared identifier is reported only once for each function it appears in
../drivers/net/ice/ice_dcf_parent.c:37:33: error: ‘VIRTCHNL_DCF_VF_VSI_ID_M’ undeclared (first use in this function)
   vsi_ctx->vsi_num = (vsi_map & VIRTCHNL_DCF_VF_VSI_ID_M) >>
                                 ^
../drivers/net/ice/ice_dcf_parent.c:38:12: error: ‘VIRTCHNL_DCF_VF_VSI_ID_S’ undeclared (first use in this function)
            VIRTCHNL_DCF_VF_VSI_ID_S;
            ^
../drivers/net/ice/ice_dcf_parent.c: In function ‘ice_dcf_handle_pf_event_msg’:
../drivers/net/ice/ice_dcf_parent.c:99:7: error: ‘VIRTCHNL_EVENT_DCF_VSI_MAP_UPDATE’ undeclared (first use in this function)
  case VIRTCHNL_EVENT_DCF_VSI_MAP_UPDATE:
       ^
In file included from ../drivers/net/ice/base/ice_osdep.h:27:0,
                 from ../drivers/net/ice/base/ice_type.h:40,
                 from ../drivers/net/ice/base/ice_common.h:8,
                 from ../drivers/net/ice/ice_dcf_ethdev.h:8,
                 from ../drivers/net/ice/ice_dcf_parent.c:10:
../drivers/net/ice/ice_dcf_parent.c:101:26: error: ‘union <anonymous>’ has no member named ‘vf_vsi_map’
        pf_msg->event_data.vf_vsi_map.vf_id,
                          ^
../drivers/net/ice/base/../ice_logs.h:46:16: note: in definition of macro ‘PMD_DRV_LOG_RAW’
   __func__, ## args)
                ^
../drivers/net/ice/ice_dcf_parent.c:100:3: note: in expansion of macro ‘PMD_DRV_LOG’
   PMD_DRV_LOG(DEBUG, "VIRTCHNL_EVENT_DCF_VSI_MAP_UPDATE event : VF%u with VSI num %u",
   ^
../drivers/net/ice/ice_dcf_parent.c:102:26: error: ‘union <anonymous>’ has no member named ‘vf_vsi_map’
        pf_msg->event_data.vf_vsi_map.vsi_id);
                          ^
../drivers/net/ice/base/../ice_logs.h:46:16: note: in definition of macro ‘PMD_DRV_LOG_RAW’
   __func__, ## args)
                ^
../drivers/net/ice/ice_dcf_parent.c:100:3: note: in expansion of macro ‘PMD_DRV_LOG’
   PMD_DRV_LOG(DEBUG, "VIRTCHNL_EVENT_DCF_VSI_MAP_UPDATE event : VF%u with VSI num %u",
   ^
../drivers/net/ice/ice_dcf_parent.c: In function ‘ice_dcf_init_parent_hw’:
../drivers/net/ice/ice_dcf_parent.c:158:11: error: implicit declaration of function ‘ice_init_fltr_mgmt_struct’ [-Werror=implicit-function-declaration]
  status = ice_init_fltr_mgmt_struct(hw);
           ^
../drivers/net/ice/ice_dcf_parent.c:158:2: error: nested extern declaration of ‘ice_init_fltr_mgmt_struct’ [-Werror=nested-externs]
  status = ice_init_fltr_mgmt_struct(hw);
  ^
../drivers/net/ice/ice_dcf_parent.c:175:2: error: implicit declaration of function ‘ice_cleanup_fltr_mgmt_struct’ [-Werror=implicit-function-declaration]
  ice_cleanup_fltr_mgmt_struct(hw);
  ^
../drivers/net/ice/ice_dcf_parent.c:175:2: error: nested extern declaration of ‘ice_cleanup_fltr_mgmt_struct’ [-Werror=nested-externs]
../drivers/net/ice/ice_dcf_parent.c: In function ‘ice_dcf_init_parent_adapter’:
../drivers/net/ice/ice_dcf_parent.c:294:11: error: ‘struct ice_hw’ has no member named ‘aq_send_cmd_fn’
  parent_hw->aq_send_cmd_fn = ice_dcf_send_aq_cmd;
           ^
../drivers/net/ice/ice_dcf_parent.c:295:11: error: ‘struct ice_hw’ has no member named ‘aq_send_cmd_param’
  parent_hw->aq_send_cmd_param = &adapter->real_hw;
           ^
../drivers/net/ice/ice_dcf_parent.c:296:11: error: ‘struct ice_hw’ has no member named ‘dcf_enabled’
  parent_hw->dcf_enabled = true;
           ^
cc1: all warnings being treated as errors
[998/1975] Compiling C object 'drivers/a715181@@tmp_rte_pmd_ice@sta/net_ice_ice_fdir_filter.c.o'.
[999/1975] Compiling C object 'drivers/a715181@@tmp_rte_pmd_ice@sta/net_ice_ice_dcf_ethdev.c.o'.
[1000/1975] Compiling C object 'drivers/a715181@@tmp_rte_pmd_ice@sta/net_ice_ice_rxtx_vec_avx2.c.o'.
[1001/1975] Compiling C object 'drivers/a715181@@tmp_rte_pmd_ice@sta/net_ice_ice_rxtx_vec_sse.c.o'.
ninja: build stopped: subcommand failed




*Meson Build Failed #2:
OS: CENTOS77-64
Target:./build-gcc-static
FAILED: drivers/a715181@@tmp_rte_pmd_ice@sta/net_ice_ice_dcf.c.o 
gcc -Idrivers/a715181@@tmp_rte_pmd_ice@sta -Idrivers -I../drivers -Idrivers/net/ice -I../drivers/net/ice -Idrivers/net/ice/base -I../drivers/net/ice/base -Idrivers/net/ice/../../common/iavf -I../drivers/net/ice/../../common/iavf -Ilib/librte_ethdev -I../lib/librte_ethdev -I. -I../ -Iconfig -I../config -Ilib/librte_eal/common/include -I../lib/librte_eal/common/include -I../lib/librte_eal/linux/eal/include -Ilib/librte_eal/common -I../lib/librte_eal/common -Ilib/librte_eal/common/include/arch/x86 -I../lib/librte_eal/common/include/arch/x86 -Ilib/librte_eal -I../lib/librte_eal -Ilib/librte_kvargs -I../lib/librte_kvargs -Ilib/librte_net -I../lib/librte_net -Ilib/librte_mbuf -I../lib/librte_mbuf -Ilib/librte_mempool -I../lib/librte_mempool -Ilib/librte_ring -I../lib/librte_ring -Ilib/librte_meter -I../lib/librte_meter -Idrivers/bus/pci -I../drivers/bus/pci -I../drivers/bus/pci/linux -Ilib/librte_pci -I../lib/librte_pci -Idrivers/bus/vdev -I../drivers/bus/vdev -Ilib/librte_hash -I../lib/librte_hash -Idrivers/common/iavf -I../drivers/common/iavf -pipe -D_FILE_OFFSET_BITS=64 -Wall -Winvalid-pch -Werror -O2 -g -include rte_config.h -Wextra -Wcast-qual -Wdeprecated -Wformat-nonliteral -Wformat-security -Wmissing-declarations -Wmissing-prototypes -Wnested-externs -Wold-style-definition -Wpointer-arith -Wsign-compare -Wstrict-prototypes -Wundef -Wwrite-strings -Wno-missing-field-initializers -D_GNU_SOURCE -fPIC -march=native -DALLOW_EXPERIMENTAL_API -MD -MQ 'drivers/a715181@@tmp_rte_pmd_ice@sta/net_ice_ice_dcf.c.o' -MF 'drivers/a715181@@tmp_rte_pmd_ice@sta/net_ice_ice_dcf.c.o.d' -o 'drivers/a715181@@tmp_rte_pmd_ice@sta/net_ice_ice_dcf.c.o' -c ../drivers/net/ice/ice_dcf.c
../drivers/net/ice/ice_dcf.c: In function ‘ice_dcf_get_vf_resource’:
../drivers/net/ice/ice_dcf.c:235:42: error: ‘VIRTCHNL_VF_CAP_DCF’ undeclared (first use in this function)
         VIRTCHNL_VF_CAP_ADV_LINK_SPEED | VIRTCHNL_VF_CAP_DCF |
                                          ^
../drivers/net/ice/ice_dcf.c:235:42: note: each undeclared identifier is reported only once for each function it appears in
../drivers/net/ice/ice_dcf.c: In function ‘ice_dcf_get_vf_vsi_map’:
../drivers/net/ice/ice_dcf.c:279:40: error: ‘VIRTCHNL_OP_DCF_GET_VSI_MAP’ undeclared (first use in this function)
  err = ice_dcf_send_cmd_req_no_irq(hw, VIRTCHNL_OP_DCF_GET_VSI_MAP,
                                        ^
../drivers/net/ice/ice_dcf.c:295:19: error: dereferencing pointer to incomplete type
  if (len < sizeof(*vsi_map) || !vsi_map->num_vfs ||
                   ^
../drivers/net/ice/ice_dcf.c:295:40: error: dereferencing pointer to incomplete type
  if (len < sizeof(*vsi_map) || !vsi_map->num_vfs ||
                                        ^
../drivers/net/ice/ice_dcf.c:296:19: error: dereferencing pointer to incomplete type
      len < sizeof(*vsi_map) +
                   ^
../drivers/net/ice/ice_dcf.c:297:12: error: dereferencing pointer to incomplete type
    (vsi_map->num_vfs - 1) * sizeof(vsi_map->vf_vsi[0])) {
            ^
../drivers/net/ice/ice_dcf.c:297:43: error: dereferencing pointer to incomplete type
    (vsi_map->num_vfs - 1) * sizeof(vsi_map->vf_vsi[0])) {
                                           ^
../drivers/net/ice/ice_dcf.c:303:48: error: dereferencing pointer to incomplete type
  if (hw->num_vfs != 0 && hw->num_vfs != vsi_map->num_vfs) {
                                                ^
In file included from ../drivers/net/ice/base/ice_osdep.h:27:0,
                 from ../drivers/net/ice/base/ice_type.h:40,
                 from ../drivers/net/ice/ice_dcf.h:14,
                 from ../drivers/net/ice/ice_dcf.c:26:
../drivers/net/ice/ice_dcf.c:305:15: error: dereferencing pointer to incomplete type
        vsi_map->num_vfs, hw->num_vfs);
               ^
../drivers/net/ice/base/../ice_logs.h:46:16: note: in definition of macro ‘PMD_DRV_LOG_RAW’
   __func__, ## args)
                ^
../drivers/net/ice/ice_dcf.c:304:3: note: in expansion of macro ‘PMD_DRV_LOG’
   PMD_DRV_LOG(ERR, "The number VSI map (%u) doesn't match the number of VFs (%u)",
   ^
../drivers/net/ice/ice_dcf.c:309:15: error: dereferencing pointer to incomplete type
  len = vsi_map->num_vfs * sizeof(vsi_map->vf_vsi[0]);
               ^
../drivers/net/ice/ice_dcf.c:309:41: error: dereferencing pointer to incomplete type
  len = vsi_map->num_vfs * sizeof(vsi_map->vf_vsi[0]);
                                         ^
../drivers/net/ice/ice_dcf.c:311:24: error: dereferencing pointer to incomplete type
   hw->num_vfs = vsi_map->num_vfs;
                        ^
../drivers/net/ice/ice_dcf.c:320:37: error: dereferencing pointer to incomplete type
  if (!memcmp(hw->vf_vsi_map, vsi_map->vf_vsi, len)) {
                                     ^
../drivers/net/ice/ice_dcf.c:325:36: error: dereferencing pointer to incomplete type
  rte_memcpy(hw->vf_vsi_map, vsi_map->vf_vsi, len);
                                    ^
../drivers/net/ice/ice_dcf.c: In function ‘ice_dcf_mode_disable’:
../drivers/net/ice/ice_dcf.c:334:40: error: ‘VIRTCHNL_OP_DCF_DISABLE’ undeclared (first use in this function)
  err = ice_dcf_send_cmd_req_no_irq(hw, VIRTCHNL_OP_DCF_DISABLE,
                                        ^
../drivers/net/ice/ice_dcf.c: In function ‘ice_dcf_send_aq_cmd’:
../drivers/net/ice/ice_dcf.c:475:18: error: ‘VIRTCHNL_OP_DCF_CMD_DESC’ undeclared (first use in this function)
  desc_cmd.v_op = VIRTCHNL_OP_DCF_CMD_DESC;
                  ^
../drivers/net/ice/ice_dcf.c:486:18: error: ‘VIRTCHNL_OP_DCF_CMD_BUFF’ undeclared (first use in this function)
  buff_cmd.v_op = VIRTCHNL_OP_DCF_CMD_BUFF;
                  ^
[1042/2241] Compiling C object 'drivers/a715181@@tmp_rte_pmd_ice@sta/net_ice_ice_fdir_filter.c.o'.
[1043/2241] Compiling C object 'drivers/a715181@@tmp_rte_pmd_ice@sta/net_ice_ice_ethdev.c.o'.
[1044/2241] Compiling C object 'drivers/a715181@@tmp_rte_pmd_ice@sta/net_ice_ice_rxtx_vec_avx2.c.o'.
[1045/2241] Compiling C object 'drivers/a715181@@tmp_rte_pmd_ice@sta/net_ice_ice_rxtx_vec_sse.c.o'.
[1046/2241] Compiling C object 'drivers/a715181@@tmp_rte_pmd_ice@sta/net_ice_ice_rxtx.c.o'.
ninja: build stopped: subcommand failed




*Meson Build Failed #3:
OS: FC31-64
Target:./build-gcc-static
FAILED: drivers/a715181@@tmp_rte_pmd_ice@sta/net_ice_ice_dcf.c.o 
gcc -Idrivers/a715181@@tmp_rte_pmd_ice@sta -Idrivers -I../drivers -Idrivers/net/ice -I../drivers/net/ice -Idrivers/net/ice/base -I../drivers/net/ice/base -Idrivers/net/ice/../../common/iavf -I../drivers/net/ice/../../common/iavf -Ilib/librte_ethdev -I../lib/librte_ethdev -I. -I../ -Iconfig -I../config -Ilib/librte_eal/common/include -I../lib/librte_eal/common/include -I../lib/librte_eal/linux/eal/include -Ilib/librte_eal/common -I../lib/librte_eal/common -Ilib/librte_eal/common/include/arch/x86 -I../lib/librte_eal/common/include/arch/x86 -Ilib/librte_eal -I../lib/librte_eal -Ilib/librte_kvargs -I../lib/librte_kvargs -Ilib/librte_net -I../lib/librte_net -Ilib/librte_mbuf -I../lib/librte_mbuf -Ilib/librte_mempool -I../lib/librte_mempool -Ilib/librte_ring -I../lib/librte_ring -Ilib/librte_meter -I../lib/librte_meter -Idrivers/bus/pci -I../drivers/bus/pci -I../drivers/bus/pci/linux -Ilib/librte_pci -I../lib/librte_pci -Idrivers/bus/vdev -I../drivers/bus/vdev -Ilib/librte_hash -I../lib/librte_hash -Idrivers/common/iavf -I../drivers/common/iavf -fdiagnostics-color=always -pipe -D_FILE_OFFSET_BITS=64 -Wall -Winvalid-pch -Werror -O2 -g -include rte_config.h -Wextra -Wcast-qual -Wdeprecated -Wformat-nonliteral -Wformat-security -Wmissing-declarations -Wmissing-prototypes -Wnested-externs -Wold-style-definition -Wpointer-arith -Wsign-compare -Wstrict-prototypes -Wundef -Wwrite-strings -Wno-address-of-packed-member -Wno-packed-not-aligned -Wno-missing-field-initializers -D_GNU_SOURCE -fPIC -march=native -Wno-format-truncation -DALLOW_EXPERIMENTAL_API -MD -MQ 'drivers/a715181@@tmp_rte_pmd_ice@sta/net_ice_ice_dcf.c.o' -MF 'drivers/a715181@@tmp_rte_pmd_ice@sta/net_ice_ice_dcf.c.o.d' -o 'drivers/a715181@@tmp_rte_pmd_ice@sta/net_ice_ice_dcf.c.o' -c ../drivers/net/ice/ice_dcf.c
../drivers/net/ice/ice_dcf.c: In function ‘ice_dcf_get_vf_resource’:
../drivers/net/ice/ice_dcf.c:235:42: error: ‘VIRTCHNL_VF_CAP_DCF’ undeclared (first use in this function)
  235 |         VIRTCHNL_VF_CAP_ADV_LINK_SPEED | VIRTCHNL_VF_CAP_DCF |
      |                                          ^~~~~~~~~~~~~~~~~~~
../drivers/net/ice/ice_dcf.c:235:42: note: each undeclared identifier is reported only once for each function it appears in
../drivers/net/ice/ice_dcf.c: In function ‘ice_dcf_get_vf_vsi_map’:
../drivers/net/ice/ice_dcf.c:279:40: error: ‘VIRTCHNL_OP_DCF_GET_VSI_MAP’ undeclared (first use in this function); did you mean ‘VIRTCHNL_OP_ADD_DEL_VLAN_MAX’?
  279 |  err = ice_dcf_send_cmd_req_no_irq(hw, VIRTCHNL_OP_DCF_GET_VSI_MAP,
      |                                        ^~~~~~~~~~~~~~~~~~~~~~~~~~~
      |                                        VIRTCHNL_OP_ADD_DEL_VLAN_MAX
../drivers/net/ice/ice_dcf.c:295:19: error: dereferencing pointer to incomplete type ‘struct virtchnl_dcf_vsi_map’
  295 |  if (len < sizeof(*vsi_map) || !vsi_map->num_vfs ||
      |                   ^~~~~~~~
../drivers/net/ice/ice_dcf.c: In function ‘ice_dcf_mode_disable’:
../drivers/net/ice/ice_dcf.c:334:40: error: ‘VIRTCHNL_OP_DCF_DISABLE’ undeclared (first use in this function); did you mean ‘VIRTCHNL_OP_DEL_VLAN’?
  334 |  err = ice_dcf_send_cmd_req_no_irq(hw, VIRTCHNL_OP_DCF_DISABLE,
      |                                        ^~~~~~~~~~~~~~~~~~~~~~~
      |                                        VIRTCHNL_OP_DEL_VLAN
../drivers/net/ice/ice_dcf.c: In function ‘ice_dcf_send_aq_cmd’:
../drivers/net/ice/ice_dcf.c:475:18: error: ‘VIRTCHNL_OP_DCF_CMD_DESC’ undeclared (first use in this function)
  475 |  desc_cmd.v_op = VIRTCHNL_OP_DCF_CMD_DESC;
      |                  ^~~~~~~~~~~~~~~~~~~~~~~~
../drivers/net/ice/ice_dcf.c:486:18: error: ‘VIRTCHNL_OP_DCF_CMD_BUFF’ undeclared (first use in this function)
  486 |  buff_cmd.v_op = VIRTCHNL_OP_DCF_CMD_BUFF;
      |                  ^~~~~~~~~~~~~~~~~~~~~~~~
[1034/2250] Compiling C object 'drivers/a715181@@tmp_rte_pmd_ice@sta/net_ice_ice_dcf_ethdev.c.o'.
[1035/2250] Compiling C object 'drivers/a715181@@tmp_rte_pmd_ice@sta/net_ice_ice_fdir_filter.c.o'.
[1036/2250] Compiling C object 'drivers/a715181@@tmp_rte_pmd_ice@sta/net_ice_ice_ethdev.c.o'.
[1037/2250] Compiling C object 'drivers/a715181@@tmp_rte_pmd_ice@sta/net_ice_ice_rxtx.c.o'.
[1038/2250] Compiling C object 'drivers/a715181@@tmp_rte_pmd_ice@sta/net_ice_ice_rxtx_vec_sse.c.o'.
[1039/2250] Compiling C object 'drivers/a715181@@tmp_rte_pmd_ice@sta/net_ice_ice_rxtx_vec_avx2.c.o'.
[1040/2250] Compiling C object 'app/test/3062f5d@@dpdk-test@exe/test_cryptodev.c.o'.
ninja: build stopped: subcommand failed




*Meson Build Failed #4:
OS: UB1804-64
Target:./build-gcc-static
FAILED: drivers/a715181@@tmp_rte_pmd_ice@sta/net_ice_ice_dcf.c.o 
gcc -Idrivers/a715181@@tmp_rte_pmd_ice@sta -Idrivers -I../drivers -Idrivers/net/ice -I../drivers/net/ice -Idrivers/net/ice/base -I../drivers/net/ice/base -Idrivers/net/ice/../../common/iavf -I../drivers/net/ice/../../common/iavf -Ilib/librte_ethdev -I../lib/librte_ethdev -I. -I../ -Iconfig -I../config -Ilib/librte_eal/common/include -I../lib/librte_eal/common/include -I../lib/librte_eal/linux/eal/include -Ilib/librte_eal/common -I../lib/librte_eal/common -Ilib/librte_eal/common/include/arch/x86 -I../lib/librte_eal/common/include/arch/x86 -Ilib/librte_eal -I../lib/librte_eal -Ilib/librte_kvargs -I../lib/librte_kvargs -Ilib/librte_net -I../lib/librte_net -Ilib/librte_mbuf -I../lib/librte_mbuf -Ilib/librte_mempool -I../lib/librte_mempool -Ilib/librte_ring -I../lib/librte_ring -Ilib/librte_meter -I../lib/librte_meter -Idrivers/bus/pci -I../drivers/bus/pci -I../drivers/bus/pci/linux -Ilib/librte_pci -I../lib/librte_pci -Idrivers/bus/vdev -I../drivers/bus/vdev -Ilib/librte_hash -I../lib/librte_hash -Idrivers/common/iavf -I../drivers/common/iavf -fdiagnostics-color=always -pipe -D_FILE_OFFSET_BITS=64 -Wall -Winvalid-pch -Werror -O2 -g -include rte_config.h -Wextra -Wcast-qual -Wdeprecated -Wformat-nonliteral -Wformat-security -Wmissing-declarations -Wmissing-prototypes -Wnested-externs -Wold-style-definition -Wpointer-arith -Wsign-compare -Wstrict-prototypes -Wundef -Wwrite-strings -Wno-missing-field-initializers -D_GNU_SOURCE -fPIC -march=native -mno-avx512f -Wno-format-truncation -DALLOW_EXPERIMENTAL_API -MD -MQ 'drivers/a715181@@tmp_rte_pmd_ice@sta/net_ice_ice_dcf.c.o' -MF 'drivers/a715181@@tmp_rte_pmd_ice@sta/net_ice_ice_dcf.c.o.d' -o 'drivers/a715181@@tmp_rte_pmd_ice@sta/net_ice_ice_dcf.c.o' -c ../drivers/net/ice/ice_dcf.c
../drivers/net/ice/ice_dcf.c: In function ‘ice_dcf_get_vf_resource’:
../drivers/net/ice/ice_dcf.c:235:42: error: ‘VIRTCHNL_VF_CAP_DCF’ undeclared (first use in this function); did you mean ‘VIRTCHNL_VFR_VFACTIVE’?
         VIRTCHNL_VF_CAP_ADV_LINK_SPEED | VIRTCHNL_VF_CAP_DCF |
                                          ^~~~~~~~~~~~~~~~~~~
                                          VIRTCHNL_VFR_VFACTIVE
../drivers/net/ice/ice_dcf.c:235:42: note: each undeclared identifier is reported only once for each function it appears in
../drivers/net/ice/ice_dcf.c: In function ‘ice_dcf_get_vf_vsi_map’:
../drivers/net/ice/ice_dcf.c:279:40: error: ‘VIRTCHNL_OP_DCF_GET_VSI_MAP’ undeclared (first use in this function); did you mean ‘VIRTCHNL_OP_ADD_DEL_VLAN_MAX’?
  err = ice_dcf_send_cmd_req_no_irq(hw, VIRTCHNL_OP_DCF_GET_VSI_MAP,
                                        ^~~~~~~~~~~~~~~~~~~~~~~~~~~
                                        VIRTCHNL_OP_ADD_DEL_VLAN_MAX
../drivers/net/ice/ice_dcf.c:295:19: error: dereferencing pointer to incomplete type ‘struct virtchnl_dcf_vsi_map’
  if (len < sizeof(*vsi_map) || !vsi_map->num_vfs ||
                   ^~~~~~~~
../drivers/net/ice/ice_dcf.c: In function ‘ice_dcf_mode_disable’:
../drivers/net/ice/ice_dcf.c:334:40: error: ‘VIRTCHNL_OP_DCF_DISABLE’ undeclared (first use in this function); did you mean ‘VIRTCHNL_OP_DEL_VLAN’?
  err = ice_dcf_send_cmd_req_no_irq(hw, VIRTCHNL_OP_DCF_DISABLE,
                                        ^~~~~~~~~~~~~~~~~~~~~~~
                                        VIRTCHNL_OP_DEL_VLAN
../drivers/net/ice/ice_dcf.c: In function ‘ice_dcf_send_aq_cmd’:
../drivers/net/ice/ice_dcf.c:475:18: error: ‘VIRTCHNL_OP_DCF_CMD_DESC’ undeclared (first use in this function); did you mean ‘VIRTCHNL_OP_SET_RSS_HENA’?
  desc_cmd.v_op = VIRTCHNL_OP_DCF_CMD_DESC;
                  ^~~~~~~~~~~~~~~~~~~~~~~~
                  VIRTCHNL_OP_SET_RSS_HENA
../drivers/net/ice/ice_dcf.c:486:18: error: ‘VIRTCHNL_OP_DCF_CMD_BUFF’ undeclared (first use in this function); did you mean ‘VIRTCHNL_OP_DCF_CMD_DESC’?
  buff_cmd.v_op = VIRTCHNL_OP_DCF_CMD_BUFF;
                  ^~~~~~~~~~~~~~~~~~~~~~~~
                  VIRTCHNL_OP_DCF_CMD_DESC
[1038/2163] Compiling C object 'drivers/a715181@@tmp_rte_pmd_ice@sta/net_ice_ice_generic_flow.c.o'.
[1039/2163] Compiling C object 'drivers/a715181@@tmp_rte_pmd_ice@sta/net_ice_ice_fdir_filter.c.o'.
[1040/2163] Compiling C object 'drivers/a715181@@tmp_rte_pmd_ice@sta/net_ice_ice_rxtx.c.o'.
[1041/2163] Compiling C object 'drivers/a715181@@tmp_rte_pmd_ice@sta/net_ice_ice_rxtx_vec_sse.c.o'.
[1042/2163] Compiling C object 'app/test/3062f5d@@dpdk-test@exe/test_memcpy_perf.c.o'.
ninja: build stopped: subcommand failed




*Meson Build Failed #5:
OS: SUSE15-64
Target:./build-gcc-static
FAILED: drivers/a715181@@tmp_rte_pmd_ice@sta/net_ice_ice_dcf.c.o 
gcc -Idrivers/a715181@@tmp_rte_pmd_ice@sta -Idrivers -I../drivers -Idrivers/net/ice -I../drivers/net/ice -Idrivers/net/ice/base -I../drivers/net/ice/base -Idrivers/net/ice/../../common/iavf -I../drivers/net/ice/../../common/iavf -Ilib/librte_ethdev -I../lib/librte_ethdev -I. -I../ -Iconfig -I../config -Ilib/librte_eal/common/include -I../lib/librte_eal/common/include -I../lib/librte_eal/linux/eal/include -Ilib/librte_eal/common -I../lib/librte_eal/common -Ilib/librte_eal/common/include/arch/x86 -I../lib/librte_eal/common/include/arch/x86 -Ilib/librte_eal -I../lib/librte_eal -Ilib/librte_kvargs -I../lib/librte_kvargs -Ilib/librte_net -I../lib/librte_net -Ilib/librte_mbuf -I../lib/librte_mbuf -Ilib/librte_mempool -I../lib/librte_mempool -Ilib/librte_ring -I../lib/librte_ring -Ilib/librte_meter -I../lib/librte_meter -Idrivers/bus/pci -I../drivers/bus/pci -I../drivers/bus/pci/linux -Ilib/librte_pci -I../lib/librte_pci -Idrivers/bus/vdev -I../drivers/bus/vdev -Ilib/librte_hash -I../lib/librte_hash -Idrivers/common/iavf -I../drivers/common/iavf -fdiagnostics-color=always -pipe -D_FILE_OFFSET_BITS=64 -Wall -Winvalid-pch -Werror -O2 -g -include rte_config.h -Wextra -Wcast-qual -Wdeprecated -Wformat-nonliteral -Wformat-security -Wmissing-declarations -Wmissing-prototypes -Wnested-externs -Wold-style-definition -Wpointer-arith -Wsign-compare -Wstrict-prototypes -Wundef -Wwrite-strings -Wno-missing-field-initializers -D_GNU_SOURCE -fPIC -march=native -Wno-format-truncation -DALLOW_EXPERIMENTAL_API -MD -MQ 'drivers/a715181@@tmp_rte_pmd_ice@sta/net_ice_ice_dcf.c.o' -MF 'drivers/a715181@@tmp_rte_pmd_ice@sta/net_ice_ice_dcf.c.o.d' -o 'drivers/a715181@@tmp_rte_pmd_ice@sta/net_ice_ice_dcf.c.o' -c ../drivers/net/ice/ice_dcf.c
../drivers/net/ice/ice_dcf.c: In function ‘ice_dcf_get_vf_resource’:
../drivers/net/ice/ice_dcf.c:235:42: error: ‘VIRTCHNL_VF_CAP_DCF’ undeclared (first use in this function); did you mean ‘VIRTCHNL_VFR_VFACTIVE’?
         VIRTCHNL_VF_CAP_ADV_LINK_SPEED | VIRTCHNL_VF_CAP_DCF |
                                          ^~~~~~~~~~~~~~~~~~~
                                          VIRTCHNL_VFR_VFACTIVE
../drivers/net/ice/ice_dcf.c:235:42: note: each undeclared identifier is reported only once for each function it appears in
../drivers/net/ice/ice_dcf.c: In function ‘ice_dcf_get_vf_vsi_map’:
../drivers/net/ice/ice_dcf.c:279:40: error: ‘VIRTCHNL_OP_DCF_GET_VSI_MAP’ undeclared (first use in this function); did you mean ‘VIRTCHNL_OP_ADD_DEL_VLAN_MAX’?
  err = ice_dcf_send_cmd_req_no_irq(hw, VIRTCHNL_OP_DCF_GET_VSI_MAP,
                                        ^~~~~~~~~~~~~~~~~~~~~~~~~~~
                                        VIRTCHNL_OP_ADD_DEL_VLAN_MAX
../drivers/net/ice/ice_dcf.c:295:19: error: dereferencing pointer to incomplete type ‘struct virtchnl_dcf_vsi_map’
  if (len < sizeof(*vsi_map) || !vsi_map->num_vfs ||
                   ^~~~~~~~
../drivers/net/ice/ice_dcf.c: In function ‘ice_dcf_mode_disable’:
../drivers/net/ice/ice_dcf.c:334:40: error: ‘VIRTCHNL_OP_DCF_DISABLE’ undeclared (first use in this function); did you mean ‘VIRTCHNL_OP_DEL_VLAN’?
  err = ice_dcf_send_cmd_req_no_irq(hw, VIRTCHNL_OP_DCF_DISABLE,
                                        ^~~~~~~~~~~~~~~~~~~~~~~
                                        VIRTCHNL_OP_DEL_VLAN
../drivers/net/ice/ice_dcf.c: In function ‘ice_dcf_send_aq_cmd’:
../drivers/net/ice/ice_dcf.c:475:18: error: ‘VIRTCHNL_OP_DCF_CMD_DESC’ undeclared (first use in this function); did you mean ‘VIRTCHNL_OP_SET_RSS_HENA’?
  desc_cmd.v_op = VIRTCHNL_OP_DCF_CMD_DESC;
                  ^~~~~~~~~~~~~~~~~~~~~~~~
                  VIRTCHNL_OP_SET_RSS_HENA
../drivers/net/ice/ice_dcf.c:486:18: error: ‘VIRTCHNL_OP_DCF_CMD_BUFF’ undeclared (first use in this function); did you mean ‘VIRTCHNL_OP_DCF_CMD_DESC’?
  buff_cmd.v_op = VIRTCHNL_OP_DCF_CMD_BUFF;
                  ^~~~~~~~~~~~~~~~~~~~~~~~
                  VIRTCHNL_OP_DCF_CMD_DESC
[1035/2153] Compiling C object 'drivers/a715181@@tmp_rte_pmd_ice@sta/net_ice_ice_generic_flow.c.o'.
[1036/2153] Compiling C object 'drivers/a715181@@tmp_rte_pmd_ice@sta/net_ice_ice_ethdev.c.o'.
[1037/2153] Compiling C object 'drivers/a715181@@tmp_rte_pmd_ice@sta/net_ice_ice_dcf_ethdev.c.o'.
[1038/2153] Compiling C object 'drivers/a715181@@tmp_rte_pmd_ice@sta/net_ice_ice_fdir_filter.c.o'.
[1039/2153] Compiling C object 'drivers/a715181@@tmp_rte_pmd_ice@sta/net_ice_ice_rxtx_vec_sse.c.o'.
[1040/2153] Compiling C object 'drivers/a715181@@tmp_rte_pmd_ice@sta/net_ice_ice_rxtx.c.o'.
[1041/2153] Compiling C object 'drivers/a715181@@tmp_rte_pmd_ice@sta/net_ice_ice_rxtx_vec_avx2.c.o'.
ninja: build stopped: subcommand failed




*Meson Build Failed #6:
OS: FreeBSD1201-64
Target:./build-gcc-static
FAILED: drivers/a715181@@tmp_rte_pmd_ice@sta/net_ice_ice_dcf.c.o 
gcc -Idrivers/a715181@@tmp_rte_pmd_ice@sta -Idrivers -I../drivers -Idrivers/net/ice -I../drivers/net/ice -Idrivers/net/ice/base -I../drivers/net/ice/base -Idrivers/net/ice/../../common/iavf -I../drivers/net/ice/../../common/iavf -Ilib/librte_ethdev -I../lib/librte_ethdev -I. -I../ -Iconfig -I../config -Ilib/librte_eal/common/include -I../lib/librte_eal/common/include -I../lib/librte_eal/freebsd/eal/include -Ilib/librte_eal/common -I../lib/librte_eal/common -Ilib/librte_eal/common/include/arch/x86 -I../lib/librte_eal/common/include/arch/x86 -Ilib/librte_eal -I../lib/librte_eal -Ilib/librte_kvargs -I../lib/librte_kvargs -Ilib/librte_net -I../lib/librte_net -Ilib/librte_mbuf -I../lib/librte_mbuf -Ilib/librte_mempool -I../lib/librte_mempool -Ilib/librte_ring -I../lib/librte_ring -Ilib/librte_meter -I../lib/librte_meter -Idrivers/bus/pci -I../drivers/bus/pci -I../drivers/bus/pci/bsd -Ilib/librte_pci -I../lib/librte_pci -Idrivers/bus/vdev -I../drivers/bus/vdev -Ilib/librte_hash -I../lib/librte_hash -Idrivers/common/iavf -I../drivers/common/iavf -fdiagnostics-color=always -pipe -D_FILE_OFFSET_BITS=64 -Wall -Winvalid-pch -Werror -O2 -g -include rte_config.h -Wextra -Wcast-qual -Wdeprecated -Wformat-nonliteral -Wformat-security -Wmissing-declarations -Wmissing-prototypes -Wnested-externs -Wold-style-definition -Wpointer-arith -Wsign-compare -Wstrict-prototypes -Wundef -Wwrite-strings -Wno-address-of-packed-member -Wno-packed-not-aligned -Wno-missing-field-initializers -D_GNU_SOURCE -D__BSD_VISIBLE -fPIC -march=native -Wno-format-truncation -DALLOW_EXPERIMENTAL_API -MD -MQ 'drivers/a715181@@tmp_rte_pmd_ice@sta/net_ice_ice_dcf.c.o' -MF 'drivers/a715181@@tmp_rte_pmd_ice@sta/net_ice_ice_dcf.c.o.d' -o 'drivers/a715181@@tmp_rte_pmd_ice@sta/net_ice_ice_dcf.c.o' -c ../drivers/net/ice/ice_dcf.c
../drivers/net/ice/ice_dcf.c: In function 'ice_dcf_get_vf_resource':
../drivers/net/ice/ice_dcf.c:235:42: error: 'VIRTCHNL_VF_CAP_DCF' undeclared (first use in this function)
  235 |         VIRTCHNL_VF_CAP_ADV_LINK_SPEED | VIRTCHNL_VF_CAP_DCF |
      |                                          ^~~~~~~~~~~~~~~~~~~
../drivers/net/ice/ice_dcf.c:235:42: note: each undeclared identifier is reported only once for each function it appears in
../drivers/net/ice/ice_dcf.c: In function 'ice_dcf_get_vf_vsi_map':
../drivers/net/ice/ice_dcf.c:279:40: error: 'VIRTCHNL_OP_DCF_GET_VSI_MAP' undeclared (first use in this function); did you mean 'VIRTCHNL_OP_ADD_DEL_VLAN_MAX'?
  279 |  err = ice_dcf_send_cmd_req_no_irq(hw, VIRTCHNL_OP_DCF_GET_VSI_MAP,
      |                                        ^~~~~~~~~~~~~~~~~~~~~~~~~~~
      |                                        VIRTCHNL_OP_ADD_DEL_VLAN_MAX
../drivers/net/ice/ice_dcf.c:295:19: error: dereferencing pointer to incomplete type 'struct virtchnl_dcf_vsi_map'
  295 |  if (len < sizeof(*vsi_map) || !vsi_map->num_vfs ||
      |                   ^~~~~~~~
../drivers/net/ice/ice_dcf.c: In function 'ice_dcf_mode_disable':
../drivers/net/ice/ice_dcf.c:334:40: error: 'VIRTCHNL_OP_DCF_DISABLE' undeclared (first use in this function); did you mean 'VIRTCHNL_OP_DEL_VLAN'?
  334 |  err = ice_dcf_send_cmd_req_no_irq(hw, VIRTCHNL_OP_DCF_DISABLE,
      |                                        ^~~~~~~~~~~~~~~~~~~~~~~
      |                                        VIRTCHNL_OP_DEL_VLAN
../drivers/net/ice/ice_dcf.c: In function 'ice_dcf_send_aq_cmd':
../drivers/net/ice/ice_dcf.c:475:18: error: 'VIRTCHNL_OP_DCF_CMD_DESC' undeclared (first use in this function)
  475 |  desc_cmd.v_op = VIRTCHNL_OP_DCF_CMD_DESC;
      |                  ^~~~~~~~~~~~~~~~~~~~~~~~
../drivers/net/ice/ice_dcf.c:486:18: error: 'VIRTCHNL_OP_DCF_CMD_BUFF' undeclared (first use in this function)
  486 |  buff_cmd.v_op = VIRTCHNL_OP_DCF_CMD_BUFF;
      |                  ^~~~~~~~~~~~~~~~~~~~~~~~
[649/1642] Compiling C object 'drivers/a715181@@tmp_rte_pmd_ice@sta/net_ice_ice_dcf_parent.c.o'.
FAILED: drivers/a715181@@tmp_rte_pmd_ice@sta/net_ice_ice_dcf_parent.c.o 
gcc -Idrivers/a715181@@tmp_rte_pmd_ice@sta -Idrivers -I../drivers -Idrivers/net/ice -I../drivers/net/ice -Idrivers/net/ice/base -I../drivers/net/ice/base -Idrivers/net/ice/../../common/iavf -I../drivers/net/ice/../../common/iavf -Ilib/librte_ethdev -I../lib/librte_ethdev -I. -I../ -Iconfig -I../config -Ilib/librte_eal/common/include -I../lib/librte_eal/common/include -I../lib/librte_eal/freebsd/eal/include -Ilib/librte_eal/common -I../lib/librte_eal/common -Ilib/librte_eal/common/include/arch/x86 -I../lib/librte_eal/common/include/arch/x86 -Ilib/librte_eal -I../lib/librte_eal -Ilib/librte_kvargs -I../lib/librte_kvargs -Ilib/librte_net -I../lib/librte_net -Ilib/librte_mbuf -I../lib/librte_mbuf -Ilib/librte_mempool -I../lib/librte_mempool -Ilib/librte_ring -I../lib/librte_ring -Ilib/librte_meter -I../lib/librte_meter -Idrivers/bus/pci -I../drivers/bus/pci -I../drivers/bus/pci/bsd -Ilib/librte_pci -I../lib/librte_pci -Idrivers/bus/vdev -I../drivers/bus/vdev -Ilib/librte_hash -I../lib/librte_hash -Idrivers/common/iavf -I../drivers/common/iavf -fdiagnostics-color=always -pipe -D_FILE_OFFSET_BITS=64 -Wall -Winvalid-pch -Werror -O2 -g -include rte_config.h -Wextra -Wcast-qual -Wdeprecated -Wformat-nonliteral -Wformat-security -Wmissing-declarations -Wmissing-prototypes -Wnested-externs -Wold-style-definition -Wpointer-arith -Wsign-compare -Wstrict-prototypes -Wundef -Wwrite-strings -Wno-address-of-packed-member -Wno-packed-not-aligned -Wno-missing-field-initializers -D_GNU_SOURCE -D__BSD_VISIBLE -fPIC -march=native -Wno-format-truncation -DALLOW_EXPERIMENTAL_API -MD -MQ 'drivers/a715181@@tmp_rte_pmd_ice@sta/net_ice_ice_dcf_parent.c.o' -MF 'drivers/a715181@@tmp_rte_pmd_ice@sta/net_ice_ice_dcf_parent.c.o.d' -o 'drivers/a715181@@tmp_rte_pmd_ice@sta/net_ice_ice_dcf_parent.c.o' -c ../drivers/net/ice/ice_dcf_parent.c
../drivers/net/ice/ice_dcf_parent.c: In function 'ice_dcf_update_vsi_ctx':
../drivers/net/ice/ice_dcf_parent.c:27:16: error: 'VIRTCHNL_DCF_VF_VSI_VALID' undeclared (first use in this function)
   27 |  if (vsi_map & VIRTCHNL_DCF_VF_VSI_VALID) {
      |                ^~~~~~~~~~~~~~~~~~~~~~~~~
../drivers/net/ice/ice_dcf_parent.c:27:16: note: each undeclared identifier is reported only once for each function it appears in
../drivers/net/ice/ice_dcf_parent.c:37:33: error: 'VIRTCHNL_DCF_VF_VSI_ID_M' undeclared (first use in this function)
   37 |   vsi_ctx->vsi_num = (vsi_map & VIRTCHNL_DCF_VF_VSI_ID_M) >>
      |                                 ^~~~~~~~~~~~~~~~~~~~~~~~
../drivers/net/ice/ice_dcf_parent.c:38:12: error: 'VIRTCHNL_DCF_VF_VSI_ID_S' undeclared (first use in this function)
   38 |            VIRTCHNL_DCF_VF_VSI_ID_S;
      |            ^~~~~~~~~~~~~~~~~~~~~~~~
../drivers/net/ice/ice_dcf_parent.c: In function 'ice_dcf_handle_pf_event_msg':
../drivers/net/ice/ice_dcf_parent.c:99:7: error: 'VIRTCHNL_EVENT_DCF_VSI_MAP_UPDATE' undeclared (first use in this function)
   99 |  case VIRTCHNL_EVENT_DCF_VSI_MAP_UPDATE:
      |       ^~~~~~~~~~~~~~~~~~~~~~~~~~~~~~~~~
In file included from ../drivers/net/ice/base/ice_osdep.h:27,
                 from ../drivers/net/ice/base/ice_type.h:40,
                 from ../drivers/net/ice/base/ice_common.h:8,
                 from ../drivers/net/ice/ice_dcf_ethdev.h:8,
                 from ../drivers/net/ice/ice_dcf_parent.c:10:
../drivers/net/ice/ice_dcf_parent.c:101:26: error: 'union <anonymous>' has no member named 'vf_vsi_map'
  101 |        pf_msg->event_data.vf_vsi_map.vf_id,
      |                          ^
../drivers/net/ice/base/../ice_logs.h:46:16: note: in definition of macro 'PMD_DRV_LOG_RAW'
   46 |   __func__, ## args)
      |                ^~~~
../drivers/net/ice/ice_dcf_parent.c:100:3: note: in expansion of macro 'PMD_DRV_LOG'
  100 |   PMD_DRV_LOG(DEBUG, "VIRTCHNL_EVENT_DCF_VSI_MAP_UPDATE event : VF%u with VSI num %u",
      |   ^~~~~~~~~~~
../drivers/net/ice/ice_dcf_parent.c:102:26: error: 'union <anonymous>' has no member named 'vf_vsi_map'
  102 |        pf_msg->event_data.vf_vsi_map.vsi_id);
      |                          ^
../drivers/net/ice/base/../ice_logs.h:46:16: note: in definition of macro 'PMD_DRV_LOG_RAW'
   46 |   __func__, ## args)
      |                ^~~~
../drivers/net/ice/ice_dcf_parent.c:100:3: note: in expansion of macro 'PMD_DRV_LOG'
  100 |   PMD_DRV_LOG(DEBUG, "VIRTCHNL_EVENT_DCF_VSI_MAP_UPDATE event : VF%u with VSI num %u",
      |   ^~~~~~~~~~~
../drivers/net/ice/ice_dcf_parent.c: In function 'ice_dcf_init_parent_hw':
../drivers/net/ice/ice_dcf_parent.c:158:11: error: implicit declaration of function 'ice_init_fltr_mgmt_struct' [-Werror=implicit-function-declaration]
  158 |  status = ice_init_fltr_mgmt_struct(hw);
      |           ^~~~~~~~~~~~~~~~~~~~~~~~~
../drivers/net/ice/ice_dcf_parent.c:158:11: error: nested extern declaration of 'ice_init_fltr_mgmt_struct' [-Werror=nested-externs]
../drivers/net/ice/ice_dcf_parent.c:175:2: error: implicit declaration of function 'ice_cleanup_fltr_mgmt_struct' [-Werror=implicit-function-declaration]
  175 |  ice_cleanup_fltr_mgmt_struct(hw);
      |  ^~~~~~~~~~~~~~~~~~~~~~~~~~~~
../drivers/net/ice/ice_dcf_parent.c:175:2: error: nested extern declaration of 'ice_cleanup_fltr_mgmt_struct' [-Werror=nested-externs]
../drivers/net/ice/ice_dcf_parent.c: In function 'ice_dcf_init_parent_adapter':
../drivers/net/ice/ice_dcf_parent.c:294:11: error: 'struct ice_hw' has no member named 'aq_send_cmd_fn'
  294 |  parent_hw->aq_send_cmd_fn = ice_dcf_send_aq_cmd;
      |           ^~
../drivers/net/ice/ice_dcf_parent.c:295:11: error: 'struct ice_hw' has no member named 'aq_send_cmd_param'
  295 |  parent_hw->aq_send_cmd_param = &adapter->real_hw;
      |           ^~
../drivers/net/ice/ice_dcf_parent.c:296:11: error: 'struct ice_hw' has no member named 'dcf_enabled'
  296 |  parent_hw->dcf_enabled = true;
      |           ^~
cc1: all warnings being treated as errors
[650/1642] Compiling C object 'drivers/a715181@@tmp_rte_pmd_ice@sta/net_ice_ice_rxtx_vec_avx2.c.o'.
[651/1642] Compiling C object 'drivers/a715181@@tmp_rte_pmd_ice@sta/net_ice_ice_rxtx_vec_sse.c.o'.
[652/1642] Compiling C object 'drivers/a715181@@tmp_rte_pmd_octeontx2_event@sta/event_octeontx2_otx2_worker.c.o'.
[653/1642] Compiling C object 'drivers/a715181@@tmp_rte_pmd_octeontx2_event@sta/event_octeontx2_otx2_worker_dual.c.o'.
ninja: build stopped: subcommand failed



DPDK STV team

^ permalink raw reply	[flat|nested] only message in thread

only message in thread, other threads:[~2020-03-10 13:13 UTC | newest]

Thread overview: (only message) (download: mbox.gz / follow: Atom feed)
-- links below jump to the message on this page --
2020-03-10 13:13 [dpdk-test-report] |FAILURE| pw66481[v2, 1/7] net/iavf: stop the PCI probe in DCF mode sys_stv

automatic DPDK test reports

This inbox may be cloned and mirrored by anyone:

	git clone --mirror http://inbox.dpdk.org/test-report/0 test-report/git/0.git

	# If you have public-inbox 1.1+ installed, you may
	# initialize and index your mirror using the following commands:
	public-inbox-init -V2 test-report test-report/ http://inbox.dpdk.org/test-report \
		test-report@dpdk.org
	public-inbox-index test-report

Example config snippet for mirrors.
Newsgroup available over NNTP:
	nntp://inbox.dpdk.org/inbox.dpdk.test-report


AGPL code for this site: git clone https://public-inbox.org/public-inbox.git