automatic DPDK test reports
 help / color / mirror / Atom feed
* [dpdk-test-report] |FAILURE| pw66576[01/11] net/octeontx2: setup link config based on BP level
@ 2020-03-12 11:59 sys_stv
  0 siblings, 0 replies; only message in thread
From: sys_stv @ 2020-03-12 11:59 UTC (permalink / raw)
  To: test-report

[-- Attachment #1: Type: text/plain, Size: 75157 bytes --]

Test-Label: Intel-compilation
Test-Status: FAILURE
http://dpdk.org/patch/66576

_Compilation issues_

Submitter: Nithin Dabilpuram <ndabilpuram@marvell.com>
Date: 2020-03-12 11:18:57
Reply_mail: 20200312111907.31555-2-ndabilpuram@marvell.com
DPDK git baseline: Repo:dpdk-next-net-mrvl, CommitID: f3382a80da43a97b5cf86ed6db6d8dec292109c9

Makefile build Summary: 23 Builds Done, 0 Successful, 23 Failures

Meson build Summary: 8 Builds Done, 2 Successful, 6 Failures

               +==============================================+===========+==========+
               |                   Makefile                   |   Meson   | Document |
+----------------+------+-------+------+------------+-----------+-----------+----------+
| os             | gcc  | clang | icc  | gcc+shared | gcc+debug | gcc/clang | pdf/html |
+----------------+------+-------+------+------------+-----------+-----------+----------+
| RHEL80-64      | FAIL |       |      |            |           |           |          |
| UB1804-64      | FAIL | FAIL  | FAIL |            |           | FAIL      | pass     |
| UB1604-32      | FAIL |       |      |            |           | FAIL      |          |
| CENTOS77-64    | FAIL | FAIL  | FAIL | FAIL       | FAIL      | FAIL      |          |
| UB1604-64      | FAIL | FAIL  |      |            |           |           |          |
| WIN10-64       |      |       |      |            |           | pass      |          |
| UB1910-64      | FAIL |       |      |            |           |           |          |
| FC31-64        | FAIL | FAIL  |      |            |           | FAIL      |          |
| CENTOS80-64    | FAIL |       |      |            |           |           |          |
| FreeBSD1201-64 | FAIL | FAIL  |      | FAIL       | FAIL      | FAIL      |          |
| RHEL77-64      | FAIL |       |      |            |           |           |          |
| SUSE15-64      | FAIL | FAIL  |      |            |           | FAIL      |          |
+----------------+------+-------+------+------------+-----------+-----------+----------+

Test environment and configuration as below:

** Makefile build **


OS: UB1804-64
	Kernel Version: 4.15.0-20-generic
	CPU info: Intel(R) Xeon(R) CPU E5-2699 v3 @ 2.30GHz
	GCC Version: gcc (Ubuntu 7.3.0-27ubuntu1~18.04) 7.3.0
	Clang Version: 6.0.0-1ubuntu2 (tags/RELEASE_600/final)
	x86_64-native-linuxapp-icc
	x86_64-native-linuxapp-clang
	x86_64-native-linuxapp-gcc


OS: UB1604-32
	Kernel Version: 4.4.0-131-generic
	CPU info: Intel(R) Xeon(R) CPU E5-2699 v3 @ 2.30GHz
	GCC Version: gcc (Ubuntu 5.4.0-6ubuntu1~16.04.11) 5.4.0 20160609
	Clang Version: 3.8.0-2ubuntu4 (tags/RELEASE_380/final)
	i686-native-linuxapp-gcc


OS: CENTOS77-64
	Kernel Version: 3.10.0-1062.9.1.el7.x86_64
	CPU info: Intel(R) Xeon(R) CPU E5-2699 v3 @ 2.30GHz
	GCC Version: gcc (GCC) 4.8.5 20150623 (Red Hat 4.8.5-39)
	Clang Version: 3.4.2 (tags/RELEASE_34/dot2-final)
	x86_64-native-linuxapp-clang
	x86_64-native-linuxapp-gcc
	x86_64-native-linuxapp-gcc+shared
	x86_64-native-linuxapp-gcc+debug
	x86_64-native-linuxapp-icc


OS: UB1910-64
	Kernel Version: 5.3.0-18-generic
	CPU info: Intel(R) Xeon(R) CPU E5-2699 v3 @ 2.30GHz
	GCC Version: gcc (Ubuntu 9.2.1-9ubuntu2) 9.2.1 20191008
	Clang Version: 9.0.0-2 (tags/RELEASE_900/final)
	x86_64-native-linuxapp-gcc


OS: CENTOS80-64
	Kernel Version: 4.18.0-80.11.2.el8_0.x86_64
	CPU info: Intel(R) Xeon(R) CPU E5-2699 v3 @ 2.30GHz
	GCC Version: gcc (GCC) 8.2.1 20180905 (Red Hat 8.2.1-3)
	Clang Version: 7.0.1 (tags/RELEASE_701/final)
	x86_64-native-linuxapp-gcc


OS: UB1604-64
	Kernel Version: 4.4.0-170-generic
	CPU info: Intel(R) Xeon(R) CPU E5-2699 v3 @ 2.30GHz
	GCC Version: gcc (Ubuntu 5.4.0-6ubuntu1~16.04.12) 5.4.0 20160609
	Clang Version: 3.8.0-2ubuntu4 (tags/RELEASE_380/final)
	x86_64-native-linuxapp-clang
	x86_64-native-linuxapp-gcc


OS: FC31-64
	Kernel Version: 5.3.15-300.fc31.x86_64
	CPU info: Intel(R) Xeon(R) CPU E5-2699 v4 @ 2.20GHz
	GCC Version: gcc (GCC) 9.2.1 20190827 (Red Hat 9.2.1-1)
	Clang Version: 9.0.0 (Fedora 9.0.0-1.fc31)
	x86_64-native-linuxapp-gcc
	x86_64-native-linuxapp-clang


OS: RHEL80-64
	Kernel Version: 4.18.0-80.el8.x86_64
	CPU info: Intel(R) Xeon(R) CPU E5-2699 v4 @ 2.20GHz
	GCC Version: gcc (GCC) 8.2.1 20180905 (Red Hat 8.2.1-3)
	Clang Version: 6.0.1 (tags/RELEASE_601/final)
	x86_64-native-linuxapp-gcc


OS: FreeBSD1201-64
	Kernel Version: 12.1-RELEASE
	CPU info: Intel(R) Xeon(R) CPU E5-2699 v4 @ 2.20GHz (2194.96-MHz K8-class CPU)
	GCC Version: gcc (FreeBSD Ports Collection) 9.2.0
	Clang Version: 8.0.1 (tags/RELEASE_801/final 366581) (based on LLVM 8.0.1)
	x86_64-native-bsdapp-clang
	x86_64-native-bsdapp-gcc
	x86_64-native-bsdapp-gcc+debug
	x86_64-native-bsdapp-gcc+shared


OS: RHEL77-64
	Kernel Version: 3.10.0-1062.9.1.el7.x86_64
	CPU info: Intel(R) Xeon(R) CPU E5-2699 v4 @ 2.20GHz
	GCC Version: gcc (GCC) 4.8.5 20150623 (Red Hat 4.8.5-39)
	Clang Version: 3.4.2 (tags/RELEASE_34/dot2-final)
	x86_64-native-linuxapp-gcc


OS: SUSE15-64
	Kernel Version: 4.12.14-lp150.11-default
	CPU info: Intel(R) Xeon(R) CPU E5-2699 v4 @ 2.20GHz
	GCC Version: gcc (SUSE Linux) 7.3.1 20180323 [gcc-7-branch revision 258812]
	Clang Version: 5.0.1 (tags/RELEASE_501/final 312548)
	x86_64-native-linuxapp-gcc
	x86_64-native-linuxapp-clang


** Meson build **


OS: UB1804-64
	Kernel Version: 4.15.0-20-generic
	CPU info: Intel(R) Xeon(R) CPU E5-2699 v4 @ 2.20GHz
	GCC Version: gcc (Ubuntu 7.3.0-27ubuntu1~18.04) 7.3.0
	Clang Version: 6.0.0-1ubuntu2 (tags/RELEASE_600/final)
	x86_64-native-linuxapp-doc
	./build-gcc-static
	./build-gcc-shared
	./build-clang-static
	./build-clang-shared
	./build-x86-default


OS: UB1604-32
	Kernel Version: 4.4.0-131-generic
	CPU info: Intel(R) Xeon(R) CPU E5-2699 v4 @ 2.20GHz
	GCC Version: gcc (Ubuntu 5.4.0-6ubuntu1~16.04.11) 5.4.0 20160609
	Clang Version: 3.8.0-2ubuntu4 (tags/RELEASE_380/final)
	./build-gcc-static
	./build-gcc-shared
	./build-clang-static
	./build-clang-shared
	./build-x86-default


OS: CENTOS77-64
	Kernel Version: 3.10.0-1062.12.1.el7.x86_64
	CPU info: Intel(R) Xeon(R) CPU E5-2699 v4 @ 2.20GHz
	GCC Version: gcc (GCC) 4.8.5 20150623 (Red Hat 4.8.5-39)
	Clang Version: 3.4.2 (tags/RELEASE_34/dot2-final)
	./build-gcc-static
	./build-gcc-shared
	./build-clang-static
	./build-clang-shared
	./build-x86-default


OS: WIN10-64
	Kernel Version: N/A
	CPU info: N/A
	GCC Version: N/A
	Clang Version: Clang 8.0.0
	x86_64-windows-clang


OS: FC31-64
	Kernel Version: 5.4.18-200.fc31.x86_64
	CPU info: Intel(R) Xeon(R) CPU E5-2699 v4 @ 2.20GHz
	GCC Version: gcc (GCC) 9.2.1 20190827 (Red Hat 9.2.1-1)
	Clang Version: 9.0.0 (Fedora 9.0.0-1.fc31)
	./build-gcc-static
	./build-gcc-shared
	./build-clang-static
	./build-clang-shared
	./build-x86-default


OS: FreeBSD1201-64
	Kernel Version: 12.1-RELEASE
	CPU info: Intel(R) Xeon(R) CPU E5-2699 v4 @ 2.20GHz (2194.98-MHz K8-class CPU)
	GCC Version: gcc (FreeBSD Ports Collection) 9.2.0
	Clang Version: 8.0.1 (tags/RELEASE_801/final 366581) (based on LLVM 8.0.1)
	./build-gcc-static
	./build-gcc-shared
	./build-clang-static
	./build-clang-shared
	./build-x86-default


OS: SUSE15-64
	Kernel Version: 4.12.14-lp150.12.82-default
	CPU info: Intel(R) Xeon(R) CPU E5-2699 v4 @ 2.20GHz
	GCC Version: gcc (SUSE Linux) 7.4.1 20190905 [gcc-7-branch revision 275407]
	Clang Version: 5.0.1 (tags/RELEASE_501/final 312548)
	./build-gcc-static
	./build-gcc-shared
	./build-clang-static
	./build-clang-shared
	./build-x86-default


*Make Build Failed #1:
OS: UB1604-64
Target: x86_64-native-linuxapp-clang
/root/UB1604-64_K4.4.0_Clang3.8.0/x86_64-native-linuxapp-clang/42950a2e577b4b709945e14dbee47205/dpdk/drivers/net/octeontx2/otx2_tm.c:1680:7: error: no member named 'read' in 'struct nix_txschq_config'
        req->read = 1;
        ~~~  ^
  LD octeontx_pkivf.o
3 errors generated.
/root/UB1604-64_K4.4.0_Clang3.8.0/x86_64-native-linuxapp-clang/42950a2e577b4b709945e14dbee47205/dpdk/mk/internal/rte.compile-pre.mk:114: recipe for target 'otx2_tm.o' failed
make[6]: *** [otx2_tm.o] Error 1
make[6]: *** Waiting for unfinished jobs....
  CC ecore_hw.o
  CC ecore_cxt.o
  PMDINFO nfp_net.o.pmd.c
  CC nfp_net.o.pmd.o
--
  CC bnxt_rxtx_vec_sse.o
  CC vdev_netvsc.o
  CC sfc_tx.o
  CC sfc_tso.o
  CC virtqueue.o
/root/UB1604-64_K4.4.0_Clang3.8.0/x86_64-native-linuxapp-clang/42950a2e577b4b709945e14dbee47205/dpdk/mk/rte.subdir.mk:35: recipe for target 'octeontx2' failed
make[5]: *** [octeontx2] Error 2
make[5]: *** Waiting for unfinished jobs....
  CC virtio_pci.o
  CC sfc_filter.o
  CC sfc_flow.o
  PMDINFO vdev_netvsc.o.pmd.c
--
  CC hunt_nic.o
  CC medford_nic.o
  CC medford2_nic.o
  AR librte_pmd_sfc_efx.a
  INSTALL-LIB librte_pmd_sfc_efx.a
/root/UB1604-64_K4.4.0_Clang3.8.0/x86_64-native-linuxapp-clang/42950a2e577b4b709945e14dbee47205/dpdk/mk/rte.subdir.mk:35: recipe for target 'net' failed
make[4]: *** [net] Error 2
/root/UB1604-64_K4.4.0_Clang3.8.0/x86_64-native-linuxapp-clang/42950a2e577b4b709945e14dbee47205/dpdk/mk/rte.sdkbuild.mk:46: recipe for target 'drivers' failed
make[3]: *** [drivers] Error 2
/root/UB1604-64_K4.4.0_Clang3.8.0/x86_64-native-linuxapp-clang/42950a2e577b4b709945e14dbee47205/dpdk/mk/rte.sdkroot.mk:98: recipe for target 'all' failed
make[2]: *** [all] Error 2
/root/UB1604-64_K4.4.0_Clang3.8.0/x86_64-native-linuxapp-clang/42950a2e577b4b709945e14dbee47205/dpdk/mk/rte.sdkinstall.mk:60: recipe for target 'pre_install' failed
make[1]: *** [pre_install] Error 2
/root/UB1604-64_K4.4.0_Clang3.8.0/x86_64-native-linuxapp-clang/42950a2e577b4b709945e14dbee47205/dpdk/mk/rte.sdkroot.mk:77: recipe for target 'install' failed
make: *** [install] Error 2


*Make Build Failed #2:
OS: UB1604-32
Target: i686-native-linuxapp-gcc
/root/UB1604-32_K4.4.0_GCC5.4.0/i686-native-linuxapp-gcc/42950a2e577b4b709945e14dbee47205/dpdk/drivers/net/octeontx2/otx2_tm.c:1680:5: error: ‘volatile struct nix_txschq_config’ has no member named ‘read’
  req->read = 1;
     ^
/root/UB1604-32_K4.4.0_GCC5.4.0/i686-native-linuxapp-gcc/42950a2e577b4b709945e14dbee47205/dpdk/drivers/net/octeontx2/otx2_tm.c: At top level:
cc1: warning: unrecognized command line option ‘-Wno-address-of-packed-member’
/root/UB1604-32_K4.4.0_GCC5.4.0/i686-native-linuxapp-gcc/42950a2e577b4b709945e14dbee47205/dpdk/mk/internal/rte.compile-pre.mk:114: recipe for target 'otx2_tm.o' failed
make[6]: *** [otx2_tm.o] Error 1
make[6]: *** Waiting for unfinished jobs....
  CC conn.o
  PMDINFO qede_ethdev.o.pmd.c
  CC qede_ethdev.o.pmd.o
  LD qede_ethdev.o
  AR librte_pmd_softnic.a
  INSTALL-LIB librte_pmd_softnic.a
  AR librte_pmd_qede.a
  INSTALL-LIB librte_pmd_qede.a
/root/UB1604-32_K4.4.0_GCC5.4.0/i686-native-linuxapp-gcc/42950a2e577b4b709945e14dbee47205/dpdk/mk/rte.subdir.mk:35: recipe for target 'octeontx2' failed
make[5]: *** [octeontx2] Error 2
/root/UB1604-32_K4.4.0_GCC5.4.0/i686-native-linuxapp-gcc/42950a2e577b4b709945e14dbee47205/dpdk/mk/rte.subdir.mk:35: recipe for target 'net' failed
make[4]: *** [net] Error 2
/root/UB1604-32_K4.4.0_GCC5.4.0/i686-native-linuxapp-gcc/42950a2e577b4b709945e14dbee47205/dpdk/mk/rte.sdkbuild.mk:46: recipe for target 'drivers' failed
make[3]: *** [drivers] Error 2
/root/UB1604-32_K4.4.0_GCC5.4.0/i686-native-linuxapp-gcc/42950a2e577b4b709945e14dbee47205/dpdk/mk/rte.sdkroot.mk:98: recipe for target 'all' failed
make[2]: *** [all] Error 2
/root/UB1604-32_K4.4.0_GCC5.4.0/i686-native-linuxapp-gcc/42950a2e577b4b709945e14dbee47205/dpdk/mk/rte.sdkinstall.mk:60: recipe for target 'pre_install' failed
make[1]: *** [pre_install] Error 2
/root/UB1604-32_K4.4.0_GCC5.4.0/i686-native-linuxapp-gcc/42950a2e577b4b709945e14dbee47205/dpdk/mk/rte.sdkroot.mk:77: recipe for target 'install' failed
make: *** [install] Error 2


*Make Build Failed #3:
OS: UB1910-64
Target: x86_64-native-linuxapp-gcc
/root/UB1910-64_K5.3.0_GCC9.2.1/x86_64-native-linuxapp-gcc/42950a2e577b4b709945e14dbee47205/dpdk/drivers/net/octeontx2/otx2_tm.c: In function ‘read_tm_reg’:
/root/UB1910-64_K5.3.0_GCC9.2.1/x86_64-native-linuxapp-gcc/42950a2e577b4b709945e14dbee47205/dpdk/drivers/net/octeontx2/otx2_tm.c:1680:5: error: ‘volatile struct nix_txschq_config’ has no member named ‘read’
 1680 |  req->read = 1;
      |     ^~
  CC ice_ethdev.o.pmd.o
make[6]: *** [/root/UB1910-64_K5.3.0_GCC9.2.1/x86_64-native-linuxapp-gcc/42950a2e577b4b709945e14dbee47205/dpdk/mk/internal/rte.compile-pre.mk:116: otx2_tm.o] Error 1
make[6]: *** Waiting for unfinished jobs....
  LD ice_ethdev.o
  CC ice_fdir_filter.o
  CC nfp_resource.o
  CC bnxt_flow.o
--
  LD rte_eth_ring.o
  AR librte_pmd_pcap.a
  INSTALL-LIB librte_pmd_pcap.a
  AR librte_pmd_bnxt.a
  INSTALL-LIB librte_pmd_bnxt.a
make[5]: *** [/root/UB1910-64_K5.3.0_GCC9.2.1/x86_64-native-linuxapp-gcc/42950a2e577b4b709945e14dbee47205/dpdk/mk/rte.subdir.mk:35: octeontx2] Error 2
make[5]: *** Waiting for unfinished jobs....
== Build drivers/net/sfc
  CC ecore_init_fw_funcs.o
  AR librte_pmd_ring.a
  CC ecore_spq.o
--
  CC hunt_nic.o
  CC medford_nic.o
  CC medford2_nic.o
  AR librte_pmd_sfc_efx.a
  INSTALL-LIB librte_pmd_sfc_efx.a
make[4]: *** [/root/UB1910-64_K5.3.0_GCC9.2.1/x86_64-native-linuxapp-gcc/42950a2e577b4b709945e14dbee47205/dpdk/mk/rte.subdir.mk:35: net] Error 2
make[3]: *** [/root/UB1910-64_K5.3.0_GCC9.2.1/x86_64-native-linuxapp-gcc/42950a2e577b4b709945e14dbee47205/dpdk/mk/rte.sdkbuild.mk:46: drivers] Error 2
make[2]: *** [/root/UB1910-64_K5.3.0_GCC9.2.1/x86_64-native-linuxapp-gcc/42950a2e577b4b709945e14dbee47205/dpdk/mk/rte.sdkroot.mk:99: all] Error 2
make[1]: *** [/root/UB1910-64_K5.3.0_GCC9.2.1/x86_64-native-linuxapp-gcc/42950a2e577b4b709945e14dbee47205/dpdk/mk/rte.sdkinstall.mk:61: pre_install] Error 2
make: *** [/root/UB1910-64_K5.3.0_GCC9.2.1/x86_64-native-linuxapp-gcc/42950a2e577b4b709945e14dbee47205/dpdk/mk/rte.sdkroot.mk:77: install] Error 2


*Make Build Failed #4:
OS: UB1804-64
Target: x86_64-native-linuxapp-icc
/root/UB1804-64_K4.15.0_ICC19.0.0/x86_64-native-linuxapp-icc/42950a2e577b4b709945e14dbee47205/dpdk/drivers/net/octeontx2/otx2_tm.c(1680): error: struct "nix_txschq_config" has no field "read"
  	req->read = 1;
  	     ^

compilation aborted for /root/UB1804-64_K4.15.0_ICC19.0.0/x86_64-native-linuxapp-icc/42950a2e577b4b709945e14dbee47205/dpdk/drivers/net/octeontx2/otx2_tm.c (code 2)
/root/UB1804-64_K4.15.0_ICC19.0.0/x86_64-native-linuxapp-icc/42950a2e577b4b709945e14dbee47205/dpdk/mk/internal/rte.compile-pre.mk:114: recipe for target 'otx2_tm.o' failed
make[6]: *** [otx2_tm.o] Error 2
make[6]: *** Waiting for unfinished jobs....
  CC i40e_tm.o
  CC bnxt_vnic.o
  PMDINFO rte_eth_pcap.o.pmd.c
  CC rte_eth_pcap.o.pmd.o
--
  LD qede_ethdev.o
  AR librte_pmd_qede.a
  INSTALL-LIB librte_pmd_qede.a
  AR librte_pmd_softnic.a
  INSTALL-LIB librte_pmd_softnic.a
/root/UB1804-64_K4.15.0_ICC19.0.0/x86_64-native-linuxapp-icc/42950a2e577b4b709945e14dbee47205/dpdk/mk/rte.subdir.mk:35: recipe for target 'octeontx2' failed
make[5]: *** [octeontx2] Error 2
/root/UB1804-64_K4.15.0_ICC19.0.0/x86_64-native-linuxapp-icc/42950a2e577b4b709945e14dbee47205/dpdk/mk/rte.subdir.mk:35: recipe for target 'net' failed
make[4]: *** [net] Error 2
/root/UB1804-64_K4.15.0_ICC19.0.0/x86_64-native-linuxapp-icc/42950a2e577b4b709945e14dbee47205/dpdk/mk/rte.sdkbuild.mk:46: recipe for target 'drivers' failed
make[3]: *** [drivers] Error 2
/root/UB1804-64_K4.15.0_ICC19.0.0/x86_64-native-linuxapp-icc/42950a2e577b4b709945e14dbee47205/dpdk/mk/rte.sdkroot.mk:98: recipe for target 'all' failed
make[2]: *** [all] Error 2
/root/UB1804-64_K4.15.0_ICC19.0.0/x86_64-native-linuxapp-icc/42950a2e577b4b709945e14dbee47205/dpdk/mk/rte.sdkinstall.mk:60: recipe for target 'pre_install' failed
make[1]: *** [pre_install] Error 2
/root/UB1804-64_K4.15.0_ICC19.0.0/x86_64-native-linuxapp-icc/42950a2e577b4b709945e14dbee47205/dpdk/mk/rte.sdkroot.mk:77: recipe for target 'install' failed
make: *** [install] Error 2


*Make Build Failed #5:
OS: UB1804-64
Target: x86_64-native-linuxapp-clang
        ~~~  ^
/root/UB1804-64_K4.15.0_Clang6.0.0/x86_64-native-linuxapp-clang/42950a2e577b4b709945e14dbee47205/dpdk/drivers/net/octeontx2/otx2_tm.c:1680:7: error: no member named 'read' in 'struct nix_txschq_config'
        req->read = 1;
        ~~~  ^
3 errors generated.
/root/UB1804-64_K4.15.0_Clang6.0.0/x86_64-native-linuxapp-clang/42950a2e577b4b709945e14dbee47205/dpdk/mk/internal/rte.compile-pre.mk:114: recipe for target 'otx2_tm.o' failed
make[6]: *** [otx2_tm.o] Error 1
make[6]: *** Waiting for unfinished jobs....
== Build drivers/net/thunderx
  CC ixgbe_tm.o
  CC ecore_spq.o
  CC bnxt_rxtx_vec_sse.o
--
  LD vmxnet3_ethdev.o
  CC ecore_dcbx.o
  CC sfc_tx.o
  AR librte_pmd_vmxnet3_uio.a
  INSTALL-LIB librte_pmd_vmxnet3_uio.a
/root/UB1804-64_K4.15.0_Clang6.0.0/x86_64-native-linuxapp-clang/42950a2e577b4b709945e14dbee47205/dpdk/mk/rte.subdir.mk:35: recipe for target 'octeontx2' failed
make[5]: *** [octeontx2] Error 2
make[5]: *** Waiting for unfinished jobs....
  CC sfc_filter.o
  CC sfc_tso.o
  PMDINFO rte_eth_kni.o.pmd.c
  CC rte_eth_kni.o.pmd.o
--
  CC hunt_nic.o
  CC medford_nic.o
  CC medford2_nic.o
  AR librte_pmd_sfc_efx.a
  INSTALL-LIB librte_pmd_sfc_efx.a
/root/UB1804-64_K4.15.0_Clang6.0.0/x86_64-native-linuxapp-clang/42950a2e577b4b709945e14dbee47205/dpdk/mk/rte.subdir.mk:35: recipe for target 'net' failed
make[4]: *** [net] Error 2
/root/UB1804-64_K4.15.0_Clang6.0.0/x86_64-native-linuxapp-clang/42950a2e577b4b709945e14dbee47205/dpdk/mk/rte.sdkbuild.mk:46: recipe for target 'drivers' failed
make[3]: *** [drivers] Error 2
/root/UB1804-64_K4.15.0_Clang6.0.0/x86_64-native-linuxapp-clang/42950a2e577b4b709945e14dbee47205/dpdk/mk/rte.sdkroot.mk:98: recipe for target 'all' failed
make[2]: *** [all] Error 2
/root/UB1804-64_K4.15.0_Clang6.0.0/x86_64-native-linuxapp-clang/42950a2e577b4b709945e14dbee47205/dpdk/mk/rte.sdkinstall.mk:60: recipe for target 'pre_install' failed
make[1]: *** [pre_install] Error 2
/root/UB1804-64_K4.15.0_Clang6.0.0/x86_64-native-linuxapp-clang/42950a2e577b4b709945e14dbee47205/dpdk/mk/rte.sdkroot.mk:77: recipe for target 'install' failed
make: *** [install] Error 2


*Make Build Failed #6:
OS: CENTOS77-64
Target: x86_64-native-linuxapp-clang
        ~~~  ^
/root/CENTOS77-64_K3.10.0_Clang3.4.2/x86_64-native-linuxapp-clang/42950a2e577b4b709945e14dbee47205/dpdk/drivers/net/octeontx2/otx2_tm.c:1680:7: error: no member named 'read' in 'struct nix_txschq_config'
        req->read = 1;
        ~~~  ^
3 errors generated.
make[6]: *** [otx2_tm.o] Error 1
make[6]: *** Waiting for unfinished jobs....
  PMDINFO rte_eth_vhost.o.pmd.c
  CC sfc_tso.o
  CC rte_eth_vhost.o.pmd.o
  LD rte_eth_vhost.o
--
  CC efx_rx.o
  CC efx_sram.o
  CC efx_tunnel.o
  CC efx_tx.o
  CC efx_vpd.o
make[5]: *** [octeontx2] Error 2
make[5]: *** Waiting for unfinished jobs....
  CC mcdi_mon.o
  CC siena_mac.o
  CC siena_mcdi.o
  CC siena_nic.o
--
  CC hunt_nic.o
  CC medford_nic.o
  CC medford2_nic.o
  AR librte_pmd_sfc_efx.a
  INSTALL-LIB librte_pmd_sfc_efx.a
make[4]: *** [net] Error 2
make[3]: *** [drivers] Error 2
make[2]: *** [all] Error 2
make[1]: *** [pre_install] Error 2
make: *** [install] Error 2


*Make Build Failed #7:
OS: CENTOS77-64
Target: x86_64-native-linuxapp-gcc
     ^
  CC tap_tcmsgs.o
  INSTALL-LIB librte_pmd_thunderx_nicvf.a
/root/CENTOS77-64_K3.10.0_GCC4.8.5/x86_64-native-linuxapp-gcc/42950a2e577b4b709945e14dbee47205/dpdk/drivers/net/octeontx2/otx2_tm.c: At top level:
cc1: warning: unrecognized command line option "-Wno-address-of-packed-member" [enabled by default]
make[6]: *** [otx2_tm.o] Error 1
make[6]: *** Waiting for unfinished jobs....
  CC tap_bpf_api.o
== Build drivers/net/virtio
  CC ecore_init_ops.o
  AR librte_pmd_ice.a
--
  CC rte_eth_kni.o
  CC sfc_ef10_tx.o
  SYMLINK-FILE include/rte_eth_softnic.h
  CC rte_eth_softnic.o
  PMDINFO rte_eth_kni.o.pmd.c
make[5]: *** [octeontx2] Error 2
make[5]: *** Waiting for unfinished jobs....
  CC vmxnet3_ethdev.o
  CC rte_eth_kni.o.pmd.o
  CC virtio_rxtx.o
  CC efx_bootcfg.o
--
  INSTALL-LIB librte_pmd_sfc_efx.a
  AR librte_pmd_softnic.a
  INSTALL-LIB librte_pmd_softnic.a
  AR librte_pmd_qede.a
  INSTALL-LIB librte_pmd_qede.a
make[4]: *** [net] Error 2
make[3]: *** [drivers] Error 2
make[2]: *** [all] Error 2
make[1]: *** [pre_install] Error 2
make: *** [install] Error 2


*Make Build Failed #8:
OS: CENTOS77-64
Target: x86_64-native-linuxapp-gcc+shared
  req->read = 1;
     ^
  LD rte_eth_softnic.o
/root/CENTOS77-64_K3.10.0_GCC4.8.5/x86_64-native-linuxapp-gcc+shared/42950a2e577b4b709945e14dbee47205/dpdk/drivers/net/octeontx2/otx2_tm.c: At top level:
cc1: warning: unrecognized command line option "-Wno-address-of-packed-member" [enabled by default]
make[6]: *** [otx2_tm.o] Error 1
make[6]: *** Waiting for unfinished jobs....
  CC bcm_osal.o
  CC virtio_rxtx_simple_sse.o
  CC rte_eth_softnic_mempool.o
  CC virtio_user/vhost_user.o
--
  INSTALL-LIB librte_pmd_softnic.so.20.0.1
  CC medford_nic.o
  CC medford2_nic.o
  LD librte_pmd_sfc_efx.so.20.0.1
  INSTALL-LIB librte_pmd_sfc_efx.so.20.0.1
make[5]: *** [octeontx2] Error 2
make[4]: *** [net] Error 2
make[3]: *** [drivers] Error 2
make[2]: *** [all] Error 2
make[1]: *** [pre_install] Error 2
make: *** [install] Error 2


*Make Build Failed #9:
OS: CENTOS77-64
Target: x86_64-native-linuxapp-gcc+debug
/root/CENTOS77-64_K3.10.0_GCC4.8.5/x86_64-native-linuxapp-gcc+debug/42950a2e577b4b709945e14dbee47205/dpdk/drivers/net/octeontx2/otx2_tm.c:1680:5: error: ‘volatile struct nix_txschq_config’ has no member named ‘read’
  req->read = 1;
     ^
/root/CENTOS77-64_K3.10.0_GCC4.8.5/x86_64-native-linuxapp-gcc+debug/42950a2e577b4b709945e14dbee47205/dpdk/drivers/net/octeontx2/otx2_tm.c: At top level:
cc1: warning: unrecognized command line option "-Wno-address-of-packed-member" [enabled by default]
make[6]: *** [otx2_tm.o] Error 1
make[6]: *** Waiting for unfinished jobs....
  CC efx_mcdi.o
  CC qede_main.o
  CC rte_eth_softnic_meter.o
  CC virtio_user/virtio_user_dev.o
--
  CC medford2_nic.o
  AR librte_pmd_sfc_efx.a
  INSTALL-LIB librte_pmd_sfc_efx.a
  AR librte_pmd_qede.a
  INSTALL-LIB librte_pmd_qede.a
make[5]: *** [octeontx2] Error 2
make[4]: *** [net] Error 2
make[3]: *** [drivers] Error 2
make[2]: *** [all] Error 2
make[1]: *** [pre_install] Error 2
make: *** [install] Error 2


*Make Build Failed #10:
OS: CENTOS80-64
Target: x86_64-native-linuxapp-gcc
       ^~~~
       reg
== Build drivers/net/vhost
/root/CENTOS80-64_K4.18.0_GCC8.2.1/x86_64-native-linuxapp-gcc/42950a2e577b4b709945e14dbee47205/dpdk/drivers/net/octeontx2/otx2_tm.c: At top level:
cc1: warning: unrecognized command line option ‘-Wno-address-of-packed-member’
make[6]: *** [/root/CENTOS80-64_K4.18.0_GCC8.2.1/x86_64-native-linuxapp-gcc/42950a2e577b4b709945e14dbee47205/dpdk/mk/internal/rte.compile-pre.mk:114: otx2_tm.o] Error 1
make[5]: *** [/root/CENTOS80-64_K4.18.0_GCC8.2.1/x86_64-native-linuxapp-gcc/42950a2e577b4b709945e14dbee47205/dpdk/mk/rte.subdir.mk:37: octeontx2] Error 2
make[5]: *** Waiting for unfinished jobs....
  CC efx_crc32.o
  CC efx_ev.o
  CC tap_tcmsgs.o
  PMDINFO dpaa_sec.o.pmd.c
--
  LD nitrox_device.o
  CC nitrox_qp.o
  CC virtio_cryptodev.o
  AR librte_pmd_sfc_efx.a
  INSTALL-LIB librte_pmd_sfc_efx.a
make[4]: *** [/root/CENTOS80-64_K4.18.0_GCC8.2.1/x86_64-native-linuxapp-gcc/42950a2e577b4b709945e14dbee47205/dpdk/mk/rte.subdir.mk:35: net] Error 2
make[4]: *** Waiting for unfinished jobs....
  AR librte_pmd_nitrox.a
  INSTALL-LIB librte_pmd_nitrox.a
  PMDINFO virtio_cryptodev.o.pmd.c
  CC virtio_cryptodev.o.pmd.o
  LD virtio_cryptodev.o
  AR librte_pmd_virtio_crypto.a
  INSTALL-LIB librte_pmd_virtio_crypto.a
make[3]: *** [/root/CENTOS80-64_K4.18.0_GCC8.2.1/x86_64-native-linuxapp-gcc/42950a2e577b4b709945e14dbee47205/dpdk/mk/rte.sdkbuild.mk:46: drivers] Error 2
make[2]: *** [/root/CENTOS80-64_K4.18.0_GCC8.2.1/x86_64-native-linuxapp-gcc/42950a2e577b4b709945e14dbee47205/dpdk/mk/rte.sdkroot.mk:99: all] Error 2
make[1]: *** [/root/CENTOS80-64_K4.18.0_GCC8.2.1/x86_64-native-linuxapp-gcc/42950a2e577b4b709945e14dbee47205/dpdk/mk/rte.sdkinstall.mk:61: pre_install] Error 2
make: *** [/root/CENTOS80-64_K4.18.0_GCC8.2.1/x86_64-native-linuxapp-gcc/42950a2e577b4b709945e14dbee47205/dpdk/mk/rte.sdkroot.mk:77: install] Error 2


*Make Build Failed #11:
OS: CENTOS77-64
Target: x86_64-native-linuxapp-icc
/root/CENTOS77-64_K3.10.0_ICC19.0.0/x86_64-native-linuxapp-icc/42950a2e577b4b709945e14dbee47205/dpdk/drivers/net/octeontx2/otx2_tm.c(1680): error: struct "nix_txschq_config" has no field "read"
  	req->read = 1;
  	     ^

compilation aborted for /root/CENTOS77-64_K3.10.0_ICC19.0.0/x86_64-native-linuxapp-icc/42950a2e577b4b709945e14dbee47205/dpdk/drivers/net/octeontx2/otx2_tm.c (code 2)
make[6]: *** [otx2_tm.o] Error 2
make[6]: *** Waiting for unfinished jobs....
  CC i40e_fdir.o
  CC bnxt_rxr.o
  LD nfp_net.o
  CC bnxt_stats.o
--
  LD rte_eth_vhost.o
  AR librte_pmd_vhost.a
  INSTALL-LIB librte_pmd_vhost.a
  AR librte_pmd_softnic.a
  INSTALL-LIB librte_pmd_softnic.a
make[5]: *** [octeontx2] Error 2
make[4]: *** [net] Error 2
make[3]: *** [drivers] Error 2
make[2]: *** [all] Error 2
make[1]: *** [pre_install] Error 2
make: *** [install] Error 2


*Make Build Failed #12:
OS: SUSE15-64
Target: x86_64-native-linuxapp-gcc
  CC ice_generic_flow.o
  CC ecore_sp_commands.o
  CC sfc_filter.o
  CC sfc_flow.o
  CC bnxt_txr.o
make[6]: *** [/root/SUSE15-64_K4.12.14_GCC7.3.1/x86_64-native-linuxapp-gcc/42950a2e577b4b709945e14dbee47205/dpdk/mk/internal/rte.compile-pre.mk:114: otx2_tm.o] Error 1
make[6]: *** Waiting for unfinished jobs....
  CC sfc_dp.o
  CC otx2_rss.o
  CC ixgbe_ipsec.o
  CC ecore_init_fw_funcs.o
--
  AR librte_pmd_ice.a
  INSTALL-LIB librte_pmd_ice.a
  CC sfc_ef10_essb_rx.o
== Build drivers/net/tap
  CC bnxt_vnic.o
make[5]: *** [/root/SUSE15-64_K4.12.14_GCC7.3.1/x86_64-native-linuxapp-gcc/42950a2e577b4b709945e14dbee47205/dpdk/mk/rte.subdir.mk:37: octeontx2] Error 2
make[5]: *** Waiting for unfinished jobs....
  CC sfc_ef10_tx.o
  CC efx_bootcfg.o
  CC bnxt_irq.o
  CC ixgbe_tm.o
--
  AR librte_pmd_qede.a
  CC medford2_nic.o
  INSTALL-LIB librte_pmd_qede.a
  AR librte_pmd_sfc_efx.a
  INSTALL-LIB librte_pmd_sfc_efx.a
make[4]: *** [/root/SUSE15-64_K4.12.14_GCC7.3.1/x86_64-native-linuxapp-gcc/42950a2e577b4b709945e14dbee47205/dpdk/mk/rte.subdir.mk:35: net] Error 2
make[3]: *** [/root/SUSE15-64_K4.12.14_GCC7.3.1/x86_64-native-linuxapp-gcc/42950a2e577b4b709945e14dbee47205/dpdk/mk/rte.sdkbuild.mk:46: drivers] Error 2
make[2]: *** [/root/SUSE15-64_K4.12.14_GCC7.3.1/x86_64-native-linuxapp-gcc/42950a2e577b4b709945e14dbee47205/dpdk/mk/rte.sdkroot.mk:99: all] Error 2
make[1]: *** [/root/SUSE15-64_K4.12.14_GCC7.3.1/x86_64-native-linuxapp-gcc/42950a2e577b4b709945e14dbee47205/dpdk/mk/rte.sdkinstall.mk:61: pre_install] Error 2
make: *** [/root/SUSE15-64_K4.12.14_GCC7.3.1/x86_64-native-linuxapp-gcc/42950a2e577b4b709945e14dbee47205/dpdk/mk/rte.sdkroot.mk:77: install] Error 2


*Make Build Failed #13:
OS: FC31-64
Target: x86_64-native-linuxapp-gcc
  INSTALL-LIB librte_pmd_tap.a
/root/FC31-64_K5.3.14_GCC9.2.1/x86_64-native-linuxapp-gcc/42950a2e577b4b709945e14dbee47205/dpdk/drivers/net/octeontx2/otx2_tm.c: In function ‘read_tm_reg’:
/root/FC31-64_K5.3.14_GCC9.2.1/x86_64-native-linuxapp-gcc/42950a2e577b4b709945e14dbee47205/dpdk/drivers/net/octeontx2/otx2_tm.c:1680:5: error: ‘volatile struct nix_txschq_config’ has no member named ‘read’
 1680 |  req->read = 1;
      |     ^~
make[6]: *** [/root/FC31-64_K5.3.14_GCC9.2.1/x86_64-native-linuxapp-gcc/42950a2e577b4b709945e14dbee47205/dpdk/mk/internal/rte.compile-pre.mk:116: otx2_tm.o] Error 1
make[6]: *** Waiting for unfinished jobs....
  CC siena_mcdi.o
== Build drivers/net/kni
  CC siena_nic.o
  CC siena_nvram.o
--
  CC siena_vpd.o
  LD virtio_ethdev.o
  CC ef10_ev.o
  CC ef10_evb.o
  CC virtio_user/vhost_user.o
make[5]: *** [/root/FC31-64_K5.3.14_GCC9.2.1/x86_64-native-linuxapp-gcc/42950a2e577b4b709945e14dbee47205/dpdk/mk/rte.subdir.mk:37: octeontx2] Error 2
make[5]: *** Waiting for unfinished jobs....
  CC ef10_filter.o
  CC virtio_user/vhost_kernel.o
  CC ef10_intr.o
  CC rte_eth_kni.o
--
  AR librte_pmd_virtio.a
  CC conn.o
  INSTALL-LIB librte_pmd_virtio.a
  AR librte_pmd_softnic.a
  INSTALL-LIB librte_pmd_softnic.a
make[4]: *** [/root/FC31-64_K5.3.14_GCC9.2.1/x86_64-native-linuxapp-gcc/42950a2e577b4b709945e14dbee47205/dpdk/mk/rte.subdir.mk:35: net] Error 2
make[3]: *** [/root/FC31-64_K5.3.14_GCC9.2.1/x86_64-native-linuxapp-gcc/42950a2e577b4b709945e14dbee47205/dpdk/mk/rte.sdkbuild.mk:46: drivers] Error 2
make[2]: *** [/root/FC31-64_K5.3.14_GCC9.2.1/x86_64-native-linuxapp-gcc/42950a2e577b4b709945e14dbee47205/dpdk/mk/rte.sdkroot.mk:99: all] Error 2
make[1]: *** [/root/FC31-64_K5.3.14_GCC9.2.1/x86_64-native-linuxapp-gcc/42950a2e577b4b709945e14dbee47205/dpdk/mk/rte.sdkinstall.mk:61: pre_install] Error 2
make: *** [/root/FC31-64_K5.3.14_GCC9.2.1/x86_64-native-linuxapp-gcc/42950a2e577b4b709945e14dbee47205/dpdk/mk/rte.sdkroot.mk:77: install] Error 2


*Make Build Failed #14:
OS: RHEL77-64
Target: x86_64-native-linuxapp-gcc
/root/RHEL77-64_K3.10.0_GCC4.8.5/x86_64-native-linuxapp-gcc/42950a2e577b4b709945e14dbee47205/dpdk/drivers/net/octeontx2/otx2_tm.c:1680:5: error: ‘volatile struct nix_txschq_config’ has no member named ‘read’
  req->read = 1;
     ^
/root/RHEL77-64_K3.10.0_GCC4.8.5/x86_64-native-linuxapp-gcc/42950a2e577b4b709945e14dbee47205/dpdk/drivers/net/octeontx2/otx2_tm.c: At top level:
cc1: warning: unrecognized command line option "-Wno-address-of-packed-member" [enabled by default]
make[6]: *** [otx2_tm.o] Error 1
make[6]: *** Waiting for unfinished jobs....
  CC efx_evb.o
  CC rte_eth_softnic_flow.o
  CC rte_eth_softnic_meter.o
  CC efx_filter.o
--
  CC efx_port.o
  CC efx_proxy.o
  CC efx_rx.o
  CC efx_sram.o
  CC efx_tunnel.o
make[5]: *** [octeontx2] Error 2
make[5]: *** Waiting for unfinished jobs....
  AR librte_pmd_virtio.a
  CC efx_tx.o
  CC efx_vpd.o
  INSTALL-LIB librte_pmd_virtio.a
--
  CC hunt_nic.o
  CC medford_nic.o
  CC medford2_nic.o
  AR librte_pmd_sfc_efx.a
  INSTALL-LIB librte_pmd_sfc_efx.a
make[4]: *** [net] Error 2
make[3]: *** [drivers] Error 2
make[2]: *** [all] Error 2
make[1]: *** [pre_install] Error 2
make: *** [install] Error 2


*Make Build Failed #15:
OS: RHEL80-64
Target: x86_64-native-linuxapp-gcc
  req->read = 1;
       ^~~~
       reg
/root/RHEL80-64_K3.10.0_GCC8.2.1/x86_64-native-linuxapp-gcc/42950a2e577b4b709945e14dbee47205/dpdk/drivers/net/octeontx2/otx2_tm.c: At top level:
cc1: warning: unrecognized command line option ‘-Wno-address-of-packed-member’
make[6]: *** [/root/RHEL80-64_K3.10.0_GCC8.2.1/x86_64-native-linuxapp-gcc/42950a2e577b4b709945e14dbee47205/dpdk/mk/internal/rte.compile-pre.mk:114: otx2_tm.o] Error 1
make[6]: *** Waiting for unfinished jobs....
  CC ecore_l2.o
  CC sfc_port.o
  CC nicvf_rxtx.o
  CC nicvf_hw.o
--
== Build drivers/net/softnic
  CC bcm_osal.o
  CC ecore_sriov.o
  CC rte_eth_kni.o
  CC ecore_vf.o
make[5]: *** [/root/RHEL80-64_K3.10.0_GCC8.2.1/x86_64-native-linuxapp-gcc/42950a2e577b4b709945e14dbee47205/dpdk/mk/rte.subdir.mk:35: octeontx2] Error 2
make[5]: *** Waiting for unfinished jobs....
== Build drivers/net/vhost
  CC virtio_pci.o
  CC vmxnet3_ethdev.o
  PMDINFO rte_eth_kni.o.pmd.c
--
  CC hunt_nic.o
  CC medford_nic.o
  CC medford2_nic.o
  AR librte_pmd_sfc_efx.a
  INSTALL-LIB librte_pmd_sfc_efx.a
make[4]: *** [/root/RHEL80-64_K3.10.0_GCC8.2.1/x86_64-native-linuxapp-gcc/42950a2e577b4b709945e14dbee47205/dpdk/mk/rte.subdir.mk:35: net] Error 2
make[3]: *** [/root/RHEL80-64_K3.10.0_GCC8.2.1/x86_64-native-linuxapp-gcc/42950a2e577b4b709945e14dbee47205/dpdk/mk/rte.sdkbuild.mk:46: drivers] Error 2
make[2]: *** [/root/RHEL80-64_K3.10.0_GCC8.2.1/x86_64-native-linuxapp-gcc/42950a2e577b4b709945e14dbee47205/dpdk/mk/rte.sdkroot.mk:99: all] Error 2
make[1]: *** [/root/RHEL80-64_K3.10.0_GCC8.2.1/x86_64-native-linuxapp-gcc/42950a2e577b4b709945e14dbee47205/dpdk/mk/rte.sdkinstall.mk:61: pre_install] Error 2
make: *** [/root/RHEL80-64_K3.10.0_GCC8.2.1/x86_64-native-linuxapp-gcc/42950a2e577b4b709945e14dbee47205/dpdk/mk/rte.sdkroot.mk:77: install] Error 2


*Make Build Failed #16:
OS: SUSE15-64
Target: x86_64-native-linuxapp-clang
        ~~~  ^
/root/SUSE15-64_K4.12.14_Clang5.0.1/x86_64-native-linuxapp-clang/42950a2e577b4b709945e14dbee47205/dpdk/drivers/net/octeontx2/otx2_tm.c:1680:7: error: no member named 'read' in 'struct nix_txschq_config'
        req->read = 1;
        ~~~  ^
3 errors generated.
make[6]: *** [/root/SUSE15-64_K4.12.14_Clang5.0.1/x86_64-native-linuxapp-clang/42950a2e577b4b709945e14dbee47205/dpdk/mk/internal/rte.compile-pre.mk:116: otx2_tm.o] Error 1
make[6]: *** Waiting for unfinished jobs....
  CC bnxt_rxr.o
  PMDINFO ixgbe_ethdev.o.pmd.c
  CC ixgbe_ethdev.o.pmd.o
  LD ixgbe_ethdev.o
--
  CC sfc_dp.o
  AR librte_pmd_vdev_netvsc.a
  INSTALL-LIB librte_pmd_vdev_netvsc.a
  CC nicvf_svf.o
  CC sfc_ef10_rx.o
make[5]: *** [/root/SUSE15-64_K4.12.14_Clang5.0.1/x86_64-native-linuxapp-clang/42950a2e577b4b709945e14dbee47205/dpdk/mk/rte.subdir.mk:35: octeontx2] Error 2
make[5]: *** Waiting for unfinished jobs....
  CC sfc_ef10_essb_rx.o
  CC ecore_init_fw_funcs.o
  CC sfc_ef10_tx.o
  CC ecore_spq.o
--
  CC qede_filter.o
  AR librte_pmd_sfc_efx.a
  INSTALL-LIB librte_pmd_sfc_efx.a
  AR librte_pmd_qede.a
  INSTALL-LIB librte_pmd_qede.a
make[4]: *** [/root/SUSE15-64_K4.12.14_Clang5.0.1/x86_64-native-linuxapp-clang/42950a2e577b4b709945e14dbee47205/dpdk/mk/rte.subdir.mk:35: net] Error 2
make[3]: *** [/root/SUSE15-64_K4.12.14_Clang5.0.1/x86_64-native-linuxapp-clang/42950a2e577b4b709945e14dbee47205/dpdk/mk/rte.sdkbuild.mk:46: drivers] Error 2
make[2]: *** [/root/SUSE15-64_K4.12.14_Clang5.0.1/x86_64-native-linuxapp-clang/42950a2e577b4b709945e14dbee47205/dpdk/mk/rte.sdkroot.mk:99: all] Error 2
make[1]: *** [/root/SUSE15-64_K4.12.14_Clang5.0.1/x86_64-native-linuxapp-clang/42950a2e577b4b709945e14dbee47205/dpdk/mk/rte.sdkinstall.mk:61: pre_install] Error 2
make: *** [/root/SUSE15-64_K4.12.14_Clang5.0.1/x86_64-native-linuxapp-clang/42950a2e577b4b709945e14dbee47205/dpdk/mk/rte.sdkroot.mk:77: install] Error 2


*Make Build Failed #17:
OS: FC31-64
Target: x86_64-native-linuxapp-clang
  CC nfp_net.o.pmd.o
  LD nfp_net.o
  AR librte_pmd_nfp.a
  INSTALL-LIB librte_pmd_nfp.a
  CC sfc.o
make[6]: *** [/root/FC31-64_K5.3.14_Clang9.0.0/x86_64-native-linuxapp-clang/42950a2e577b4b709945e14dbee47205/dpdk/mk/internal/rte.compile-pre.mk:116: otx2_tm.o] Error 1
make[6]: *** Waiting for unfinished jobs....
  CC bnxt_ring.o
  CC ecore_cxt.o
  CC otx2_rss.o
  CC sfc_mcdi.o
--
  AR librte_pmd_vdev_netvsc.a
  INSTALL-LIB librte_pmd_vdev_netvsc.a
  CC sfc_port.o
  CC virtio_pci.o
  CC ecore_spq.o
make[5]: *** [/root/FC31-64_K5.3.14_Clang9.0.0/x86_64-native-linuxapp-clang/42950a2e577b4b709945e14dbee47205/dpdk/mk/rte.subdir.mk:35: octeontx2] Error 2
make[5]: *** Waiting for unfinished jobs....
  CC ecore_init_ops.o
  CC sfc_rx.o
  CC tap_tcmsgs.o
  CC nicvf_mbox.o
--
  CC hunt_nic.o
  CC medford_nic.o
  CC medford2_nic.o
  AR librte_pmd_sfc_efx.a
  INSTALL-LIB librte_pmd_sfc_efx.a
make[4]: *** [/root/FC31-64_K5.3.14_Clang9.0.0/x86_64-native-linuxapp-clang/42950a2e577b4b709945e14dbee47205/dpdk/mk/rte.subdir.mk:35: net] Error 2
make[3]: *** [/root/FC31-64_K5.3.14_Clang9.0.0/x86_64-native-linuxapp-clang/42950a2e577b4b709945e14dbee47205/dpdk/mk/rte.sdkbuild.mk:46: drivers] Error 2
make[2]: *** [/root/FC31-64_K5.3.14_Clang9.0.0/x86_64-native-linuxapp-clang/42950a2e577b4b709945e14dbee47205/dpdk/mk/rte.sdkroot.mk:99: all] Error 2
make[1]: *** [/root/FC31-64_K5.3.14_Clang9.0.0/x86_64-native-linuxapp-clang/42950a2e577b4b709945e14dbee47205/dpdk/mk/rte.sdkinstall.mk:61: pre_install] Error 2
make: *** [/root/FC31-64_K5.3.14_Clang9.0.0/x86_64-native-linuxapp-clang/42950a2e577b4b709945e14dbee47205/dpdk/mk/rte.sdkroot.mk:77: install] Error 2


*Make Build Failed #18:
OS: UB1604-64
Target: x86_64-native-linuxapp-gcc
/root/UB1604-64_K4.4.0_GCC5.4.0/x86_64-native-linuxapp-gcc/42950a2e577b4b709945e14dbee47205/dpdk/drivers/net/octeontx2/otx2_tm.c:1680:5: error: ‘volatile struct nix_txschq_config’ has no member named ‘read’
  req->read = 1;
     ^
/root/UB1604-64_K4.4.0_GCC5.4.0/x86_64-native-linuxapp-gcc/42950a2e577b4b709945e14dbee47205/dpdk/drivers/net/octeontx2/otx2_tm.c: At top level:
cc1: warning: unrecognized command line option ‘-Wno-address-of-packed-member’
/root/UB1604-64_K4.4.0_GCC5.4.0/x86_64-native-linuxapp-gcc/42950a2e577b4b709945e14dbee47205/dpdk/mk/internal/rte.compile-pre.mk:114: recipe for target 'otx2_tm.o' failed
make[6]: *** [otx2_tm.o] Error 1
make[6]: *** Waiting for unfinished jobs....
  CC bnxt_txq.o
  CC bnxt_txr.o
  CC bnxt_vnic.o
  CC ecore_sp_commands.o
--
  CC virtio_user_ethdev.o
  CC rte_eth_softnic_tap.o
  CC rte_eth_softnic_action.o
  CC rte_eth_softnic_pipeline.o
  CC rte_eth_softnic_thread.o
/root/UB1604-64_K4.4.0_GCC5.4.0/x86_64-native-linuxapp-gcc/42950a2e577b4b709945e14dbee47205/dpdk/mk/rte.subdir.mk:35: recipe for target 'octeontx2' failed
make[5]: *** [octeontx2] Error 2
make[5]: *** Waiting for unfinished jobs....
  CC rte_eth_softnic_cli.o
  PMDINFO qede_ethdev.o.pmd.c
  CC qede_ethdev.o.pmd.o
  PMDINFO virtio_user_ethdev.o.pmd.c
--
  CC hunt_nic.o
  CC medford_nic.o
  CC medford2_nic.o
  AR librte_pmd_sfc_efx.a
  INSTALL-LIB librte_pmd_sfc_efx.a
/root/UB1604-64_K4.4.0_GCC5.4.0/x86_64-native-linuxapp-gcc/42950a2e577b4b709945e14dbee47205/dpdk/mk/rte.subdir.mk:35: recipe for target 'net' failed
make[4]: *** [net] Error 2
/root/UB1604-64_K4.4.0_GCC5.4.0/x86_64-native-linuxapp-gcc/42950a2e577b4b709945e14dbee47205/dpdk/mk/rte.sdkbuild.mk:46: recipe for target 'drivers' failed
make[3]: *** [drivers] Error 2
/root/UB1604-64_K4.4.0_GCC5.4.0/x86_64-native-linuxapp-gcc/42950a2e577b4b709945e14dbee47205/dpdk/mk/rte.sdkroot.mk:98: recipe for target 'all' failed
make[2]: *** [all] Error 2
/root/UB1604-64_K4.4.0_GCC5.4.0/x86_64-native-linuxapp-gcc/42950a2e577b4b709945e14dbee47205/dpdk/mk/rte.sdkinstall.mk:60: recipe for target 'pre_install' failed
make[1]: *** [pre_install] Error 2
/root/UB1604-64_K4.4.0_GCC5.4.0/x86_64-native-linuxapp-gcc/42950a2e577b4b709945e14dbee47205/dpdk/mk/rte.sdkroot.mk:77: recipe for target 'install' failed
make: *** [install] Error 2


*Make Build Failed #19:
OS: UB1804-64
Target: x86_64-native-linuxapp-gcc
  req->read = 1;
       ^~~~
       reg
/root/UB1804-64_K4.15.0_GCC7.3.0/x86_64-native-linuxapp-gcc/42950a2e577b4b709945e14dbee47205/dpdk/drivers/net/octeontx2/otx2_tm.c: At top level:
cc1: warning: unrecognized command line option ‘-Wno-address-of-packed-member’
/root/UB1804-64_K4.15.0_GCC7.3.0/x86_64-native-linuxapp-gcc/42950a2e577b4b709945e14dbee47205/dpdk/mk/internal/rte.compile-pre.mk:114: recipe for target 'otx2_tm.o' failed
make[6]: *** [otx2_tm.o] Error 1
make[6]: *** Waiting for unfinished jobs....
  CC efx_mac.o
== Build drivers/net/tap
== Build drivers/net/thunderx
== Build drivers/net/vdev_netvsc
--
  CC nicvf_ethdev.o
  CC efx_phy.o
  AR librte_pmd_qede.a
  INSTALL-LIB librte_pmd_qede.a
  CC efx_port.o
/root/UB1804-64_K4.15.0_GCC7.3.0/x86_64-native-linuxapp-gcc/42950a2e577b4b709945e14dbee47205/dpdk/mk/rte.subdir.mk:35: recipe for target 'octeontx2' failed
make[5]: *** [octeontx2] Error 2
make[5]: *** Waiting for unfinished jobs....
  CC efx_proxy.o
  PMDINFO vmxnet3_ethdev.o.pmd.c
  CC vmxnet3_ethdev.o.pmd.o
  CC efx_rx.o
--
  CC medford2_nic.o
  AR librte_pmd_sfc_efx.a
  INSTALL-LIB librte_pmd_sfc_efx.a
  AR librte_pmd_virtio.a
  INSTALL-LIB librte_pmd_virtio.a
/root/UB1804-64_K4.15.0_GCC7.3.0/x86_64-native-linuxapp-gcc/42950a2e577b4b709945e14dbee47205/dpdk/mk/rte.subdir.mk:35: recipe for target 'net' failed
make[4]: *** [net] Error 2
/root/UB1804-64_K4.15.0_GCC7.3.0/x86_64-native-linuxapp-gcc/42950a2e577b4b709945e14dbee47205/dpdk/mk/rte.sdkbuild.mk:46: recipe for target 'drivers' failed
make[3]: *** [drivers] Error 2
/root/UB1804-64_K4.15.0_GCC7.3.0/x86_64-native-linuxapp-gcc/42950a2e577b4b709945e14dbee47205/dpdk/mk/rte.sdkroot.mk:98: recipe for target 'all' failed
make[2]: *** [all] Error 2
/root/UB1804-64_K4.15.0_GCC7.3.0/x86_64-native-linuxapp-gcc/42950a2e577b4b709945e14dbee47205/dpdk/mk/rte.sdkinstall.mk:60: recipe for target 'pre_install' failed
make[1]: *** [pre_install] Error 2
/root/UB1804-64_K4.15.0_GCC7.3.0/x86_64-native-linuxapp-gcc/42950a2e577b4b709945e14dbee47205/dpdk/mk/rte.sdkroot.mk:77: recipe for target 'install' failed
make: *** [install] Error 2


*Make Build Failed #20:
OS: FreeBSD1201-64
Target: x86_64-native-bsdapp-clang
/root/FreeBSD1201-64_K12.1_Clang8.0.1/x86_64-native-bsdapp-clang/42950a2e577b4b709945e14dbee47205/dpdk/drivers/net/octeontx2/otx2_tm.c:1680:7: error: no member named 'read' in 'struct nix_txschq_config'
        req->read = 1;
        ~~~  ^
3 errors generated.
  CC otx2_mac.o
gmake[6]: *** [/root/FreeBSD1201-64_K12.1_Clang8.0.1/x86_64-native-bsdapp-clang/42950a2e577b4b709945e14dbee47205/dpdk/mk/internal/rte.compile-pre.mk:116: otx2_tm.o] Error 1
gmake[6]: *** Waiting for unfinished jobs....
  CC bnxt_stats.o
== Build drivers/net/qede
== Build drivers/net/ring
  CC ice_fdir_filter.o
--
  CC bnxt_irq.o
  CC nicvf_hw.o
  CC sfc.o
  AR librte_pmd_ice.a
  CC bnxt_util.o
gmake[5]: *** [/root/FreeBSD1201-64_K12.1_Clang8.0.1/x86_64-native-bsdapp-clang/42950a2e577b4b709945e14dbee47205/dpdk/mk/rte.subdir.mk:35: octeontx2] Error 2
gmake[5]: *** Waiting for unfinished jobs....
  CC i40e_vf_representor.o
  CC i40e_rxtx_vec_avx2.o
  CC ecore_l2.o
  INSTALL-LIB librte_pmd_ice.a
--
  CC hunt_nic.o
  CC medford_nic.o
  CC medford2_nic.o
  AR librte_pmd_sfc_efx.a
  INSTALL-LIB librte_pmd_sfc_efx.a
gmake[4]: *** [/root/FreeBSD1201-64_K12.1_Clang8.0.1/x86_64-native-bsdapp-clang/42950a2e577b4b709945e14dbee47205/dpdk/mk/rte.subdir.mk:35: net] Error 2
gmake[3]: *** [/root/FreeBSD1201-64_K12.1_Clang8.0.1/x86_64-native-bsdapp-clang/42950a2e577b4b709945e14dbee47205/dpdk/mk/rte.sdkbuild.mk:46: drivers] Error 2
gmake[2]: *** [/root/FreeBSD1201-64_K12.1_Clang8.0.1/x86_64-native-bsdapp-clang/42950a2e577b4b709945e14dbee47205/dpdk/mk/rte.sdkroot.mk:99: all] Error 2
gmake[1]: *** [/root/FreeBSD1201-64_K12.1_Clang8.0.1/x86_64-native-bsdapp-clang/42950a2e577b4b709945e14dbee47205/dpdk/mk/rte.sdkinstall.mk:61: pre_install] Error 2
gmake: *** [/root/FreeBSD1201-64_K12.1_Clang8.0.1/x86_64-native-bsdapp-clang/42950a2e577b4b709945e14dbee47205/dpdk/mk/rte.sdkroot.mk:77: install] Error 2


*Make Build Failed #21:
OS: FreeBSD1201-64
Target: x86_64-native-bsdapp-gcc
/root/FreeBSD1201-64_K12.1_GCC9.2.0/x86_64-native-bsdapp-gcc/42950a2e577b4b709945e14dbee47205/dpdk/drivers/net/octeontx2/otx2_tm.c: In function 'read_tm_reg':
/root/FreeBSD1201-64_K12.1_GCC9.2.0/x86_64-native-bsdapp-gcc/42950a2e577b4b709945e14dbee47205/dpdk/drivers/net/octeontx2/otx2_tm.c:1680:5: error: 'volatile struct nix_txschq_config' has no member named 'read'
 1680 |  req->read = 1;
      |     ^~
  CC i40e_tm.o
gmake[6]: *** [/root/FreeBSD1201-64_K12.1_GCC9.2.0/x86_64-native-bsdapp-gcc/42950a2e577b4b709945e14dbee47205/dpdk/mk/internal/rte.compile-pre.mk:116: otx2_tm.o] Error 1
  PMDINFO rte_eth_pcap.o.pmd.c
  CC rte_eth_pcap.o.pmd.o
  CC ice_switch_filter.o
gmake[6]: *** Waiting for unfinished jobs....
  LD rte_eth_pcap.o
--
  CC nicvf_rxtx.o
  CC virtqueue.o
  CC bnxt_rxtx_vec_sse.o
  CC ecore_init_ops.o
  CC nicvf_hw.o
gmake[5]: *** [/root/FreeBSD1201-64_K12.1_GCC9.2.0/x86_64-native-bsdapp-gcc/42950a2e577b4b709945e14dbee47205/dpdk/mk/rte.subdir.mk:35: octeontx2] Error 2
gmake[5]: *** Waiting for unfinished jobs....
  CC ixgbe_flow.o
  CC ecore_mcp.o
  CC sfc_mcdi.o
  CC sfc.o
--
  CC hunt_nic.o
  CC medford_nic.o
  CC medford2_nic.o
  AR librte_pmd_sfc_efx.a
  INSTALL-LIB librte_pmd_sfc_efx.a
gmake[4]: *** [/root/FreeBSD1201-64_K12.1_GCC9.2.0/x86_64-native-bsdapp-gcc/42950a2e577b4b709945e14dbee47205/dpdk/mk/rte.subdir.mk:35: net] Error 2
gmake[3]: *** [/root/FreeBSD1201-64_K12.1_GCC9.2.0/x86_64-native-bsdapp-gcc/42950a2e577b4b709945e14dbee47205/dpdk/mk/rte.sdkbuild.mk:46: drivers] Error 2
gmake[2]: *** [/root/FreeBSD1201-64_K12.1_GCC9.2.0/x86_64-native-bsdapp-gcc/42950a2e577b4b709945e14dbee47205/dpdk/mk/rte.sdkroot.mk:99: all] Error 2
gmake[1]: *** [/root/FreeBSD1201-64_K12.1_GCC9.2.0/x86_64-native-bsdapp-gcc/42950a2e577b4b709945e14dbee47205/dpdk/mk/rte.sdkinstall.mk:61: pre_install] Error 2
gmake: *** [/root/FreeBSD1201-64_K12.1_GCC9.2.0/x86_64-native-bsdapp-gcc/42950a2e577b4b709945e14dbee47205/dpdk/mk/rte.sdkroot.mk:77: install] Error 2


*Make Build Failed #22:
OS: FreeBSD1201-64
Target: x86_64-native-bsdapp-gcc+debug
  INSTALL-LIB librte_pmd_octeontx.a
/root/FreeBSD1201-64_K12.1_GCC7.3.0/x86_64-native-bsdapp-gcc+debug/42950a2e577b4b709945e14dbee47205/dpdk/drivers/net/octeontx2/otx2_tm.c: In function 'read_tm_reg':
/root/FreeBSD1201-64_K12.1_GCC7.3.0/x86_64-native-bsdapp-gcc+debug/42950a2e577b4b709945e14dbee47205/dpdk/drivers/net/octeontx2/otx2_tm.c:1680:5: error: 'volatile struct nix_txschq_config' has no member named 'read'
 1680 |  req->read = 1;
      |     ^~
gmake[6]: *** [/root/FreeBSD1201-64_K12.1_GCC7.3.0/x86_64-native-bsdapp-gcc+debug/42950a2e577b4b709945e14dbee47205/dpdk/mk/internal/rte.compile-pre.mk:116: otx2_tm.o] Error 1
gmake[6]: *** Waiting for unfinished jobs....
  CC bnxt_hwrm.o
== Build drivers/net/sfc
  AR librte_pmd_i40e.a
  INSTALL-LIB librte_pmd_i40e.a
--
  CC sfc_intr.o
  PMDINFO virtio_ethdev.o.pmd.c
  CC virtio_ethdev.o.pmd.o
  CC sfc_ev.o
  LD virtio_ethdev.o
gmake[5]: *** [/root/FreeBSD1201-64_K12.1_GCC7.3.0/x86_64-native-bsdapp-gcc+debug/42950a2e577b4b709945e14dbee47205/dpdk/mk/rte.subdir.mk:35: octeontx2] Error 2
  CC virtio_rxtx_simple_sse.o
gmake[5]: *** Waiting for unfinished jobs....
  CC sfc_port.o
  CC ecore_spq.o
  CC bnxt_rxtx_vec_sse.o
--
  CC medford2_nic.o
  CC medford_nic.o
  CC hunt_nic.o
  AR librte_pmd_sfc_efx.a
  INSTALL-LIB librte_pmd_sfc_efx.a
gmake[4]: *** [/root/FreeBSD1201-64_K12.1_GCC7.3.0/x86_64-native-bsdapp-gcc+debug/42950a2e577b4b709945e14dbee47205/dpdk/mk/rte.subdir.mk:35: net] Error 2
gmake[3]: *** [/root/FreeBSD1201-64_K12.1_GCC7.3.0/x86_64-native-bsdapp-gcc+debug/42950a2e577b4b709945e14dbee47205/dpdk/mk/rte.sdkbuild.mk:46: drivers] Error 2
gmake[2]: *** [/root/FreeBSD1201-64_K12.1_GCC7.3.0/x86_64-native-bsdapp-gcc+debug/42950a2e577b4b709945e14dbee47205/dpdk/mk/rte.sdkroot.mk:99: all] Error 2
gmake[1]: *** [/root/FreeBSD1201-64_K12.1_GCC7.3.0/x86_64-native-bsdapp-gcc+debug/42950a2e577b4b709945e14dbee47205/dpdk/mk/rte.sdkinstall.mk:61: pre_install] Error 2
gmake: *** [/root/FreeBSD1201-64_K12.1_GCC7.3.0/x86_64-native-bsdapp-gcc+debug/42950a2e577b4b709945e14dbee47205/dpdk/mk/rte.sdkroot.mk:77: install] Error 2


*Make Build Failed #23:
OS: FreeBSD1201-64
Target: x86_64-native-bsdapp-gcc+shared
      |     ^~
/root/FreeBSD1201-64_K12.1_GCC7.3.0/x86_64-native-bsdapp-gcc+shared/42950a2e577b4b709945e14dbee47205/dpdk/drivers/net/octeontx2/otx2_tm.c: In function 'read_tm_reg':
/root/FreeBSD1201-64_K12.1_GCC7.3.0/x86_64-native-bsdapp-gcc+shared/42950a2e577b4b709945e14dbee47205/dpdk/drivers/net/octeontx2/otx2_tm.c:1680:5: error: 'volatile struct nix_txschq_config' has no member named 'read'
 1680 |  req->read = 1;
      |     ^~
gmake[6]: *** [/root/FreeBSD1201-64_K12.1_GCC7.3.0/x86_64-native-bsdapp-gcc+shared/42950a2e577b4b709945e14dbee47205/dpdk/mk/internal/rte.compile-pre.mk:116: otx2_tm.o] Error 1
gmake[6]: *** Waiting for unfinished jobs....
== Build drivers/net/sfc
  LD librte_pmd_ring.so.20.0.1
  INSTALL-LIB librte_pmd_ring.so.20.0.1
  CC i40e_fdir.o
--
  LD librte_pmd_ixgbe.so.20.0.1
  INSTALL-LIB librte_pmd_ixgbe.so.20.0.1
  CC sfc_flow.o
  CC ecore_vf.o
  CC vmxnet3_rxtx.o
gmake[5]: *** [/root/FreeBSD1201-64_K12.1_GCC7.3.0/x86_64-native-bsdapp-gcc+shared/42950a2e577b4b709945e14dbee47205/dpdk/mk/rte.subdir.mk:35: octeontx2] Error 2
gmake[5]: *** Waiting for unfinished jobs....
  CC sfc_dp.o
  CC qede_ethdev.o
  CC vmxnet3_ethdev.o
  CC virtio_ethdev.o
--
  CC hunt_nic.o
  CC medford2_nic.o
  CC medford_nic.o
  LD librte_pmd_sfc_efx.so.20.0.1
  INSTALL-LIB librte_pmd_sfc_efx.so.20.0.1
gmake[4]: *** [/root/FreeBSD1201-64_K12.1_GCC7.3.0/x86_64-native-bsdapp-gcc+shared/42950a2e577b4b709945e14dbee47205/dpdk/mk/rte.subdir.mk:35: net] Error 2
gmake[3]: *** [/root/FreeBSD1201-64_K12.1_GCC7.3.0/x86_64-native-bsdapp-gcc+shared/42950a2e577b4b709945e14dbee47205/dpdk/mk/rte.sdkbuild.mk:46: drivers] Error 2
gmake[2]: *** [/root/FreeBSD1201-64_K12.1_GCC7.3.0/x86_64-native-bsdapp-gcc+shared/42950a2e577b4b709945e14dbee47205/dpdk/mk/rte.sdkroot.mk:99: all] Error 2
gmake[1]: *** [/root/FreeBSD1201-64_K12.1_GCC7.3.0/x86_64-native-bsdapp-gcc+shared/42950a2e577b4b709945e14dbee47205/dpdk/mk/rte.sdkinstall.mk:61: pre_install] Error 2
gmake: *** [/root/FreeBSD1201-64_K12.1_GCC7.3.0/x86_64-native-bsdapp-gcc+shared/42950a2e577b4b709945e14dbee47205/dpdk/mk/rte.sdkroot.mk:77: install] Error 2

*Meson Build Failed #1:
OS: UB1604-32
Target:./build-gcc-static
FAILED: drivers/a715181@@tmp_rte_pmd_octeontx2@sta/net_octeontx2_otx2_tm.c.o 
gcc -Idrivers/a715181@@tmp_rte_pmd_octeontx2@sta -Idrivers -I../drivers -Idrivers/net/octeontx2 -I../drivers/net/octeontx2 -Idrivers/net/octeontx2/../../common/cpt -I../drivers/net/octeontx2/../../common/cpt -Idrivers/net/octeontx2/../../crypto/octeontx2 -I../drivers/net/octeontx2/../../crypto/octeontx2 -Ilib/librte_ethdev -I../lib/librte_ethdev -I. -I../ -Iconfig -I../config -Ilib/librte_eal/common/include -I../lib/librte_eal/common/include -I../lib/librte_eal/linux/eal/include -Ilib/librte_eal/common -I../lib/librte_eal/common -Ilib/librte_eal/common/include/arch/x86 -I../lib/librte_eal/common/include/arch/x86 -Ilib/librte_eal -I../lib/librte_eal -Ilib/librte_kvargs -I../lib/librte_kvargs -Ilib/librte_net -I../lib/librte_net -Ilib/librte_mbuf -I../lib/librte_mbuf -Ilib/librte_mempool -I../lib/librte_mempool -Ilib/librte_ring -I../lib/librte_ring -Ilib/librte_meter -I../lib/librte_meter -Idrivers/bus/pci -I../drivers/bus/pci -I../drivers/bus/pci/linux -Ilib/librte_pci -I../lib/librte_pci -Idrivers/bus/vdev -I../drivers/bus/vdev -Ilib/librte_cryptodev -I../lib/librte_cryptodev -Ilib/librte_eventdev -I../lib/librte_eventdev -Ilib/librte_hash -I../lib/librte_hash -Ilib/librte_timer -I../lib/librte_timer -Ilib/librte_security -I../lib/librte_security -Idrivers/common/octeontx2 -I../drivers/common/octeontx2 -Idrivers/common/octeontx2/../../common/octeontx2 -I../drivers/common/octeontx2/../../common/octeontx2 -Idrivers/common/octeontx2/../../mempool/octeontx2 -I../drivers/common/octeontx2/../../mempool/octeontx2 -Idrivers/common/octeontx2/../../bus/pci -I../drivers/common/octeontx2/../../bus/pci -Idrivers/mempool/octeontx2 -I../drivers/mempool/octeontx2 -fdiagnostics-color=always -pipe -D_FILE_OFFSET_BITS=64 -Wall -Winvalid-pch -Werror -O2 -g -include rte_config.h -Wextra -Wcast-qual -Wdeprecated -Wformat-nonliteral -Wformat-security -Wmissing-declarations -Wmissing-prototypes -Wnested-externs -Wold-style-definition -Wpointer-arith -Wsign-compare -Wstrict-prototypes -Wundef -Wwrite-strings -Wno-missing-field-initializers -Wno-pointer-to-int-cast -D_GNU_SOURCE -fPIC -march=native -flax-vector-conversions -Wno-int-to-pointer-cast -Wno-pointer-to-int-cast -MD -MQ 'drivers/a715181@@tmp_rte_pmd_octeontx2@sta/net_octeontx2_otx2_tm.c.o' -MF 'drivers/a715181@@tmp_rte_pmd_octeontx2@sta/net_octeontx2_otx2_tm.c.o.d' -o 'drivers/a715181@@tmp_rte_pmd_octeontx2@sta/net_octeontx2_otx2_tm.c.o' -c ../drivers/net/octeontx2/otx2_tm.c
In file included from ../drivers/net/octeontx2/otx2_ethdev.h:19:0,
                 from ../drivers/net/octeontx2/otx2_tm.c:7:
../drivers/net/octeontx2/otx2_tm.c: In function ‘populate_tm_reg’:
../drivers/common/octeontx2/otx2_common.h:100:3: error: format ‘%lu’ expects argument of type ‘long unsigned int’, but argument 10 has type ‘uint64_t {aka long long unsigned int}’ [-Werror=format=]
   "[%s] %s():%u " fmt "\n",    \
   ^
../drivers/common/octeontx2/otx2_common.h:109:31: note: in expansion of macro ‘otx2_dbg’
 #define otx2_tm_dbg(fmt, ...) otx2_dbg(tm, fmt, ##__VA_ARGS__)
                               ^
../drivers/net/octeontx2/otx2_tm.c:525:2: note: in expansion of macro ‘otx2_tm_dbg’
  otx2_tm_dbg("Topology config node %s(%u)->%s(%lu) lvl %u, id %u"
  ^
../drivers/common/octeontx2/otx2_common.h:100:3: error: format ‘%lu’ expects argument of type ‘long unsigned int’, but argument 13 has type ‘uint64_t {aka long long unsigned int}’ [-Werror=format=]
   "[%s] %s():%u " fmt "\n",    \
   ^
../drivers/common/octeontx2/otx2_common.h:109:31: note: in expansion of macro ‘otx2_dbg’
 #define otx2_tm_dbg(fmt, ...) otx2_dbg(tm, fmt, ##__VA_ARGS__)
                               ^
../drivers/net/octeontx2/otx2_tm.c:525:2: note: in expansion of macro ‘otx2_tm_dbg’
  otx2_tm_dbg("Topology config node %s(%u)->%s(%lu) lvl %u, id %u"
  ^
../drivers/net/octeontx2/otx2_tm.c:627:22: error: ‘struct nix_txschq_config’ has no member named ‘regval_mask’
  otx2_mbox_memcpy(req->regval_mask, regval_mask, sizeof(uint64_t) * k);
                      ^
../drivers/net/octeontx2/otx2_tm.c: In function ‘nix_smq_xoff’:
../drivers/net/octeontx2/otx2_tm.c:876:5: error: ‘struct nix_txschq_config’ has no member named ‘regval_mask’
  req->regval_mask[0] = enable ?
     ^
In file included from ../drivers/net/octeontx2/otx2_ethdev.h:19:0,
                 from ../drivers/net/octeontx2/otx2_tm.c:7:
../drivers/net/octeontx2/otx2_tm.c: In function ‘nix_sq_sched_data’:
../drivers/common/octeontx2/otx2_common.h:100:3: error: format ‘%lx’ expects argument of type ‘long unsigned int’, but argument 8 has type ‘uint64_t {aka long long unsigned int}’ [-Werror=format=]
   "[%s] %s():%u " fmt "\n",    \
   ^
../drivers/common/octeontx2/otx2_common.h:109:31: note: in expansion of macro ‘otx2_dbg’
 #define otx2_tm_dbg(fmt, ...) otx2_dbg(tm, fmt, ##__VA_ARGS__)
                               ^
../drivers/net/octeontx2/otx2_tm.c:1157:3: note: in expansion of macro ‘otx2_tm_dbg’
   otx2_tm_dbg("Update sq(%u) rr_quantum 0x%lx", sq, rr_quantum);
   ^
../drivers/common/octeontx2/otx2_common.h:100:3: error: format ‘%lx’ expects argument of type ‘long unsigned int’, but argument 9 has type ‘uint64_t {aka long long unsigned int}’ [-Werror=format=]
   "[%s] %s():%u " fmt "\n",    \
   ^
../drivers/common/octeontx2/otx2_common.h:109:31: note: in expansion of macro ‘otx2_dbg’
 #define otx2_tm_dbg(fmt, ...) otx2_dbg(tm, fmt, ##__VA_ARGS__)
                               ^
../drivers/net/octeontx2/otx2_tm.c:1159:3: note: in expansion of macro ‘otx2_tm_dbg’
   otx2_tm_dbg("Enabling sq(%u)->smq(%u), rr_quantum 0x%lx",
   ^
../drivers/net/octeontx2/otx2_tm.c: In function ‘read_tm_reg’:
../drivers/net/octeontx2/otx2_tm.c:1680:5: error: ‘volatile struct nix_txschq_config’ has no member named ‘read’
  req->read = 1;
     ^
cc1: all warnings being treated as errors
[1084/1972] Linking static target drivers/librte_pmd_null.a.
[1085/1972] Compiling C object 'drivers/a715181@@rte_pmd_null@sha/meson-generated_.._rte_pmd_null.pmd.c.o'.
[1086/1972] Generating rte_pmd_netvsc.exp_chk with a meson_exe.py custom command.
[1087/1972] Compiling C object 'drivers/a715181@@tmp_rte_pmd_octeontx2@sta/net_octeontx2_otx2_rss.c.o'.
[1088/1972] Compiling C object 'drivers/a715181@@tmp_rte_pmd_octeontx2@sta/net_octeontx2_otx2_tx.c.o'.
ninja: build stopped: subcommand failed




*Meson Build Failed #2:
OS: FC31-64
Target:./build-gcc-static
FAILED: drivers/a715181@@tmp_rte_pmd_octeontx2@sta/net_octeontx2_otx2_tm.c.o 
gcc -Idrivers/a715181@@tmp_rte_pmd_octeontx2@sta -Idrivers -I../drivers -Idrivers/net/octeontx2 -I../drivers/net/octeontx2 -Idrivers/net/octeontx2/../../common/cpt -I../drivers/net/octeontx2/../../common/cpt -Idrivers/net/octeontx2/../../crypto/octeontx2 -I../drivers/net/octeontx2/../../crypto/octeontx2 -Ilib/librte_ethdev -I../lib/librte_ethdev -I. -I../ -Iconfig -I../config -Ilib/librte_eal/common/include -I../lib/librte_eal/common/include -I../lib/librte_eal/linux/eal/include -Ilib/librte_eal/common -I../lib/librte_eal/common -Ilib/librte_eal/common/include/arch/x86 -I../lib/librte_eal/common/include/arch/x86 -Ilib/librte_eal -I../lib/librte_eal -Ilib/librte_kvargs -I../lib/librte_kvargs -Ilib/librte_net -I../lib/librte_net -Ilib/librte_mbuf -I../lib/librte_mbuf -Ilib/librte_mempool -I../lib/librte_mempool -Ilib/librte_ring -I../lib/librte_ring -Ilib/librte_meter -I../lib/librte_meter -Idrivers/bus/pci -I../drivers/bus/pci -I../drivers/bus/pci/linux -Ilib/librte_pci -I../lib/librte_pci -Idrivers/bus/vdev -I../drivers/bus/vdev -Ilib/librte_cryptodev -I../lib/librte_cryptodev -Ilib/librte_eventdev -I../lib/librte_eventdev -Ilib/librte_hash -I../lib/librte_hash -Ilib/librte_timer -I../lib/librte_timer -Ilib/librte_security -I../lib/librte_security -Idrivers/common/octeontx2 -I../drivers/common/octeontx2 -Idrivers/common/octeontx2/../../common/octeontx2 -I../drivers/common/octeontx2/../../common/octeontx2 -Idrivers/common/octeontx2/../../mempool/octeontx2 -I../drivers/common/octeontx2/../../mempool/octeontx2 -Idrivers/common/octeontx2/../../bus/pci -I../drivers/common/octeontx2/../../bus/pci -Idrivers/mempool/octeontx2 -I../drivers/mempool/octeontx2 -fdiagnostics-color=always -pipe -D_FILE_OFFSET_BITS=64 -Wall -Winvalid-pch -Werror -O2 -g -include rte_config.h -Wextra -Wcast-qual -Wdeprecated -Wformat-nonliteral -Wformat-security -Wmissing-declarations -Wmissing-prototypes -Wnested-externs -Wold-style-definition -Wpointer-arith -Wsign-compare -Wstrict-prototypes -Wundef -Wwrite-strings -Wno-address-of-packed-member -Wno-packed-not-aligned -Wno-missing-field-initializers -D_GNU_SOURCE -fPIC -march=native -Wno-format-truncation -flax-vector-conversions -MD -MQ 'drivers/a715181@@tmp_rte_pmd_octeontx2@sta/net_octeontx2_otx2_tm.c.o' -MF 'drivers/a715181@@tmp_rte_pmd_octeontx2@sta/net_octeontx2_otx2_tm.c.o.d' -o 'drivers/a715181@@tmp_rte_pmd_octeontx2@sta/net_octeontx2_otx2_tm.c.o' -c ../drivers/net/octeontx2/otx2_tm.c
../drivers/net/octeontx2/otx2_tm.c: In function ‘populate_tm_reg’:
../drivers/net/octeontx2/otx2_tm.c:627:22: error: ‘struct nix_txschq_config’ has no member named ‘regval_mask’
  627 |  otx2_mbox_memcpy(req->regval_mask, regval_mask, sizeof(uint64_t) * k);
      |                      ^~
../drivers/net/octeontx2/otx2_tm.c: In function ‘nix_smq_xoff’:
../drivers/net/octeontx2/otx2_tm.c:876:5: error: ‘struct nix_txschq_config’ has no member named ‘regval_mask’
  876 |  req->regval_mask[0] = enable ?
      |     ^~
../drivers/net/octeontx2/otx2_tm.c: In function ‘read_tm_reg’:
../drivers/net/octeontx2/otx2_tm.c:1680:5: error: ‘volatile struct nix_txschq_config’ has no member named ‘read’
 1680 |  req->read = 1;
      |     ^~
[1166/2247] Compiling C object 'drivers/a715181@@tmp_rte_pmd_octeontx2@sta/net_octeontx2_otx2_ethdev_devargs.c.o'.
[1167/2247] Compiling C object 'drivers/a715181@@tmp_rte_pmd_octeontx2@sta/net_octeontx2_otx2_rss.c.o'.
[1168/2247] Generating rte_pmd_null.exp_chk with a meson_exe.py custom command.
[1169/2247] Generating rte_pmd_nfp.exp_chk with a meson_exe.py custom command.
[1170/2247] Generating rte_pmd_octeontx.exp_chk with a meson_exe.py custom command.
[1171/2247] Compiling C object 'drivers/a715181@@tmp_rte_pmd_octeontx2@sta/net_octeontx2_otx2_rx.c.o'.
[1172/2247] Compiling C object 'drivers/a715181@@tmp_rte_pmd_octeontx2@sta/net_octeontx2_otx2_tx.c.o'.
ninja: build stopped: subcommand failed




*Meson Build Failed #3:
OS: CENTOS77-64
Target:./build-gcc-static
FAILED: drivers/a715181@@tmp_rte_pmd_octeontx2@sta/net_octeontx2_otx2_tm.c.o 
gcc -Idrivers/a715181@@tmp_rte_pmd_octeontx2@sta -Idrivers -I../drivers -Idrivers/net/octeontx2 -I../drivers/net/octeontx2 -Idrivers/net/octeontx2/../../common/cpt -I../drivers/net/octeontx2/../../common/cpt -Idrivers/net/octeontx2/../../crypto/octeontx2 -I../drivers/net/octeontx2/../../crypto/octeontx2 -Ilib/librte_ethdev -I../lib/librte_ethdev -I. -I../ -Iconfig -I../config -Ilib/librte_eal/common/include -I../lib/librte_eal/common/include -I../lib/librte_eal/linux/eal/include -Ilib/librte_eal/common -I../lib/librte_eal/common -Ilib/librte_eal/common/include/arch/x86 -I../lib/librte_eal/common/include/arch/x86 -Ilib/librte_eal -I../lib/librte_eal -Ilib/librte_kvargs -I../lib/librte_kvargs -Ilib/librte_net -I../lib/librte_net -Ilib/librte_mbuf -I../lib/librte_mbuf -Ilib/librte_mempool -I../lib/librte_mempool -Ilib/librte_ring -I../lib/librte_ring -Ilib/librte_meter -I../lib/librte_meter -Idrivers/bus/pci -I../drivers/bus/pci -I../drivers/bus/pci/linux -Ilib/librte_pci -I../lib/librte_pci -Idrivers/bus/vdev -I../drivers/bus/vdev -Ilib/librte_cryptodev -I../lib/librte_cryptodev -Ilib/librte_eventdev -I../lib/librte_eventdev -Ilib/librte_hash -I../lib/librte_hash -Ilib/librte_timer -I../lib/librte_timer -Ilib/librte_security -I../lib/librte_security -Idrivers/common/octeontx2 -I../drivers/common/octeontx2 -Idrivers/common/octeontx2/../../common/octeontx2 -I../drivers/common/octeontx2/../../common/octeontx2 -Idrivers/common/octeontx2/../../mempool/octeontx2 -I../drivers/common/octeontx2/../../mempool/octeontx2 -Idrivers/common/octeontx2/../../bus/pci -I../drivers/common/octeontx2/../../bus/pci -Idrivers/mempool/octeontx2 -I../drivers/mempool/octeontx2 -pipe -D_FILE_OFFSET_BITS=64 -Wall -Winvalid-pch -Werror -O2 -g -include rte_config.h -Wextra -Wcast-qual -Wdeprecated -Wformat-nonliteral -Wformat-security -Wmissing-declarations -Wmissing-prototypes -Wnested-externs -Wold-style-definition -Wpointer-arith -Wsign-compare -Wstrict-prototypes -Wundef -Wwrite-strings -Wno-missing-field-initializers -D_GNU_SOURCE -fPIC -march=native -flax-vector-conversions -MD -MQ 'drivers/a715181@@tmp_rte_pmd_octeontx2@sta/net_octeontx2_otx2_tm.c.o' -MF 'drivers/a715181@@tmp_rte_pmd_octeontx2@sta/net_octeontx2_otx2_tm.c.o.d' -o 'drivers/a715181@@tmp_rte_pmd_octeontx2@sta/net_octeontx2_otx2_tm.c.o' -c ../drivers/net/octeontx2/otx2_tm.c
../drivers/net/octeontx2/otx2_tm.c: In function ‘populate_tm_reg’:
../drivers/net/octeontx2/otx2_tm.c:627:22: error: ‘struct nix_txschq_config’ has no member named ‘regval_mask’
  otx2_mbox_memcpy(req->regval_mask, regval_mask, sizeof(uint64_t) * k);
                      ^
../drivers/net/octeontx2/otx2_tm.c: In function ‘nix_smq_xoff’:
../drivers/net/octeontx2/otx2_tm.c:876:5: error: ‘struct nix_txschq_config’ has no member named ‘regval_mask’
  req->regval_mask[0] = enable ?
     ^
../drivers/net/octeontx2/otx2_tm.c: In function ‘read_tm_reg’:
../drivers/net/octeontx2/otx2_tm.c:1680:5: error: ‘volatile struct nix_txschq_config’ has no member named ‘read’
  req->read = 1;
     ^
[1153/2238] Generating rte_pmd_null.pmd.c with a custom command.
[1154/2238] Compiling C object 'drivers/a715181@@tmp_rte_pmd_octeontx2@sta/net_octeontx2_otx2_mac.c.o'.
[1155/2238] Compiling C object 'drivers/a715181@@tmp_rte_pmd_octeontx@sta/net_octeontx_octeontx_ethdev.c.o'.
[1156/2238] Compiling C object 'drivers/a715181@@tmp_rte_pmd_nfp@sta/net_nfp_nfp_net.c.o'.
[1157/2238] Compiling C object 'drivers/a715181@@tmp_rte_pmd_octeontx2@sta/net_octeontx2_otx2_tx.c.o'.
ninja: build stopped: subcommand failed




*Meson Build Failed #4:
OS: UB1804-64
Target:./build-gcc-static
FAILED: drivers/a715181@@tmp_rte_pmd_octeontx2@sta/net_octeontx2_otx2_tm.c.o 
gcc -Idrivers/a715181@@tmp_rte_pmd_octeontx2@sta -Idrivers -I../drivers -Idrivers/net/octeontx2 -I../drivers/net/octeontx2 -Idrivers/net/octeontx2/../../common/cpt -I../drivers/net/octeontx2/../../common/cpt -Idrivers/net/octeontx2/../../crypto/octeontx2 -I../drivers/net/octeontx2/../../crypto/octeontx2 -Ilib/librte_ethdev -I../lib/librte_ethdev -I. -I../ -Iconfig -I../config -Ilib/librte_eal/common/include -I../lib/librte_eal/common/include -I../lib/librte_eal/linux/eal/include -Ilib/librte_eal/common -I../lib/librte_eal/common -Ilib/librte_eal/common/include/arch/x86 -I../lib/librte_eal/common/include/arch/x86 -Ilib/librte_eal -I../lib/librte_eal -Ilib/librte_kvargs -I../lib/librte_kvargs -Ilib/librte_net -I../lib/librte_net -Ilib/librte_mbuf -I../lib/librte_mbuf -Ilib/librte_mempool -I../lib/librte_mempool -Ilib/librte_ring -I../lib/librte_ring -Ilib/librte_meter -I../lib/librte_meter -Idrivers/bus/pci -I../drivers/bus/pci -I../drivers/bus/pci/linux -Ilib/librte_pci -I../lib/librte_pci -Idrivers/bus/vdev -I../drivers/bus/vdev -Ilib/librte_cryptodev -I../lib/librte_cryptodev -Ilib/librte_eventdev -I../lib/librte_eventdev -Ilib/librte_hash -I../lib/librte_hash -Ilib/librte_timer -I../lib/librte_timer -Ilib/librte_security -I../lib/librte_security -Idrivers/common/octeontx2 -I../drivers/common/octeontx2 -Idrivers/common/octeontx2/../../common/octeontx2 -I../drivers/common/octeontx2/../../common/octeontx2 -Idrivers/common/octeontx2/../../mempool/octeontx2 -I../drivers/common/octeontx2/../../mempool/octeontx2 -Idrivers/common/octeontx2/../../bus/pci -I../drivers/common/octeontx2/../../bus/pci -Idrivers/mempool/octeontx2 -I../drivers/mempool/octeontx2 -fdiagnostics-color=always -pipe -D_FILE_OFFSET_BITS=64 -Wall -Winvalid-pch -Werror -O2 -g -include rte_config.h -Wextra -Wcast-qual -Wdeprecated -Wformat-nonliteral -Wformat-security -Wmissing-declarations -Wmissing-prototypes -Wnested-externs -Wold-style-definition -Wpointer-arith -Wsign-compare -Wstrict-prototypes -Wundef -Wwrite-strings -Wno-missing-field-initializers -D_GNU_SOURCE -fPIC -march=native -mno-avx512f -Wno-format-truncation -flax-vector-conversions -MD -MQ 'drivers/a715181@@tmp_rte_pmd_octeontx2@sta/net_octeontx2_otx2_tm.c.o' -MF 'drivers/a715181@@tmp_rte_pmd_octeontx2@sta/net_octeontx2_otx2_tm.c.o.d' -o 'drivers/a715181@@tmp_rte_pmd_octeontx2@sta/net_octeontx2_otx2_tm.c.o' -c ../drivers/net/octeontx2/otx2_tm.c
../drivers/net/octeontx2/otx2_tm.c: In function ‘populate_tm_reg’:
../drivers/net/octeontx2/otx2_tm.c:627:24: error: ‘struct nix_txschq_config’ has no member named ‘regval_mask’; did you mean ‘regval’?
  otx2_mbox_memcpy(req->regval_mask, regval_mask, sizeof(uint64_t) * k);
                        ^~~~~~~~~~~
                        regval
../drivers/net/octeontx2/otx2_tm.c: In function ‘nix_smq_xoff’:
../drivers/net/octeontx2/otx2_tm.c:876:7: error: ‘struct nix_txschq_config’ has no member named ‘regval_mask’; did you mean ‘regval’?
  req->regval_mask[0] = enable ?
       ^~~~~~~~~~~
       regval
../drivers/net/octeontx2/otx2_tm.c: In function ‘read_tm_reg’:
../drivers/net/octeontx2/otx2_tm.c:1680:7: error: ‘volatile struct nix_txschq_config’ has no member named ‘read’; did you mean ‘reg’?
  req->read = 1;
       ^~~~
       reg
[1175/2160] Generating symbol file 'drivers/a715181@@rte_pmd_octeontx@sha/librte_pmd_octeontx.so.20.0.1.symbols'.
[1176/2160] Compiling C object 'drivers/a715181@@tmp_rte_pmd_octeontx2@sta/net_octeontx2_otx2_rss.c.o'.
[1177/2160] Compiling C object 'drivers/a715181@@tmp_rte_pmd_octeontx2@sta/net_octeontx2_otx2_mac.c.o'.
[1178/2160] Compiling C object 'drivers/a715181@@tmp_rte_pmd_octeontx2@sta/net_octeontx2_otx2_rx.c.o'.
[1179/2160] Compiling C object 'drivers/a715181@@tmp_rte_pmd_octeontx2@sta/net_octeontx2_otx2_tx.c.o'.
ninja: build stopped: subcommand failed




*Meson Build Failed #5:
OS: SUSE15-64
Target:./build-gcc-static
FAILED: drivers/a715181@@tmp_rte_pmd_octeontx2@sta/net_octeontx2_otx2_tm.c.o 
gcc -Idrivers/a715181@@tmp_rte_pmd_octeontx2@sta -Idrivers -I../drivers -Idrivers/net/octeontx2 -I../drivers/net/octeontx2 -Idrivers/net/octeontx2/../../common/cpt -I../drivers/net/octeontx2/../../common/cpt -Idrivers/net/octeontx2/../../crypto/octeontx2 -I../drivers/net/octeontx2/../../crypto/octeontx2 -Ilib/librte_ethdev -I../lib/librte_ethdev -I. -I../ -Iconfig -I../config -Ilib/librte_eal/common/include -I../lib/librte_eal/common/include -I../lib/librte_eal/linux/eal/include -Ilib/librte_eal/common -I../lib/librte_eal/common -Ilib/librte_eal/common/include/arch/x86 -I../lib/librte_eal/common/include/arch/x86 -Ilib/librte_eal -I../lib/librte_eal -Ilib/librte_kvargs -I../lib/librte_kvargs -Ilib/librte_net -I../lib/librte_net -Ilib/librte_mbuf -I../lib/librte_mbuf -Ilib/librte_mempool -I../lib/librte_mempool -Ilib/librte_ring -I../lib/librte_ring -Ilib/librte_meter -I../lib/librte_meter -Idrivers/bus/pci -I../drivers/bus/pci -I../drivers/bus/pci/linux -Ilib/librte_pci -I../lib/librte_pci -Idrivers/bus/vdev -I../drivers/bus/vdev -Ilib/librte_cryptodev -I../lib/librte_cryptodev -Ilib/librte_eventdev -I../lib/librte_eventdev -Ilib/librte_hash -I../lib/librte_hash -Ilib/librte_timer -I../lib/librte_timer -Ilib/librte_security -I../lib/librte_security -Idrivers/common/octeontx2 -I../drivers/common/octeontx2 -Idrivers/common/octeontx2/../../common/octeontx2 -I../drivers/common/octeontx2/../../common/octeontx2 -Idrivers/common/octeontx2/../../mempool/octeontx2 -I../drivers/common/octeontx2/../../mempool/octeontx2 -Idrivers/common/octeontx2/../../bus/pci -I../drivers/common/octeontx2/../../bus/pci -Idrivers/mempool/octeontx2 -I../drivers/mempool/octeontx2 -fdiagnostics-color=always -pipe -D_FILE_OFFSET_BITS=64 -Wall -Winvalid-pch -Werror -O2 -g -include rte_config.h -Wextra -Wcast-qual -Wdeprecated -Wformat-nonliteral -Wformat-security -Wmissing-declarations -Wmissing-prototypes -Wnested-externs -Wold-style-definition -Wpointer-arith -Wsign-compare -Wstrict-prototypes -Wundef -Wwrite-strings -Wno-missing-field-initializers -D_GNU_SOURCE -fPIC -march=native -Wno-format-truncation -flax-vector-conversions -MD -MQ 'drivers/a715181@@tmp_rte_pmd_octeontx2@sta/net_octeontx2_otx2_tm.c.o' -MF 'drivers/a715181@@tmp_rte_pmd_octeontx2@sta/net_octeontx2_otx2_tm.c.o.d' -o 'drivers/a715181@@tmp_rte_pmd_octeontx2@sta/net_octeontx2_otx2_tm.c.o' -c ../drivers/net/octeontx2/otx2_tm.c
../drivers/net/octeontx2/otx2_tm.c: In function ‘populate_tm_reg’:
../drivers/net/octeontx2/otx2_tm.c:627:24: error: ‘struct nix_txschq_config’ has no member named ‘regval_mask’; did you mean ‘regval’?
  otx2_mbox_memcpy(req->regval_mask, regval_mask, sizeof(uint64_t) * k);
                        ^~~~~~~~~~~
                        regval
../drivers/net/octeontx2/otx2_tm.c: In function ‘nix_smq_xoff’:
../drivers/net/octeontx2/otx2_tm.c:876:7: error: ‘struct nix_txschq_config’ has no member named ‘regval_mask’; did you mean ‘regval’?
  req->regval_mask[0] = enable ?
       ^~~~~~~~~~~
       regval
../drivers/net/octeontx2/otx2_tm.c: In function ‘read_tm_reg’:
../drivers/net/octeontx2/otx2_tm.c:1680:7: error: ‘volatile struct nix_txschq_config’ has no member named ‘read’; did you mean ‘reg’?
  req->read = 1;
       ^~~~
       reg
[1168/2150] Compiling C object 'drivers/a715181@@tmp_rte_pmd_octeontx2@sta/net_octeontx2_otx2_rss.c.o'.
[1169/2150] Generating rte_pmd_nfp.exp_chk with a meson_exe.py custom command.
[1170/2150] Compiling C object 'drivers/a715181@@tmp_rte_pmd_octeontx2@sta/net_octeontx2_otx2_mac.c.o'.
[1171/2150] Generating rte_pmd_octeontx.exp_chk with a meson_exe.py custom command.
[1172/2150] Generating rte_pmd_null.exp_chk with a meson_exe.py custom command.
[1173/2150] Compiling C object 'drivers/a715181@@tmp_rte_pmd_octeontx2@sta/net_octeontx2_otx2_rx.c.o'.
[1174/2150] Compiling C object 'drivers/a715181@@tmp_rte_pmd_octeontx2@sta/net_octeontx2_otx2_tx.c.o'.
ninja: build stopped: subcommand failed




*Meson Build Failed #6:
OS: FreeBSD1201-64
Target:./build-gcc-static
FAILED: drivers/a715181@@tmp_rte_pmd_octeontx2@sta/net_octeontx2_otx2_tm.c.o 
gcc -Idrivers/a715181@@tmp_rte_pmd_octeontx2@sta -Idrivers -I../drivers -Idrivers/net/octeontx2 -I../drivers/net/octeontx2 -Idrivers/net/octeontx2/../../common/cpt -I../drivers/net/octeontx2/../../common/cpt -Idrivers/net/octeontx2/../../crypto/octeontx2 -I../drivers/net/octeontx2/../../crypto/octeontx2 -Ilib/librte_ethdev -I../lib/librte_ethdev -I. -I../ -Iconfig -I../config -Ilib/librte_eal/common/include -I../lib/librte_eal/common/include -I../lib/librte_eal/freebsd/eal/include -Ilib/librte_eal/common -I../lib/librte_eal/common -Ilib/librte_eal/common/include/arch/x86 -I../lib/librte_eal/common/include/arch/x86 -Ilib/librte_eal -I../lib/librte_eal -Ilib/librte_kvargs -I../lib/librte_kvargs -Ilib/librte_net -I../lib/librte_net -Ilib/librte_mbuf -I../lib/librte_mbuf -Ilib/librte_mempool -I../lib/librte_mempool -Ilib/librte_ring -I../lib/librte_ring -Ilib/librte_meter -I../lib/librte_meter -Idrivers/bus/pci -I../drivers/bus/pci -I../drivers/bus/pci/bsd -Ilib/librte_pci -I../lib/librte_pci -Idrivers/bus/vdev -I../drivers/bus/vdev -Ilib/librte_cryptodev -I../lib/librte_cryptodev -Ilib/librte_eventdev -I../lib/librte_eventdev -Ilib/librte_hash -I../lib/librte_hash -Ilib/librte_timer -I../lib/librte_timer -Ilib/librte_security -I../lib/librte_security -Idrivers/common/octeontx2 -I../drivers/common/octeontx2 -Idrivers/common/octeontx2/../../common/octeontx2 -I../drivers/common/octeontx2/../../common/octeontx2 -Idrivers/common/octeontx2/../../mempool/octeontx2 -I../drivers/common/octeontx2/../../mempool/octeontx2 -Idrivers/common/octeontx2/../../bus/pci -I../drivers/common/octeontx2/../../bus/pci -Idrivers/mempool/octeontx2 -I../drivers/mempool/octeontx2 -fdiagnostics-color=always -pipe -D_FILE_OFFSET_BITS=64 -Wall -Winvalid-pch -Werror -O2 -g -include rte_config.h -Wextra -Wcast-qual -Wdeprecated -Wformat-nonliteral -Wformat-security -Wmissing-declarations -Wmissing-prototypes -Wnested-externs -Wold-style-definition -Wpointer-arith -Wsign-compare -Wstrict-prototypes -Wundef -Wwrite-strings -Wno-address-of-packed-member -Wno-packed-not-aligned -Wno-missing-field-initializers -D_GNU_SOURCE -D__BSD_VISIBLE -fPIC -march=native -Wno-format-truncation -flax-vector-conversions -MD -MQ 'drivers/a715181@@tmp_rte_pmd_octeontx2@sta/net_octeontx2_otx2_tm.c.o' -MF 'drivers/a715181@@tmp_rte_pmd_octeontx2@sta/net_octeontx2_otx2_tm.c.o.d' -o 'drivers/a715181@@tmp_rte_pmd_octeontx2@sta/net_octeontx2_otx2_tm.c.o' -c ../drivers/net/octeontx2/otx2_tm.c
../drivers/net/octeontx2/otx2_tm.c: In function 'populate_tm_reg':
../drivers/net/octeontx2/otx2_tm.c:627:22: error: 'struct nix_txschq_config' has no member named 'regval_mask'
  627 |  otx2_mbox_memcpy(req->regval_mask, regval_mask, sizeof(uint64_t) * k);
      |                      ^~
../drivers/net/octeontx2/otx2_tm.c: In function 'nix_smq_xoff':
../drivers/net/octeontx2/otx2_tm.c:876:5: error: 'struct nix_txschq_config' has no member named 'regval_mask'
  876 |  req->regval_mask[0] = enable ?
      |     ^~
../drivers/net/octeontx2/otx2_tm.c: In function 'read_tm_reg':
../drivers/net/octeontx2/otx2_tm.c:1680:5: error: 'volatile struct nix_txschq_config' has no member named 'read'
 1680 |  req->read = 1;
      |     ^~
[883/1639] Compiling C object 'drivers/a715181@@tmp_rte_pmd_octeontx2@sta/net_octeontx2_otx2_rss.c.o'.
[884/1639] Generating rte_pmd_ixgbe.pmd.c with a custom command.
[885/1639] Compiling C object 'drivers/a715181@@tmp_rte_pmd_octeontx2@sta/net_octeontx2_otx2_mac.c.o'.
[886/1639] Compiling C object 'drivers/a715181@@tmp_rte_pmd_octeontx2@sta/net_octeontx2_otx2_rx.c.o'.
[887/1639] Compiling C object 'drivers/a715181@@tmp_rte_pmd_octeontx2@sta/net_octeontx2_otx2_tx.c.o'.
ninja: build stopped: subcommand failed



DPDK STV team

^ permalink raw reply	[flat|nested] only message in thread

only message in thread, other threads:[~2020-03-12 11:59 UTC | newest]

Thread overview: (only message) (download: mbox.gz / follow: Atom feed)
-- links below jump to the message on this page --
2020-03-12 11:59 [dpdk-test-report] |FAILURE| pw66576[01/11] net/octeontx2: setup link config based on BP level sys_stv

automatic DPDK test reports

This inbox may be cloned and mirrored by anyone:

	git clone --mirror http://inbox.dpdk.org/test-report/0 test-report/git/0.git

	# If you have public-inbox 1.1+ installed, you may
	# initialize and index your mirror using the following commands:
	public-inbox-init -V2 test-report test-report/ http://inbox.dpdk.org/test-report \
		test-report@dpdk.org
	public-inbox-index test-report

Example config snippet for mirrors.
Newsgroup available over NNTP:
	nntp://inbox.dpdk.org/inbox.dpdk.test-report


AGPL code for this site: git clone https://public-inbox.org/public-inbox.git