automatic DPDK test reports
 help / color / mirror / Atom feed
* [dpdk-test-report]  |FAILURE| pw66643[v1, 1/7] net/virtio: add Rx free threshold setting
@ 2020-03-13 11:11 sys_stv
  0 siblings, 0 replies; only message in thread
From: sys_stv @ 2020-03-13 11:11 UTC (permalink / raw)
  To: test-report

[-- Attachment #1: Type: text/plain, Size: 202754 bytes --]

Test-Label: Intel-compilation
Test-Status: FAILURE
http://dpdk.org/patch/66643

_Compilation issues_

Submitter: Marvin Liu <yong.liu@intel.com>
Date: 2020-03-13 17:42:24
Reply_mail: 20200313174230.74661-2-yong.liu@intel.com
DPDK git baseline: Repo:dpdk-next-virtio, CommitID: 545cd4f422ecc60e0470d0576deb29291f0ff9b9

Makefile build Summary: 23 Builds Done, 6 Successful, 17 Failures

Meson build Summary: 8 Builds Done, 2 Successful, 6 Failures

               +==============================================+===========+==========+
               |                   Makefile                   |   Meson   | Document |
+----------------+------+-------+------+------------+-----------+-----------+----------+
| os             | gcc  | clang | icc  | gcc+shared | gcc+debug | gcc/clang | pdf/html |
+----------------+------+-------+------+------------+-----------+-----------+----------+
| RHEL80-64      | FAIL |       |      |            |           |           |          |
| UB1804-64      | FAIL | FAIL  | pass |            |           | FAIL      | pass     |
| UB1604-32      | FAIL |       |      |            |           | FAIL      |          |
| CENTOS77-64    | pass | FAIL  | pass | pass       | pass      | FAIL      |          |
| UB1604-64      | FAIL | FAIL  |      |            |           |           |          |
| WIN10-64       |      |       |      |            |           | pass      |          |
| UB1910-64      | FAIL |       |      |            |           |           |          |
| FC31-64        | FAIL | FAIL  |      |            |           | FAIL      |          |
| CENTOS80-64    | FAIL |       |      |            |           |           |          |
| FreeBSD1201-64 | FAIL | FAIL  |      | FAIL       | FAIL      | FAIL      |          |
| RHEL77-64      | pass |       |      |            |           |           |          |
| SUSE15-64      | FAIL | FAIL  |      |            |           | FAIL      |          |
+----------------+------+-------+------+------------+-----------+-----------+----------+

Test environment and configuration as below:

** Makefile build **


OS: UB1804-64
	Kernel Version: 4.15.0-20-generic
	CPU info: Intel(R) Xeon(R) CPU E5-2699 v3 @ 2.30GHz
	GCC Version: gcc (Ubuntu 7.3.0-16ubuntu3) 7.3.0
	Clang Version: 6.0.0-1ubuntu2 (tags/RELEASE_600/final)
	x86_64-native-linuxapp-clang
	x86_64-native-linuxapp-icc
	x86_64-native-linuxapp-gcc


OS: UB1604-32
	Kernel Version: 4.4.0-131-generic
	CPU info: Intel(R) Xeon(R) CPU E5-2699 v3 @ 2.30GHz
	GCC Version: gcc (Ubuntu 5.4.0-6ubuntu1~16.04.11) 5.4.0 20160609
	Clang Version: 3.8.0-2ubuntu4 (tags/RELEASE_380/final)
	i686-native-linuxapp-gcc


OS: CENTOS77-64
	Kernel Version: 3.10.0-1062.9.1.el7.x86_64
	CPU info: Intel(R) Xeon(R) CPU E5-2699 v3 @ 2.30GHz
	GCC Version: gcc (GCC) 4.8.5 20150623 (Red Hat 4.8.5-39)
	Clang Version: 3.4.2 (tags/RELEASE_34/dot2-final)
	x86_64-native-linuxapp-clang
	x86_64-native-linuxapp-gcc
	x86_64-native-linuxapp-gcc+shared
	x86_64-native-linuxapp-gcc+debug
	x86_64-native-linuxapp-icc


OS: UB1910-64
	Kernel Version: 5.3.0-18-generic
	CPU info: Intel(R) Xeon(R) CPU E5-2699 v3 @ 2.30GHz
	GCC Version: gcc (Ubuntu 9.2.1-9ubuntu2) 9.2.1 20191008
	Clang Version: 9.0.0-2 (tags/RELEASE_900/final)
	x86_64-native-linuxapp-gcc


OS: CENTOS80-64
	Kernel Version: 4.18.0-80.11.2.el8_0.x86_64
	CPU info: Intel(R) Xeon(R) CPU E5-2699 v3 @ 2.30GHz
	GCC Version: gcc (GCC) 8.2.1 20180905 (Red Hat 8.2.1-3)
	Clang Version: 7.0.1 (tags/RELEASE_701/final)
	x86_64-native-linuxapp-gcc


OS: UB1604-64
	Kernel Version: 4.4.0-170-generic
	CPU info: Intel(R) Xeon(R) CPU E5-2699 v3 @ 2.30GHz
	GCC Version: gcc (Ubuntu 5.4.0-6ubuntu1~16.04.12) 5.4.0 20160609
	Clang Version: 3.8.0-2ubuntu4 (tags/RELEASE_380/final)
	x86_64-native-linuxapp-clang
	x86_64-native-linuxapp-gcc


OS: FC31-64
	Kernel Version: 5.3.15-300.fc31.x86_64
	CPU info: Intel(R) Xeon(R) CPU E5-2699 v4 @ 2.20GHz
	GCC Version: gcc (GCC) 9.2.1 20190827 (Red Hat 9.2.1-1)
	Clang Version: 9.0.0 (Fedora 9.0.0-1.fc31)
	x86_64-native-linuxapp-gcc
	x86_64-native-linuxapp-clang


OS: RHEL80-64
	Kernel Version: 4.18.0-80.el8.x86_64
	CPU info: Intel(R) Xeon(R) CPU E5-2699 v4 @ 2.20GHz
	GCC Version: gcc (GCC) 8.2.1 20180905 (Red Hat 8.2.1-3)
	Clang Version: 6.0.1 (tags/RELEASE_601/final)
	x86_64-native-linuxapp-gcc


OS: FreeBSD1201-64
	Kernel Version: 12.1-RELEASE
	CPU info: Intel(R) Xeon(R) CPU E5-2699 v4 @ 2.20GHz (2194.96-MHz K8-class CPU)
	GCC Version: gcc (FreeBSD Ports Collection) 9.2.0
	Clang Version: 8.0.1 (tags/RELEASE_801/final 366581) (based on LLVM 8.0.1)
	x86_64-native-bsdapp-clang
	x86_64-native-bsdapp-gcc
	x86_64-native-bsdapp-gcc+debug
	x86_64-native-bsdapp-gcc+shared


OS: RHEL77-64
	Kernel Version: 3.10.0-1062.9.1.el7.x86_64
	CPU info: Intel(R) Xeon(R) CPU E5-2699 v4 @ 2.20GHz
	GCC Version: gcc (GCC) 4.8.5 20150623 (Red Hat 4.8.5-39)
	Clang Version: 3.4.2 (tags/RELEASE_34/dot2-final)
	x86_64-native-linuxapp-gcc


OS: SUSE15-64
	Kernel Version: 4.12.14-lp150.11-default
	CPU info: Intel(R) Xeon(R) CPU E5-2699 v4 @ 2.20GHz
	GCC Version: gcc (SUSE Linux) 7.3.1 20180323 [gcc-7-branch revision 258812]
	Clang Version: 5.0.1 (tags/RELEASE_501/final 312548)
	x86_64-native-linuxapp-gcc
	x86_64-native-linuxapp-clang


** Meson build **


OS: UB1804-64
	Kernel Version: 4.15.0-20-generic
	CPU info: Intel(R) Xeon(R) CPU E5-2699 v4 @ 2.20GHz
	GCC Version: gcc (Ubuntu 7.3.0-27ubuntu1~18.04) 7.3.0
	Clang Version: 6.0.0-1ubuntu2 (tags/RELEASE_600/final)
	x86_64-native-linuxapp-doc
	./build-gcc-static
	./build-gcc-shared
	./build-clang-static
	./build-clang-shared
	./build-x86-default


OS: UB1604-32
	Kernel Version: 4.4.0-131-generic
	CPU info: Intel(R) Xeon(R) CPU E5-2699 v4 @ 2.20GHz
	GCC Version: gcc (Ubuntu 5.4.0-6ubuntu1~16.04.11) 5.4.0 20160609
	Clang Version: 3.8.0-2ubuntu4 (tags/RELEASE_380/final)
	./build-gcc-static
	./build-gcc-shared
	./build-clang-static
	./build-clang-shared
	./build-x86-default


OS: CENTOS77-64
	Kernel Version: 3.10.0-1062.12.1.el7.x86_64
	CPU info: Intel(R) Xeon(R) CPU E5-2699 v4 @ 2.20GHz
	GCC Version: gcc (GCC) 4.8.5 20150623 (Red Hat 4.8.5-39)
	Clang Version: 3.4.2 (tags/RELEASE_34/dot2-final)
	./build-gcc-static
	./build-gcc-shared
	./build-clang-static
	./build-clang-shared
	./build-x86-default


OS: WIN10-64
	Kernel Version: N/A
	CPU info: N/A
	GCC Version: N/A
	Clang Version: Clang 8.0.0
	x86_64-windows-clang


OS: FC31-64
	Kernel Version: 5.4.18-200.fc31.x86_64
	CPU info: Intel(R) Xeon(R) CPU E5-2699 v4 @ 2.20GHz
	GCC Version: gcc (GCC) 9.2.1 20190827 (Red Hat 9.2.1-1)
	Clang Version: 9.0.0 (Fedora 9.0.0-1.fc31)
	./build-gcc-static
	./build-gcc-shared
	./build-clang-static
	./build-clang-shared
	./build-x86-default


OS: FreeBSD1201-64
	Kernel Version: 12.1-RELEASE
	CPU info: Intel(R) Xeon(R) CPU E5-2699 v4 @ 2.20GHz (2194.97-MHz K8-class CPU)
	GCC Version: gcc (FreeBSD Ports Collection) 9.2.0
	Clang Version: 8.0.1 (tags/RELEASE_801/final 366581) (based on LLVM 8.0.1)
	./build-gcc-static
	./build-gcc-shared
	./build-clang-static
	./build-clang-shared
	./build-x86-default


OS: SUSE15-64
	Kernel Version: 4.12.14-lp150.12.82-default
	CPU info: Intel(R) Xeon(R) CPU E5-2699 v4 @ 2.20GHz
	GCC Version: gcc (SUSE Linux) 7.4.1 20190905 [gcc-7-branch revision 275407]
	Clang Version: 5.0.1 (tags/RELEASE_501/final 312548)
	./build-gcc-static
	./build-gcc-shared
	./build-clang-static
	./build-clang-shared
	./build-x86-default


*Make Build Failed #1:
OS: UB1604-64
Target: x86_64-native-linuxapp-clang
                ^                 ~~~~~~~~~~~~~~~~~
/root/UB1604-64_K4.4.0_Clang3.8.0/x86_64-native-linuxapp-clang/fdd2452bc8d44f2bbc2f919d9f93ff17/dpdk/drivers/net/virtio/virtio_rxtx_packed_avx.c:422:2: warning: implicit declaration of function '_mm512_i64scatter_epi64' is invalid in C99 [-Wimplicit-function-declaration]
        _mm512_i64scatter_epi64(0, vindex, value, 1);
        ^
6 warnings and 9 errors generated.
/root/UB1604-64_K4.4.0_Clang3.8.0/x86_64-native-linuxapp-clang/fdd2452bc8d44f2bbc2f919d9f93ff17/dpdk/mk/internal/rte.compile-pre.mk:114: recipe for target 'virtio_rxtx_packed_avx.o' failed
make[6]: *** [virtio_rxtx_packed_avx.o] Error 1
make[6]: *** Waiting for unfinished jobs....
  CC rte_eth_softnic_thread.o
  CC otx2_flow_ctrl.o
  CC otx2_flow_parse.o
/root/UB1604-64_K4.4.0_Clang3.8.0/x86_64-native-linuxapp-clang/fdd2452bc8d44f2bbc2f919d9f93ff17/dpdk/mk/rte.subdir.mk:35: recipe for target 'virtio' failed
make[5]: *** [virtio] Error 2
make[5]: *** Waiting for unfinished jobs....
  CC otx2_flow_utils.o
  CC otx2_ethdev_irq.o
  CC otx2_ethdev_ops.o
  CC otx2_ethdev_sec.o
--
  CC conn.o
  AR librte_pmd_octeontx2.a
  INSTALL-LIB librte_pmd_octeontx2.a
  AR librte_pmd_softnic.a
  INSTALL-LIB librte_pmd_softnic.a
/root/UB1604-64_K4.4.0_Clang3.8.0/x86_64-native-linuxapp-clang/fdd2452bc8d44f2bbc2f919d9f93ff17/dpdk/mk/rte.subdir.mk:35: recipe for target 'net' failed
make[4]: *** [net] Error 2
/root/UB1604-64_K4.4.0_Clang3.8.0/x86_64-native-linuxapp-clang/fdd2452bc8d44f2bbc2f919d9f93ff17/dpdk/mk/rte.sdkbuild.mk:46: recipe for target 'drivers' failed
make[3]: *** [drivers] Error 2
/root/UB1604-64_K4.4.0_Clang3.8.0/x86_64-native-linuxapp-clang/fdd2452bc8d44f2bbc2f919d9f93ff17/dpdk/mk/rte.sdkroot.mk:98: recipe for target 'all' failed
make[2]: *** [all] Error 2
/root/UB1604-64_K4.4.0_Clang3.8.0/x86_64-native-linuxapp-clang/fdd2452bc8d44f2bbc2f919d9f93ff17/dpdk/mk/rte.sdkinstall.mk:60: recipe for target 'pre_install' failed
make[1]: *** [pre_install] Error 2
/root/UB1604-64_K4.4.0_Clang3.8.0/x86_64-native-linuxapp-clang/fdd2452bc8d44f2bbc2f919d9f93ff17/dpdk/mk/rte.sdkroot.mk:77: recipe for target 'install' failed
make: *** [install] Error 2


*Make Build Failed #2:
OS: UB1604-32
Target: i686-native-linuxapp-gcc
                 from /root/UB1604-32_K4.4.0_GCC5.4.0/i686-native-linuxapp-gcc/fdd2452bc8d44f2bbc2f919d9f93ff17/dpdk/i686-native-linuxapp-gcc/include/rte_mempool.h:51,
                 from /root/UB1604-32_K4.4.0_GCC5.4.0/i686-native-linuxapp-gcc/fdd2452bc8d44f2bbc2f919d9f93ff17/dpdk/i686-native-linuxapp-gcc/include/rte_mbuf.h:38,
                 from /root/UB1604-32_K4.4.0_GCC5.4.0/i686-native-linuxapp-gcc/fdd2452bc8d44f2bbc2f919d9f93ff17/dpdk/i686-native-linuxapp-gcc/include/rte_ip.h:24,
                 from /root/UB1604-32_K4.4.0_GCC5.4.0/i686-native-linuxapp-gcc/fdd2452bc8d44f2bbc2f919d9f93ff17/dpdk/i686-native-linuxapp-gcc/include/rte_net.h:12,
                 from /root/UB1604-32_K4.4.0_GCC5.4.0/i686-native-linuxapp-gcc/fdd2452bc8d44f2bbc2f919d9f93ff17/dpdk/drivers/net/virtio/virtio_rxtx_packed_avx.c:11:
/usr/lib/gcc/i686-linux-gnu/5/include/avx512vlbwintrin.h:3644:1: error: inlining failed in call to always_inline ‘_mm256_cmpneq_epu16_mask’: target specific option mismatch
 _mm256_cmpneq_epu16_mask (__m256i __X, __m256i __Y)
 ^
/root/UB1604-32_K4.4.0_GCC5.4.0/i686-native-linuxapp-gcc/fdd2452bc8d44f2bbc2f919d9f93ff17/dpdk/drivers/net/virtio/virtio_rxtx_packed_avx.c:132:11: error: called from here
  uint16_t cmp = _mm256_cmpneq_epu16_mask(mbufs, mbuf_ref);
           ^
--
                 from /root/UB1604-32_K4.4.0_GCC5.4.0/i686-native-linuxapp-gcc/fdd2452bc8d44f2bbc2f919d9f93ff17/dpdk/i686-native-linuxapp-gcc/include/rte_mempool.h:51,
                 from /root/UB1604-32_K4.4.0_GCC5.4.0/i686-native-linuxapp-gcc/fdd2452bc8d44f2bbc2f919d9f93ff17/dpdk/i686-native-linuxapp-gcc/include/rte_mbuf.h:38,
                 from /root/UB1604-32_K4.4.0_GCC5.4.0/i686-native-linuxapp-gcc/fdd2452bc8d44f2bbc2f919d9f93ff17/dpdk/i686-native-linuxapp-gcc/include/rte_ip.h:24,
                 from /root/UB1604-32_K4.4.0_GCC5.4.0/i686-native-linuxapp-gcc/fdd2452bc8d44f2bbc2f919d9f93ff17/dpdk/i686-native-linuxapp-gcc/include/rte_net.h:12,
                 from /root/UB1604-32_K4.4.0_GCC5.4.0/i686-native-linuxapp-gcc/fdd2452bc8d44f2bbc2f919d9f93ff17/dpdk/drivers/net/virtio/virtio_rxtx_packed_avx.c:11:
/usr/lib/gcc/i686-linux-gnu/5/include/avx512vlbwintrin.h:3644:1: error: inlining failed in call to always_inline ‘_mm256_cmpneq_epu16_mask’: target specific option mismatch
 _mm256_cmpneq_epu16_mask (__m256i __X, __m256i __Y)
 ^
/root/UB1604-32_K4.4.0_GCC5.4.0/i686-native-linuxapp-gcc/fdd2452bc8d44f2bbc2f919d9f93ff17/dpdk/drivers/net/virtio/virtio_rxtx_packed_avx.c:132:11: error: called from here
  uint16_t cmp = _mm256_cmpneq_epu16_mask(mbufs, mbuf_ref);
           ^
--
                 from /root/UB1604-32_K4.4.0_GCC5.4.0/i686-native-linuxapp-gcc/fdd2452bc8d44f2bbc2f919d9f93ff17/dpdk/i686-native-linuxapp-gcc/include/rte_mempool.h:51,
                 from /root/UB1604-32_K4.4.0_GCC5.4.0/i686-native-linuxapp-gcc/fdd2452bc8d44f2bbc2f919d9f93ff17/dpdk/i686-native-linuxapp-gcc/include/rte_mbuf.h:38,
                 from /root/UB1604-32_K4.4.0_GCC5.4.0/i686-native-linuxapp-gcc/fdd2452bc8d44f2bbc2f919d9f93ff17/dpdk/i686-native-linuxapp-gcc/include/rte_ip.h:24,
                 from /root/UB1604-32_K4.4.0_GCC5.4.0/i686-native-linuxapp-gcc/fdd2452bc8d44f2bbc2f919d9f93ff17/dpdk/i686-native-linuxapp-gcc/include/rte_net.h:12,
                 from /root/UB1604-32_K4.4.0_GCC5.4.0/i686-native-linuxapp-gcc/fdd2452bc8d44f2bbc2f919d9f93ff17/dpdk/drivers/net/virtio/virtio_rxtx_packed_avx.c:11:
/usr/lib/gcc/i686-linux-gnu/5/include/avx512fintrin.h:60:1: error: inlining failed in call to always_inline ‘_mm512_set_epi64’: target specific option mismatch
 _mm512_set_epi64 (long long __A, long long __B, long long __C,
 ^
/root/UB1604-32_K4.4.0_GCC5.4.0/i686-native-linuxapp-gcc/fdd2452bc8d44f2bbc2f919d9f93ff17/dpdk/drivers/net/virtio/virtio_rxtx_packed_avx.c:152:10: error: called from here
  __m512i new_descs = _mm512_set_epi64(
          ^
--
                 from /root/UB1604-32_K4.4.0_GCC5.4.0/i686-native-linuxapp-gcc/fdd2452bc8d44f2bbc2f919d9f93ff17/dpdk/i686-native-linuxapp-gcc/include/rte_mempool.h:51,
                 from /root/UB1604-32_K4.4.0_GCC5.4.0/i686-native-linuxapp-gcc/fdd2452bc8d44f2bbc2f919d9f93ff17/dpdk/i686-native-linuxapp-gcc/include/rte_mbuf.h:38,
                 from /root/UB1604-32_K4.4.0_GCC5.4.0/i686-native-linuxapp-gcc/fdd2452bc8d44f2bbc2f919d9f93ff17/dpdk/i686-native-linuxapp-gcc/include/rte_ip.h:24,
                 from /root/UB1604-32_K4.4.0_GCC5.4.0/i686-native-linuxapp-gcc/fdd2452bc8d44f2bbc2f919d9f93ff17/dpdk/i686-native-linuxapp-gcc/include/rte_net.h:12,
                 from /root/UB1604-32_K4.4.0_GCC5.4.0/i686-native-linuxapp-gcc/fdd2452bc8d44f2bbc2f919d9f93ff17/dpdk/drivers/net/virtio/virtio_rxtx_packed_avx.c:11:
/usr/lib/gcc/i686-linux-gnu/5/include/avx512fintrin.h:5818:1: error: inlining failed in call to always_inline ‘_mm512_storeu_si512’: target specific option mismatch
 _mm512_storeu_si512 (void *__P, __m512i __A)
 ^
/root/UB1604-32_K4.4.0_GCC5.4.0/i686-native-linuxapp-gcc/fdd2452bc8d44f2bbc2f919d9f93ff17/dpdk/drivers/net/virtio/virtio_rxtx_packed_avx.c:172:2: error: called from here
  _mm512_storeu_si512((void *)&vq->vq_packed.ring.desc[idx], new_descs);
  ^
--
                 from /root/UB1604-32_K4.4.0_GCC5.4.0/i686-native-linuxapp-gcc/fdd2452bc8d44f2bbc2f919d9f93ff17/dpdk/i686-native-linuxapp-gcc/include/rte_mempool.h:51,
                 from /root/UB1604-32_K4.4.0_GCC5.4.0/i686-native-linuxapp-gcc/fdd2452bc8d44f2bbc2f919d9f93ff17/dpdk/i686-native-linuxapp-gcc/include/rte_mbuf.h:38,
                 from /root/UB1604-32_K4.4.0_GCC5.4.0/i686-native-linuxapp-gcc/fdd2452bc8d44f2bbc2f919d9f93ff17/dpdk/i686-native-linuxapp-gcc/include/rte_ip.h:24,
                 from /root/UB1604-32_K4.4.0_GCC5.4.0/i686-native-linuxapp-gcc/fdd2452bc8d44f2bbc2f919d9f93ff17/dpdk/i686-native-linuxapp-gcc/include/rte_net.h:12,
                 from /root/UB1604-32_K4.4.0_GCC5.4.0/i686-native-linuxapp-gcc/fdd2452bc8d44f2bbc2f919d9f93ff17/dpdk/drivers/net/virtio/virtio_rxtx_packed_avx.c:11:
/usr/lib/gcc/i686-linux-gnu/5/include/avx512vlbwintrin.h:3644:1: error: inlining failed in call to always_inline ‘_mm256_cmpneq_epu16_mask’: target specific option mismatch
 _mm256_cmpneq_epu16_mask (__m256i __X, __m256i __Y)
 ^
/root/UB1604-32_K4.4.0_GCC5.4.0/i686-native-linuxapp-gcc/fdd2452bc8d44f2bbc2f919d9f93ff17/dpdk/drivers/net/virtio/virtio_rxtx_packed_avx.c:132:11: error: called from here
  uint16_t cmp = _mm256_cmpneq_epu16_mask(mbufs, mbuf_ref);
           ^
--
                 from /root/UB1604-32_K4.4.0_GCC5.4.0/i686-native-linuxapp-gcc/fdd2452bc8d44f2bbc2f919d9f93ff17/dpdk/i686-native-linuxapp-gcc/include/rte_mempool.h:51,
                 from /root/UB1604-32_K4.4.0_GCC5.4.0/i686-native-linuxapp-gcc/fdd2452bc8d44f2bbc2f919d9f93ff17/dpdk/i686-native-linuxapp-gcc/include/rte_mbuf.h:38,
                 from /root/UB1604-32_K4.4.0_GCC5.4.0/i686-native-linuxapp-gcc/fdd2452bc8d44f2bbc2f919d9f93ff17/dpdk/i686-native-linuxapp-gcc/include/rte_ip.h:24,
                 from /root/UB1604-32_K4.4.0_GCC5.4.0/i686-native-linuxapp-gcc/fdd2452bc8d44f2bbc2f919d9f93ff17/dpdk/i686-native-linuxapp-gcc/include/rte_net.h:12,
                 from /root/UB1604-32_K4.4.0_GCC5.4.0/i686-native-linuxapp-gcc/fdd2452bc8d44f2bbc2f919d9f93ff17/dpdk/drivers/net/virtio/virtio_rxtx_packed_avx.c:11:
/usr/lib/gcc/i686-linux-gnu/5/include/avx512fintrin.h:60:1: error: inlining failed in call to always_inline ‘_mm512_set_epi64’: target specific option mismatch
 _mm512_set_epi64 (long long __A, long long __B, long long __C,
 ^
/root/UB1604-32_K4.4.0_GCC5.4.0/i686-native-linuxapp-gcc/fdd2452bc8d44f2bbc2f919d9f93ff17/dpdk/drivers/net/virtio/virtio_rxtx_packed_avx.c:152:10: error: called from here
  __m512i new_descs = _mm512_set_epi64(
          ^
--
                 from /root/UB1604-32_K4.4.0_GCC5.4.0/i686-native-linuxapp-gcc/fdd2452bc8d44f2bbc2f919d9f93ff17/dpdk/i686-native-linuxapp-gcc/include/rte_mempool.h:51,
                 from /root/UB1604-32_K4.4.0_GCC5.4.0/i686-native-linuxapp-gcc/fdd2452bc8d44f2bbc2f919d9f93ff17/dpdk/i686-native-linuxapp-gcc/include/rte_mbuf.h:38,
                 from /root/UB1604-32_K4.4.0_GCC5.4.0/i686-native-linuxapp-gcc/fdd2452bc8d44f2bbc2f919d9f93ff17/dpdk/i686-native-linuxapp-gcc/include/rte_ip.h:24,
                 from /root/UB1604-32_K4.4.0_GCC5.4.0/i686-native-linuxapp-gcc/fdd2452bc8d44f2bbc2f919d9f93ff17/dpdk/i686-native-linuxapp-gcc/include/rte_net.h:12,
                 from /root/UB1604-32_K4.4.0_GCC5.4.0/i686-native-linuxapp-gcc/fdd2452bc8d44f2bbc2f919d9f93ff17/dpdk/drivers/net/virtio/virtio_rxtx_packed_avx.c:11:
/usr/lib/gcc/i686-linux-gnu/5/include/avx512fintrin.h:5818:1: error: inlining failed in call to always_inline ‘_mm512_storeu_si512’: target specific option mismatch
 _mm512_storeu_si512 (void *__P, __m512i __A)
 ^
/root/UB1604-32_K4.4.0_GCC5.4.0/i686-native-linuxapp-gcc/fdd2452bc8d44f2bbc2f919d9f93ff17/dpdk/drivers/net/virtio/virtio_rxtx_packed_avx.c:172:2: error: called from here
  _mm512_storeu_si512((void *)&vq->vq_packed.ring.desc[idx], new_descs);
  ^
/root/UB1604-32_K4.4.0_GCC5.4.0/i686-native-linuxapp-gcc/fdd2452bc8d44f2bbc2f919d9f93ff17/dpdk/drivers/net/virtio/virtio_rxtx_packed_avx.c: At top level:
cc1: warning: unrecognized command line option ‘-Wno-address-of-packed-member’
/root/UB1604-32_K4.4.0_GCC5.4.0/i686-native-linuxapp-gcc/fdd2452bc8d44f2bbc2f919d9f93ff17/dpdk/mk/internal/rte.compile-pre.mk:114: recipe for target 'virtio_rxtx_packed_avx.o' failed
make[6]: *** [virtio_rxtx_packed_avx.o] Error 1
make[6]: *** Waiting for unfinished jobs....
  CC otx2_mcast.o
  CC bcm_osal.o
/root/UB1604-32_K4.4.0_GCC5.4.0/i686-native-linuxapp-gcc/fdd2452bc8d44f2bbc2f919d9f93ff17/dpdk/mk/rte.subdir.mk:35: recipe for target 'virtio' failed
make[5]: *** [virtio] Error 2
make[5]: *** Waiting for unfinished jobs....
  CC ecore_sriov.o
  CC conn.o
  CC ecore_vf.o
  CC qede_ethdev.o
--
  CC otx2_ethdev_devargs.o
  AR librte_pmd_qede.a
  INSTALL-LIB librte_pmd_qede.a
  AR librte_pmd_octeontx2.a
  INSTALL-LIB librte_pmd_octeontx2.a
/root/UB1604-32_K4.4.0_GCC5.4.0/i686-native-linuxapp-gcc/fdd2452bc8d44f2bbc2f919d9f93ff17/dpdk/mk/rte.subdir.mk:35: recipe for target 'net' failed
make[4]: *** [net] Error 2
/root/UB1604-32_K4.4.0_GCC5.4.0/i686-native-linuxapp-gcc/fdd2452bc8d44f2bbc2f919d9f93ff17/dpdk/mk/rte.sdkbuild.mk:46: recipe for target 'drivers' failed
make[3]: *** [drivers] Error 2
/root/UB1604-32_K4.4.0_GCC5.4.0/i686-native-linuxapp-gcc/fdd2452bc8d44f2bbc2f919d9f93ff17/dpdk/mk/rte.sdkroot.mk:98: recipe for target 'all' failed
make[2]: *** [all] Error 2
/root/UB1604-32_K4.4.0_GCC5.4.0/i686-native-linuxapp-gcc/fdd2452bc8d44f2bbc2f919d9f93ff17/dpdk/mk/rte.sdkinstall.mk:60: recipe for target 'pre_install' failed
make[1]: *** [pre_install] Error 2
/root/UB1604-32_K4.4.0_GCC5.4.0/i686-native-linuxapp-gcc/fdd2452bc8d44f2bbc2f919d9f93ff17/dpdk/mk/rte.sdkroot.mk:77: recipe for target 'install' failed
make: *** [install] Error 2


*Make Build Failed #3:
OS: UB1910-64
Target: x86_64-native-linuxapp-gcc
                 from /root/UB1910-64_K5.3.0_GCC9.2.1/x86_64-native-linuxapp-gcc/fdd2452bc8d44f2bbc2f919d9f93ff17/dpdk/x86_64-native-linuxapp-gcc/include/rte_mempool.h:51,
                 from /root/UB1910-64_K5.3.0_GCC9.2.1/x86_64-native-linuxapp-gcc/fdd2452bc8d44f2bbc2f919d9f93ff17/dpdk/x86_64-native-linuxapp-gcc/include/rte_mbuf.h:38,
                 from /root/UB1910-64_K5.3.0_GCC9.2.1/x86_64-native-linuxapp-gcc/fdd2452bc8d44f2bbc2f919d9f93ff17/dpdk/x86_64-native-linuxapp-gcc/include/rte_ip.h:24,
                 from /root/UB1910-64_K5.3.0_GCC9.2.1/x86_64-native-linuxapp-gcc/fdd2452bc8d44f2bbc2f919d9f93ff17/dpdk/x86_64-native-linuxapp-gcc/include/rte_net.h:12,
                 from /root/UB1910-64_K5.3.0_GCC9.2.1/x86_64-native-linuxapp-gcc/fdd2452bc8d44f2bbc2f919d9f93ff17/dpdk/drivers/net/virtio/virtio_rxtx_packed_avx.c:11:
/usr/lib/gcc/x86_64-linux-gnu/9/include/avx512vlbwintrin.h:3677:1: error: inlining failed in call to always_inline ‘_mm256_cmpneq_epu16_mask’: target specific option mismatch
 3677 | _mm256_cmpneq_epu16_mask (__m256i __X, __m256i __Y)
      | ^~~~~~~~~~~~~~~~~~~~~~~~
/root/UB1910-64_K5.3.0_GCC9.2.1/x86_64-native-linuxapp-gcc/fdd2452bc8d44f2bbc2f919d9f93ff17/dpdk/drivers/net/virtio/virtio_rxtx_packed_avx.c:132:17: note: called from here
  132 |  uint16_t cmp = _mm256_cmpneq_epu16_mask(mbufs, mbuf_ref);
      |                 ^~~~~~~~~~~~~~~~~~~~~~~~~~~~~~~~~~~~~~~~~
--
                 from /root/UB1910-64_K5.3.0_GCC9.2.1/x86_64-native-linuxapp-gcc/fdd2452bc8d44f2bbc2f919d9f93ff17/dpdk/x86_64-native-linuxapp-gcc/include/rte_mempool.h:51,
                 from /root/UB1910-64_K5.3.0_GCC9.2.1/x86_64-native-linuxapp-gcc/fdd2452bc8d44f2bbc2f919d9f93ff17/dpdk/x86_64-native-linuxapp-gcc/include/rte_mbuf.h:38,
                 from /root/UB1910-64_K5.3.0_GCC9.2.1/x86_64-native-linuxapp-gcc/fdd2452bc8d44f2bbc2f919d9f93ff17/dpdk/x86_64-native-linuxapp-gcc/include/rte_ip.h:24,
                 from /root/UB1910-64_K5.3.0_GCC9.2.1/x86_64-native-linuxapp-gcc/fdd2452bc8d44f2bbc2f919d9f93ff17/dpdk/x86_64-native-linuxapp-gcc/include/rte_net.h:12,
                 from /root/UB1910-64_K5.3.0_GCC9.2.1/x86_64-native-linuxapp-gcc/fdd2452bc8d44f2bbc2f919d9f93ff17/dpdk/drivers/net/virtio/virtio_rxtx_packed_avx.c:11:
/usr/lib/gcc/x86_64-linux-gnu/9/include/avx512vlbwintrin.h:3677:1: error: inlining failed in call to always_inline ‘_mm256_cmpneq_epu16_mask’: target specific option mismatch
 3677 | _mm256_cmpneq_epu16_mask (__m256i __X, __m256i __Y)
      | ^~~~~~~~~~~~~~~~~~~~~~~~
/root/UB1910-64_K5.3.0_GCC9.2.1/x86_64-native-linuxapp-gcc/fdd2452bc8d44f2bbc2f919d9f93ff17/dpdk/drivers/net/virtio/virtio_rxtx_packed_avx.c:132:17: note: called from here
  132 |  uint16_t cmp = _mm256_cmpneq_epu16_mask(mbufs, mbuf_ref);
      |                 ^~~~~~~~~~~~~~~~~~~~~~~~~~~~~~~~~~~~~~~~~
--
                 from /root/UB1910-64_K5.3.0_GCC9.2.1/x86_64-native-linuxapp-gcc/fdd2452bc8d44f2bbc2f919d9f93ff17/dpdk/x86_64-native-linuxapp-gcc/include/rte_mempool.h:51,
                 from /root/UB1910-64_K5.3.0_GCC9.2.1/x86_64-native-linuxapp-gcc/fdd2452bc8d44f2bbc2f919d9f93ff17/dpdk/x86_64-native-linuxapp-gcc/include/rte_mbuf.h:38,
                 from /root/UB1910-64_K5.3.0_GCC9.2.1/x86_64-native-linuxapp-gcc/fdd2452bc8d44f2bbc2f919d9f93ff17/dpdk/x86_64-native-linuxapp-gcc/include/rte_ip.h:24,
                 from /root/UB1910-64_K5.3.0_GCC9.2.1/x86_64-native-linuxapp-gcc/fdd2452bc8d44f2bbc2f919d9f93ff17/dpdk/x86_64-native-linuxapp-gcc/include/rte_net.h:12,
                 from /root/UB1910-64_K5.3.0_GCC9.2.1/x86_64-native-linuxapp-gcc/fdd2452bc8d44f2bbc2f919d9f93ff17/dpdk/drivers/net/virtio/virtio_rxtx_packed_avx.c:11:
/usr/lib/gcc/x86_64-linux-gnu/9/include/avx512fintrin.h:79:1: error: inlining failed in call to always_inline ‘_mm512_set_epi64’: target specific option mismatch
   79 | _mm512_set_epi64 (long long __A, long long __B, long long __C,
      | ^~~~~~~~~~~~~~~~
/root/UB1910-64_K5.3.0_GCC9.2.1/x86_64-native-linuxapp-gcc/fdd2452bc8d44f2bbc2f919d9f93ff17/dpdk/drivers/net/virtio/virtio_rxtx_packed_avx.c:152:22: note: called from here
  152 |  __m512i new_descs = _mm512_set_epi64(
      |                      ^~~~~~~~~~~~~~~~~
--
                 from /root/UB1910-64_K5.3.0_GCC9.2.1/x86_64-native-linuxapp-gcc/fdd2452bc8d44f2bbc2f919d9f93ff17/dpdk/x86_64-native-linuxapp-gcc/include/rte_mempool.h:51,
                 from /root/UB1910-64_K5.3.0_GCC9.2.1/x86_64-native-linuxapp-gcc/fdd2452bc8d44f2bbc2f919d9f93ff17/dpdk/x86_64-native-linuxapp-gcc/include/rte_mbuf.h:38,
                 from /root/UB1910-64_K5.3.0_GCC9.2.1/x86_64-native-linuxapp-gcc/fdd2452bc8d44f2bbc2f919d9f93ff17/dpdk/x86_64-native-linuxapp-gcc/include/rte_ip.h:24,
                 from /root/UB1910-64_K5.3.0_GCC9.2.1/x86_64-native-linuxapp-gcc/fdd2452bc8d44f2bbc2f919d9f93ff17/dpdk/x86_64-native-linuxapp-gcc/include/rte_net.h:12,
                 from /root/UB1910-64_K5.3.0_GCC9.2.1/x86_64-native-linuxapp-gcc/fdd2452bc8d44f2bbc2f919d9f93ff17/dpdk/drivers/net/virtio/virtio_rxtx_packed_avx.c:11:
/usr/lib/gcc/x86_64-linux-gnu/9/include/avx512fintrin.h:6408:1: error: inlining failed in call to always_inline ‘_mm512_storeu_si512’: target specific option mismatch
 6408 | _mm512_storeu_si512 (void *__P, __m512i __A)
      | ^~~~~~~~~~~~~~~~~~~
/root/UB1910-64_K5.3.0_GCC9.2.1/x86_64-native-linuxapp-gcc/fdd2452bc8d44f2bbc2f919d9f93ff17/dpdk/drivers/net/virtio/virtio_rxtx_packed_avx.c:172:2: note: called from here
  172 |  _mm512_storeu_si512((void *)&vq->vq_packed.ring.desc[idx], new_descs);
      |  ^~~~~~~~~~~~~~~~~~~~~~~~~~~~~~~~~~~~~~~~~~~~~~~~~~~~~~~~~~~~~~~~~~~~~
--
                 from /root/UB1910-64_K5.3.0_GCC9.2.1/x86_64-native-linuxapp-gcc/fdd2452bc8d44f2bbc2f919d9f93ff17/dpdk/x86_64-native-linuxapp-gcc/include/rte_mempool.h:51,
                 from /root/UB1910-64_K5.3.0_GCC9.2.1/x86_64-native-linuxapp-gcc/fdd2452bc8d44f2bbc2f919d9f93ff17/dpdk/x86_64-native-linuxapp-gcc/include/rte_mbuf.h:38,
                 from /root/UB1910-64_K5.3.0_GCC9.2.1/x86_64-native-linuxapp-gcc/fdd2452bc8d44f2bbc2f919d9f93ff17/dpdk/x86_64-native-linuxapp-gcc/include/rte_ip.h:24,
                 from /root/UB1910-64_K5.3.0_GCC9.2.1/x86_64-native-linuxapp-gcc/fdd2452bc8d44f2bbc2f919d9f93ff17/dpdk/x86_64-native-linuxapp-gcc/include/rte_net.h:12,
                 from /root/UB1910-64_K5.3.0_GCC9.2.1/x86_64-native-linuxapp-gcc/fdd2452bc8d44f2bbc2f919d9f93ff17/dpdk/drivers/net/virtio/virtio_rxtx_packed_avx.c:11:
/usr/lib/gcc/x86_64-linux-gnu/9/include/avx512vlbwintrin.h:3677:1: error: inlining failed in call to always_inline ‘_mm256_cmpneq_epu16_mask’: target specific option mismatch
 3677 | _mm256_cmpneq_epu16_mask (__m256i __X, __m256i __Y)
      | ^~~~~~~~~~~~~~~~~~~~~~~~
/root/UB1910-64_K5.3.0_GCC9.2.1/x86_64-native-linuxapp-gcc/fdd2452bc8d44f2bbc2f919d9f93ff17/dpdk/drivers/net/virtio/virtio_rxtx_packed_avx.c:132:17: note: called from here
  132 |  uint16_t cmp = _mm256_cmpneq_epu16_mask(mbufs, mbuf_ref);
      |                 ^~~~~~~~~~~~~~~~~~~~~~~~~~~~~~~~~~~~~~~~~
--
                 from /root/UB1910-64_K5.3.0_GCC9.2.1/x86_64-native-linuxapp-gcc/fdd2452bc8d44f2bbc2f919d9f93ff17/dpdk/x86_64-native-linuxapp-gcc/include/rte_mempool.h:51,
                 from /root/UB1910-64_K5.3.0_GCC9.2.1/x86_64-native-linuxapp-gcc/fdd2452bc8d44f2bbc2f919d9f93ff17/dpdk/x86_64-native-linuxapp-gcc/include/rte_mbuf.h:38,
                 from /root/UB1910-64_K5.3.0_GCC9.2.1/x86_64-native-linuxapp-gcc/fdd2452bc8d44f2bbc2f919d9f93ff17/dpdk/x86_64-native-linuxapp-gcc/include/rte_ip.h:24,
                 from /root/UB1910-64_K5.3.0_GCC9.2.1/x86_64-native-linuxapp-gcc/fdd2452bc8d44f2bbc2f919d9f93ff17/dpdk/x86_64-native-linuxapp-gcc/include/rte_net.h:12,
                 from /root/UB1910-64_K5.3.0_GCC9.2.1/x86_64-native-linuxapp-gcc/fdd2452bc8d44f2bbc2f919d9f93ff17/dpdk/drivers/net/virtio/virtio_rxtx_packed_avx.c:11:
/usr/lib/gcc/x86_64-linux-gnu/9/include/avx512fintrin.h:79:1: error: inlining failed in call to always_inline ‘_mm512_set_epi64’: target specific option mismatch
   79 | _mm512_set_epi64 (long long __A, long long __B, long long __C,
      | ^~~~~~~~~~~~~~~~
/root/UB1910-64_K5.3.0_GCC9.2.1/x86_64-native-linuxapp-gcc/fdd2452bc8d44f2bbc2f919d9f93ff17/dpdk/drivers/net/virtio/virtio_rxtx_packed_avx.c:152:22: note: called from here
  152 |  __m512i new_descs = _mm512_set_epi64(
      |                      ^~~~~~~~~~~~~~~~~
--
                 from /root/UB1910-64_K5.3.0_GCC9.2.1/x86_64-native-linuxapp-gcc/fdd2452bc8d44f2bbc2f919d9f93ff17/dpdk/x86_64-native-linuxapp-gcc/include/rte_mempool.h:51,
                 from /root/UB1910-64_K5.3.0_GCC9.2.1/x86_64-native-linuxapp-gcc/fdd2452bc8d44f2bbc2f919d9f93ff17/dpdk/x86_64-native-linuxapp-gcc/include/rte_mbuf.h:38,
                 from /root/UB1910-64_K5.3.0_GCC9.2.1/x86_64-native-linuxapp-gcc/fdd2452bc8d44f2bbc2f919d9f93ff17/dpdk/x86_64-native-linuxapp-gcc/include/rte_ip.h:24,
                 from /root/UB1910-64_K5.3.0_GCC9.2.1/x86_64-native-linuxapp-gcc/fdd2452bc8d44f2bbc2f919d9f93ff17/dpdk/x86_64-native-linuxapp-gcc/include/rte_net.h:12,
                 from /root/UB1910-64_K5.3.0_GCC9.2.1/x86_64-native-linuxapp-gcc/fdd2452bc8d44f2bbc2f919d9f93ff17/dpdk/drivers/net/virtio/virtio_rxtx_packed_avx.c:11:
/usr/lib/gcc/x86_64-linux-gnu/9/include/avx512fintrin.h:6408:1: error: inlining failed in call to always_inline ‘_mm512_storeu_si512’: target specific option mismatch
 6408 | _mm512_storeu_si512 (void *__P, __m512i __A)
      | ^~~~~~~~~~~~~~~~~~~
/root/UB1910-64_K5.3.0_GCC9.2.1/x86_64-native-linuxapp-gcc/fdd2452bc8d44f2bbc2f919d9f93ff17/dpdk/drivers/net/virtio/virtio_rxtx_packed_avx.c:172:2: note: called from here
  172 |  _mm512_storeu_si512((void *)&vq->vq_packed.ring.desc[idx], new_descs);
      |  ^~~~~~~~~~~~~~~~~~~~~~~~~~~~~~~~~~~~~~~~~~~~~~~~~~~~~~~~~~~~~~~~~~~~~
make[6]: *** [/root/UB1910-64_K5.3.0_GCC9.2.1/x86_64-native-linuxapp-gcc/fdd2452bc8d44f2bbc2f919d9f93ff17/dpdk/mk/internal/rte.compile-pre.mk:116: virtio_rxtx_packed_avx.o] Error 1
make[6]: *** Waiting for unfinished jobs....
  CC rte_eth_softnic_tap.o
  CC otx2_ethdev_debug.o
  CC otx2_ethdev_devargs.o
  CC efx_rx.o
--
  CC rte_eth_softnic_action.o
  INSTALL-LIB librte_pmd_octeontx2.a
  CC qede_filter.o
  CC siena_mac.o
  CC siena_mcdi.o
make[5]: *** [/root/UB1910-64_K5.3.0_GCC9.2.1/x86_64-native-linuxapp-gcc/fdd2452bc8d44f2bbc2f919d9f93ff17/dpdk/mk/rte.subdir.mk:35: virtio] Error 2
make[5]: *** Waiting for unfinished jobs....
  CC siena_nic.o
  CC siena_nvram.o
  CC rte_eth_softnic_pipeline.o
  CC siena_phy.o
--
  INSTALL-LIB librte_pmd_softnic.a
  CC medford_nic.o
  CC medford2_nic.o
  AR librte_pmd_sfc_efx.a
  INSTALL-LIB librte_pmd_sfc_efx.a
make[4]: *** [/root/UB1910-64_K5.3.0_GCC9.2.1/x86_64-native-linuxapp-gcc/fdd2452bc8d44f2bbc2f919d9f93ff17/dpdk/mk/rte.subdir.mk:35: net] Error 2
make[3]: *** [/root/UB1910-64_K5.3.0_GCC9.2.1/x86_64-native-linuxapp-gcc/fdd2452bc8d44f2bbc2f919d9f93ff17/dpdk/mk/rte.sdkbuild.mk:46: drivers] Error 2
make[2]: *** [/root/UB1910-64_K5.3.0_GCC9.2.1/x86_64-native-linuxapp-gcc/fdd2452bc8d44f2bbc2f919d9f93ff17/dpdk/mk/rte.sdkroot.mk:99: all] Error 2
make[1]: *** [/root/UB1910-64_K5.3.0_GCC9.2.1/x86_64-native-linuxapp-gcc/fdd2452bc8d44f2bbc2f919d9f93ff17/dpdk/mk/rte.sdkinstall.mk:61: pre_install] Error 2
make: *** [/root/UB1910-64_K5.3.0_GCC9.2.1/x86_64-native-linuxapp-gcc/fdd2452bc8d44f2bbc2f919d9f93ff17/dpdk/mk/rte.sdkroot.mk:77: install] Error 2


*Make Build Failed #4:
OS: UB1804-64
Target: x86_64-native-linuxapp-clang
        ^
/usr/lib/llvm-6.0/lib/clang/6.0.0/include/avx512fintrin.h:8165:3: note: expanded from macro '_mm512_i64scatter_epi64'
  __builtin_ia32_scatterdiv8di((long long *)(addr), (__mmask8)-1, \
  ^
15 errors generated.
/root/UB1804-64_K4.15.0_Clang6.0.0/x86_64-native-linuxapp-clang/fdd2452bc8d44f2bbc2f919d9f93ff17/dpdk/mk/internal/rte.compile-pre.mk:114: recipe for target 'virtio_rxtx_packed_avx.o' failed
make[6]: *** [virtio_rxtx_packed_avx.o] Error 1
/root/UB1804-64_K4.15.0_Clang6.0.0/x86_64-native-linuxapp-clang/fdd2452bc8d44f2bbc2f919d9f93ff17/dpdk/mk/rte.subdir.mk:35: recipe for target 'virtio' failed
make[5]: *** [virtio] Error 2
make[5]: *** Waiting for unfinished jobs....
  CC sfc_ef10_essb_rx.o
  PMDINFO rte_eth_vhost.o.pmd.c
  CC rte_eth_vhost.o.pmd.o
  CC sfc_ef10_tx.o
--
  CC hunt_nic.o
  CC medford_nic.o
  CC medford2_nic.o
  AR librte_pmd_sfc_efx.a
  INSTALL-LIB librte_pmd_sfc_efx.a
/root/UB1804-64_K4.15.0_Clang6.0.0/x86_64-native-linuxapp-clang/fdd2452bc8d44f2bbc2f919d9f93ff17/dpdk/mk/rte.subdir.mk:35: recipe for target 'net' failed
make[4]: *** [net] Error 2
/root/UB1804-64_K4.15.0_Clang6.0.0/x86_64-native-linuxapp-clang/fdd2452bc8d44f2bbc2f919d9f93ff17/dpdk/mk/rte.sdkbuild.mk:46: recipe for target 'drivers' failed
make[3]: *** [drivers] Error 2
/root/UB1804-64_K4.15.0_Clang6.0.0/x86_64-native-linuxapp-clang/fdd2452bc8d44f2bbc2f919d9f93ff17/dpdk/mk/rte.sdkroot.mk:98: recipe for target 'all' failed
make[2]: *** [all] Error 2
/root/UB1804-64_K4.15.0_Clang6.0.0/x86_64-native-linuxapp-clang/fdd2452bc8d44f2bbc2f919d9f93ff17/dpdk/mk/rte.sdkinstall.mk:60: recipe for target 'pre_install' failed
make[1]: *** [pre_install] Error 2
/root/UB1804-64_K4.15.0_Clang6.0.0/x86_64-native-linuxapp-clang/fdd2452bc8d44f2bbc2f919d9f93ff17/dpdk/mk/rte.sdkroot.mk:77: recipe for target 'install' failed
make: *** [install] Error 2


*Make Build Failed #5:
OS: CENTOS77-64
Target: x86_64-native-linuxapp-clang
        ^
/root/CENTOS77-64_K3.10.0_Clang3.4.2/x86_64-native-linuxapp-clang/fdd2452bc8d44f2bbc2f919d9f93ff17/dpdk/drivers/net/virtio/virtio_rxtx_packed_avx.c:422:29: error: use of undeclared identifier 'vindex'
        _mm512_i64scatter_epi64(0, vindex, value, 1);
                                   ^
6 warnings and 15 errors generated.
make[6]: *** [virtio_rxtx_packed_avx.o] Error 1
make[6]: *** Waiting for unfinished jobs....
  CC efx_intr.o
  CC rte_eth_softnic_pipeline.o
  AR librte_pmd_octeontx2.a
  CC efx_lic.o
--
  CC efx_mon.o
  CC efx_nic.o
  CC efx_nvram.o
  CC rte_eth_softnic_cli.o
  CC efx_phy.o
make[5]: *** [virtio] Error 2
make[5]: *** Waiting for unfinished jobs....
  CC efx_port.o
  CC rte_eth_softnic_flow.o
  CC efx_proxy.o
  CC rte_eth_softnic_meter.o
--
  CC medford2_nic.o
  AR librte_pmd_sfc_efx.a
  INSTALL-LIB librte_pmd_sfc_efx.a
  AR librte_pmd_softnic.a
  INSTALL-LIB librte_pmd_softnic.a
make[4]: *** [net] Error 2
make[3]: *** [drivers] Error 2
make[2]: *** [all] Error 2
make[1]: *** [pre_install] Error 2
make: *** [install] Error 2


*Make Build Failed #6:
OS: CENTOS80-64
Target: x86_64-native-linuxapp-gcc
                 from /root/CENTOS80-64_K4.18.0_GCC8.2.1/x86_64-native-linuxapp-gcc/fdd2452bc8d44f2bbc2f919d9f93ff17/dpdk/x86_64-native-linuxapp-gcc/include/rte_mempool.h:51,
                 from /root/CENTOS80-64_K4.18.0_GCC8.2.1/x86_64-native-linuxapp-gcc/fdd2452bc8d44f2bbc2f919d9f93ff17/dpdk/x86_64-native-linuxapp-gcc/include/rte_mbuf.h:38,
                 from /root/CENTOS80-64_K4.18.0_GCC8.2.1/x86_64-native-linuxapp-gcc/fdd2452bc8d44f2bbc2f919d9f93ff17/dpdk/x86_64-native-linuxapp-gcc/include/rte_ip.h:24,
                 from /root/CENTOS80-64_K4.18.0_GCC8.2.1/x86_64-native-linuxapp-gcc/fdd2452bc8d44f2bbc2f919d9f93ff17/dpdk/x86_64-native-linuxapp-gcc/include/rte_net.h:12,
                 from /root/CENTOS80-64_K4.18.0_GCC8.2.1/x86_64-native-linuxapp-gcc/fdd2452bc8d44f2bbc2f919d9f93ff17/dpdk/drivers/net/virtio/virtio_rxtx_packed_avx.c:11:
/usr/lib/gcc/x86_64-redhat-linux/8/include/avx512vlbwintrin.h:3677:1: error: inlining failed in call to always_inline ‘_mm256_cmpneq_epu16_mask’: target specific option mismatch
 _mm256_cmpneq_epu16_mask (__m256i __X, __m256i __Y)
 ^~~~~~~~~~~~~~~~~~~~~~~~
/root/CENTOS80-64_K4.18.0_GCC8.2.1/x86_64-native-linuxapp-gcc/fdd2452bc8d44f2bbc2f919d9f93ff17/dpdk/drivers/net/virtio/virtio_rxtx_packed_avx.c:132:17: note: called from here
  uint16_t cmp = _mm256_cmpneq_epu16_mask(mbufs, mbuf_ref);
                 ^~~~~~~~~~~~~~~~~~~~~~~~~~~~~~~~~~~~~~~~~
--
                 from /root/CENTOS80-64_K4.18.0_GCC8.2.1/x86_64-native-linuxapp-gcc/fdd2452bc8d44f2bbc2f919d9f93ff17/dpdk/x86_64-native-linuxapp-gcc/include/rte_mempool.h:51,
                 from /root/CENTOS80-64_K4.18.0_GCC8.2.1/x86_64-native-linuxapp-gcc/fdd2452bc8d44f2bbc2f919d9f93ff17/dpdk/x86_64-native-linuxapp-gcc/include/rte_mbuf.h:38,
                 from /root/CENTOS80-64_K4.18.0_GCC8.2.1/x86_64-native-linuxapp-gcc/fdd2452bc8d44f2bbc2f919d9f93ff17/dpdk/x86_64-native-linuxapp-gcc/include/rte_ip.h:24,
                 from /root/CENTOS80-64_K4.18.0_GCC8.2.1/x86_64-native-linuxapp-gcc/fdd2452bc8d44f2bbc2f919d9f93ff17/dpdk/x86_64-native-linuxapp-gcc/include/rte_net.h:12,
                 from /root/CENTOS80-64_K4.18.0_GCC8.2.1/x86_64-native-linuxapp-gcc/fdd2452bc8d44f2bbc2f919d9f93ff17/dpdk/drivers/net/virtio/virtio_rxtx_packed_avx.c:11:
/usr/lib/gcc/x86_64-redhat-linux/8/include/avx512vlbwintrin.h:3677:1: error: inlining failed in call to always_inline ‘_mm256_cmpneq_epu16_mask’: target specific option mismatch
 _mm256_cmpneq_epu16_mask (__m256i __X, __m256i __Y)
 ^~~~~~~~~~~~~~~~~~~~~~~~
/root/CENTOS80-64_K4.18.0_GCC8.2.1/x86_64-native-linuxapp-gcc/fdd2452bc8d44f2bbc2f919d9f93ff17/dpdk/drivers/net/virtio/virtio_rxtx_packed_avx.c:132:17: note: called from here
  uint16_t cmp = _mm256_cmpneq_epu16_mask(mbufs, mbuf_ref);
                 ^~~~~~~~~~~~~~~~~~~~~~~~~~~~~~~~~~~~~~~~~
--
                 from /root/CENTOS80-64_K4.18.0_GCC8.2.1/x86_64-native-linuxapp-gcc/fdd2452bc8d44f2bbc2f919d9f93ff17/dpdk/x86_64-native-linuxapp-gcc/include/rte_mempool.h:51,
                 from /root/CENTOS80-64_K4.18.0_GCC8.2.1/x86_64-native-linuxapp-gcc/fdd2452bc8d44f2bbc2f919d9f93ff17/dpdk/x86_64-native-linuxapp-gcc/include/rte_mbuf.h:38,
                 from /root/CENTOS80-64_K4.18.0_GCC8.2.1/x86_64-native-linuxapp-gcc/fdd2452bc8d44f2bbc2f919d9f93ff17/dpdk/x86_64-native-linuxapp-gcc/include/rte_ip.h:24,
                 from /root/CENTOS80-64_K4.18.0_GCC8.2.1/x86_64-native-linuxapp-gcc/fdd2452bc8d44f2bbc2f919d9f93ff17/dpdk/x86_64-native-linuxapp-gcc/include/rte_net.h:12,
                 from /root/CENTOS80-64_K4.18.0_GCC8.2.1/x86_64-native-linuxapp-gcc/fdd2452bc8d44f2bbc2f919d9f93ff17/dpdk/drivers/net/virtio/virtio_rxtx_packed_avx.c:11:
/usr/lib/gcc/x86_64-redhat-linux/8/include/avx512fintrin.h:79:1: error: inlining failed in call to always_inline ‘_mm512_set_epi64’: target specific option mismatch
 _mm512_set_epi64 (long long __A, long long __B, long long __C,
 ^~~~~~~~~~~~~~~~
/root/CENTOS80-64_K4.18.0_GCC8.2.1/x86_64-native-linuxapp-gcc/fdd2452bc8d44f2bbc2f919d9f93ff17/dpdk/drivers/net/virtio/virtio_rxtx_packed_avx.c:152:22: note: called from here
  __m512i new_descs = _mm512_set_epi64(
                      ^~~~~~~~~~~~~~~~~
--
                 from /root/CENTOS80-64_K4.18.0_GCC8.2.1/x86_64-native-linuxapp-gcc/fdd2452bc8d44f2bbc2f919d9f93ff17/dpdk/x86_64-native-linuxapp-gcc/include/rte_mempool.h:51,
                 from /root/CENTOS80-64_K4.18.0_GCC8.2.1/x86_64-native-linuxapp-gcc/fdd2452bc8d44f2bbc2f919d9f93ff17/dpdk/x86_64-native-linuxapp-gcc/include/rte_mbuf.h:38,
                 from /root/CENTOS80-64_K4.18.0_GCC8.2.1/x86_64-native-linuxapp-gcc/fdd2452bc8d44f2bbc2f919d9f93ff17/dpdk/x86_64-native-linuxapp-gcc/include/rte_ip.h:24,
                 from /root/CENTOS80-64_K4.18.0_GCC8.2.1/x86_64-native-linuxapp-gcc/fdd2452bc8d44f2bbc2f919d9f93ff17/dpdk/x86_64-native-linuxapp-gcc/include/rte_net.h:12,
                 from /root/CENTOS80-64_K4.18.0_GCC8.2.1/x86_64-native-linuxapp-gcc/fdd2452bc8d44f2bbc2f919d9f93ff17/dpdk/drivers/net/virtio/virtio_rxtx_packed_avx.c:11:
/usr/lib/gcc/x86_64-redhat-linux/8/include/avx512fintrin.h:6260:1: error: inlining failed in call to always_inline ‘_mm512_storeu_si512’: target specific option mismatch
 _mm512_storeu_si512 (void *__P, __m512i __A)
 ^~~~~~~~~~~~~~~~~~~
/root/CENTOS80-64_K4.18.0_GCC8.2.1/x86_64-native-linuxapp-gcc/fdd2452bc8d44f2bbc2f919d9f93ff17/dpdk/drivers/net/virtio/virtio_rxtx_packed_avx.c:172:2: note: called from here
  _mm512_storeu_si512((void *)&vq->vq_packed.ring.desc[idx], new_descs);
  ^~~~~~~~~~~~~~~~~~~~~~~~~~~~~~~~~~~~~~~~~~~~~~~~~~~~~~~~~~~~~~~~~~~~~
--
                 from /root/CENTOS80-64_K4.18.0_GCC8.2.1/x86_64-native-linuxapp-gcc/fdd2452bc8d44f2bbc2f919d9f93ff17/dpdk/x86_64-native-linuxapp-gcc/include/rte_mempool.h:51,
                 from /root/CENTOS80-64_K4.18.0_GCC8.2.1/x86_64-native-linuxapp-gcc/fdd2452bc8d44f2bbc2f919d9f93ff17/dpdk/x86_64-native-linuxapp-gcc/include/rte_mbuf.h:38,
                 from /root/CENTOS80-64_K4.18.0_GCC8.2.1/x86_64-native-linuxapp-gcc/fdd2452bc8d44f2bbc2f919d9f93ff17/dpdk/x86_64-native-linuxapp-gcc/include/rte_ip.h:24,
                 from /root/CENTOS80-64_K4.18.0_GCC8.2.1/x86_64-native-linuxapp-gcc/fdd2452bc8d44f2bbc2f919d9f93ff17/dpdk/x86_64-native-linuxapp-gcc/include/rte_net.h:12,
                 from /root/CENTOS80-64_K4.18.0_GCC8.2.1/x86_64-native-linuxapp-gcc/fdd2452bc8d44f2bbc2f919d9f93ff17/dpdk/drivers/net/virtio/virtio_rxtx_packed_avx.c:11:
/usr/lib/gcc/x86_64-redhat-linux/8/include/avx512vlbwintrin.h:3677:1: error: inlining failed in call to always_inline ‘_mm256_cmpneq_epu16_mask’: target specific option mismatch
 _mm256_cmpneq_epu16_mask (__m256i __X, __m256i __Y)
 ^~~~~~~~~~~~~~~~~~~~~~~~
/root/CENTOS80-64_K4.18.0_GCC8.2.1/x86_64-native-linuxapp-gcc/fdd2452bc8d44f2bbc2f919d9f93ff17/dpdk/drivers/net/virtio/virtio_rxtx_packed_avx.c:132:17: note: called from here
  uint16_t cmp = _mm256_cmpneq_epu16_mask(mbufs, mbuf_ref);
                 ^~~~~~~~~~~~~~~~~~~~~~~~~~~~~~~~~~~~~~~~~
--
                 from /root/CENTOS80-64_K4.18.0_GCC8.2.1/x86_64-native-linuxapp-gcc/fdd2452bc8d44f2bbc2f919d9f93ff17/dpdk/x86_64-native-linuxapp-gcc/include/rte_mempool.h:51,
                 from /root/CENTOS80-64_K4.18.0_GCC8.2.1/x86_64-native-linuxapp-gcc/fdd2452bc8d44f2bbc2f919d9f93ff17/dpdk/x86_64-native-linuxapp-gcc/include/rte_mbuf.h:38,
                 from /root/CENTOS80-64_K4.18.0_GCC8.2.1/x86_64-native-linuxapp-gcc/fdd2452bc8d44f2bbc2f919d9f93ff17/dpdk/x86_64-native-linuxapp-gcc/include/rte_ip.h:24,
                 from /root/CENTOS80-64_K4.18.0_GCC8.2.1/x86_64-native-linuxapp-gcc/fdd2452bc8d44f2bbc2f919d9f93ff17/dpdk/x86_64-native-linuxapp-gcc/include/rte_net.h:12,
                 from /root/CENTOS80-64_K4.18.0_GCC8.2.1/x86_64-native-linuxapp-gcc/fdd2452bc8d44f2bbc2f919d9f93ff17/dpdk/drivers/net/virtio/virtio_rxtx_packed_avx.c:11:
/usr/lib/gcc/x86_64-redhat-linux/8/include/avx512fintrin.h:79:1: error: inlining failed in call to always_inline ‘_mm512_set_epi64’: target specific option mismatch
 _mm512_set_epi64 (long long __A, long long __B, long long __C,
 ^~~~~~~~~~~~~~~~
/root/CENTOS80-64_K4.18.0_GCC8.2.1/x86_64-native-linuxapp-gcc/fdd2452bc8d44f2bbc2f919d9f93ff17/dpdk/drivers/net/virtio/virtio_rxtx_packed_avx.c:152:22: note: called from here
  __m512i new_descs = _mm512_set_epi64(
                      ^~~~~~~~~~~~~~~~~
--
                 from /root/CENTOS80-64_K4.18.0_GCC8.2.1/x86_64-native-linuxapp-gcc/fdd2452bc8d44f2bbc2f919d9f93ff17/dpdk/x86_64-native-linuxapp-gcc/include/rte_mempool.h:51,
                 from /root/CENTOS80-64_K4.18.0_GCC8.2.1/x86_64-native-linuxapp-gcc/fdd2452bc8d44f2bbc2f919d9f93ff17/dpdk/x86_64-native-linuxapp-gcc/include/rte_mbuf.h:38,
                 from /root/CENTOS80-64_K4.18.0_GCC8.2.1/x86_64-native-linuxapp-gcc/fdd2452bc8d44f2bbc2f919d9f93ff17/dpdk/x86_64-native-linuxapp-gcc/include/rte_ip.h:24,
                 from /root/CENTOS80-64_K4.18.0_GCC8.2.1/x86_64-native-linuxapp-gcc/fdd2452bc8d44f2bbc2f919d9f93ff17/dpdk/x86_64-native-linuxapp-gcc/include/rte_net.h:12,
                 from /root/CENTOS80-64_K4.18.0_GCC8.2.1/x86_64-native-linuxapp-gcc/fdd2452bc8d44f2bbc2f919d9f93ff17/dpdk/drivers/net/virtio/virtio_rxtx_packed_avx.c:11:
/usr/lib/gcc/x86_64-redhat-linux/8/include/avx512fintrin.h:6260:1: error: inlining failed in call to always_inline ‘_mm512_storeu_si512’: target specific option mismatch
 _mm512_storeu_si512 (void *__P, __m512i __A)
 ^~~~~~~~~~~~~~~~~~~
/root/CENTOS80-64_K4.18.0_GCC8.2.1/x86_64-native-linuxapp-gcc/fdd2452bc8d44f2bbc2f919d9f93ff17/dpdk/drivers/net/virtio/virtio_rxtx_packed_avx.c:172:2: note: called from here
  _mm512_storeu_si512((void *)&vq->vq_packed.ring.desc[idx], new_descs);
  ^~~~~~~~~~~~~~~~~~~~~~~~~~~~~~~~~~~~~~~~~~~~~~~~~~~~~~~~~~~~~~~~~~~~~
/root/CENTOS80-64_K4.18.0_GCC8.2.1/x86_64-native-linuxapp-gcc/fdd2452bc8d44f2bbc2f919d9f93ff17/dpdk/drivers/net/virtio/virtio_rxtx_packed_avx.c: At top level:
cc1: warning: unrecognized command line option ‘-Wno-address-of-packed-member’
make[6]: *** [/root/CENTOS80-64_K4.18.0_GCC8.2.1/x86_64-native-linuxapp-gcc/fdd2452bc8d44f2bbc2f919d9f93ff17/dpdk/mk/internal/rte.compile-pre.mk:114: virtio_rxtx_packed_avx.o] Error 1
make[6]: *** Waiting for unfinished jobs....
  CC efx_rx.o
  CC otx2_rss.o
  CC efx_sram.o
  CC otx2_mac.o
  CC efx_tunnel.o
make[5]: *** [/root/CENTOS80-64_K4.18.0_GCC8.2.1/x86_64-native-linuxapp-gcc/fdd2452bc8d44f2bbc2f919d9f93ff17/dpdk/mk/rte.subdir.mk:35: virtio] Error 2
make[5]: *** Waiting for unfinished jobs....
  CC efx_tx.o
  CC efx_vpd.o
  CC otx2_ptp.o
  CC mcdi_mon.o
--
  CC otx2_ethdev_devargs.o
  AR librte_pmd_sfc_efx.a
  INSTALL-LIB librte_pmd_sfc_efx.a
  AR librte_pmd_octeontx2.a
  INSTALL-LIB librte_pmd_octeontx2.a
make[4]: *** [/root/CENTOS80-64_K4.18.0_GCC8.2.1/x86_64-native-linuxapp-gcc/fdd2452bc8d44f2bbc2f919d9f93ff17/dpdk/mk/rte.subdir.mk:35: net] Error 2
make[3]: *** [/root/CENTOS80-64_K4.18.0_GCC8.2.1/x86_64-native-linuxapp-gcc/fdd2452bc8d44f2bbc2f919d9f93ff17/dpdk/mk/rte.sdkbuild.mk:46: drivers] Error 2
make[2]: *** [/root/CENTOS80-64_K4.18.0_GCC8.2.1/x86_64-native-linuxapp-gcc/fdd2452bc8d44f2bbc2f919d9f93ff17/dpdk/mk/rte.sdkroot.mk:99: all] Error 2
make[1]: *** [/root/CENTOS80-64_K4.18.0_GCC8.2.1/x86_64-native-linuxapp-gcc/fdd2452bc8d44f2bbc2f919d9f93ff17/dpdk/mk/rte.sdkinstall.mk:61: pre_install] Error 2
make: *** [/root/CENTOS80-64_K4.18.0_GCC8.2.1/x86_64-native-linuxapp-gcc/fdd2452bc8d44f2bbc2f919d9f93ff17/dpdk/mk/rte.sdkroot.mk:77: install] Error 2


*Make Build Failed #7:
OS: SUSE15-64
Target: x86_64-native-linuxapp-gcc
                 from /root/SUSE15-64_K4.12.14_GCC7.3.1/x86_64-native-linuxapp-gcc/fdd2452bc8d44f2bbc2f919d9f93ff17/dpdk/x86_64-native-linuxapp-gcc/include/rte_mempool.h:51,
                 from /root/SUSE15-64_K4.12.14_GCC7.3.1/x86_64-native-linuxapp-gcc/fdd2452bc8d44f2bbc2f919d9f93ff17/dpdk/x86_64-native-linuxapp-gcc/include/rte_mbuf.h:38,
                 from /root/SUSE15-64_K4.12.14_GCC7.3.1/x86_64-native-linuxapp-gcc/fdd2452bc8d44f2bbc2f919d9f93ff17/dpdk/x86_64-native-linuxapp-gcc/include/rte_ip.h:24,
                 from /root/SUSE15-64_K4.12.14_GCC7.3.1/x86_64-native-linuxapp-gcc/fdd2452bc8d44f2bbc2f919d9f93ff17/dpdk/x86_64-native-linuxapp-gcc/include/rte_net.h:12,
                 from /root/SUSE15-64_K4.12.14_GCC7.3.1/x86_64-native-linuxapp-gcc/fdd2452bc8d44f2bbc2f919d9f93ff17/dpdk/drivers/net/virtio/virtio_rxtx_packed_avx.c:11:
/usr/lib64/gcc/x86_64-suse-linux/7/include/avx512vlbwintrin.h:3642:1: error: inlining failed in call to always_inline ‘_mm256_cmpneq_epu16_mask’: target specific option mismatch
 _mm256_cmpneq_epu16_mask (__m256i __X, __m256i __Y)
 ^~~~~~~~~~~~~~~~~~~~~~~~
/root/SUSE15-64_K4.12.14_GCC7.3.1/x86_64-native-linuxapp-gcc/fdd2452bc8d44f2bbc2f919d9f93ff17/dpdk/drivers/net/virtio/virtio_rxtx_packed_avx.c:132:11: note: called from here
  uint16_t cmp = _mm256_cmpneq_epu16_mask(mbufs, mbuf_ref);
           ^~~
--
                 from /root/SUSE15-64_K4.12.14_GCC7.3.1/x86_64-native-linuxapp-gcc/fdd2452bc8d44f2bbc2f919d9f93ff17/dpdk/x86_64-native-linuxapp-gcc/include/rte_mempool.h:51,
                 from /root/SUSE15-64_K4.12.14_GCC7.3.1/x86_64-native-linuxapp-gcc/fdd2452bc8d44f2bbc2f919d9f93ff17/dpdk/x86_64-native-linuxapp-gcc/include/rte_mbuf.h:38,
                 from /root/SUSE15-64_K4.12.14_GCC7.3.1/x86_64-native-linuxapp-gcc/fdd2452bc8d44f2bbc2f919d9f93ff17/dpdk/x86_64-native-linuxapp-gcc/include/rte_ip.h:24,
                 from /root/SUSE15-64_K4.12.14_GCC7.3.1/x86_64-native-linuxapp-gcc/fdd2452bc8d44f2bbc2f919d9f93ff17/dpdk/x86_64-native-linuxapp-gcc/include/rte_net.h:12,
                 from /root/SUSE15-64_K4.12.14_GCC7.3.1/x86_64-native-linuxapp-gcc/fdd2452bc8d44f2bbc2f919d9f93ff17/dpdk/drivers/net/virtio/virtio_rxtx_packed_avx.c:11:
/usr/lib64/gcc/x86_64-suse-linux/7/include/avx512vlbwintrin.h:3642:1: error: inlining failed in call to always_inline ‘_mm256_cmpneq_epu16_mask’: target specific option mismatch
 _mm256_cmpneq_epu16_mask (__m256i __X, __m256i __Y)
 ^~~~~~~~~~~~~~~~~~~~~~~~
/root/SUSE15-64_K4.12.14_GCC7.3.1/x86_64-native-linuxapp-gcc/fdd2452bc8d44f2bbc2f919d9f93ff17/dpdk/drivers/net/virtio/virtio_rxtx_packed_avx.c:132:11: note: called from here
  uint16_t cmp = _mm256_cmpneq_epu16_mask(mbufs, mbuf_ref);
           ^~~
--
                 from /root/SUSE15-64_K4.12.14_GCC7.3.1/x86_64-native-linuxapp-gcc/fdd2452bc8d44f2bbc2f919d9f93ff17/dpdk/x86_64-native-linuxapp-gcc/include/rte_mempool.h:51,
                 from /root/SUSE15-64_K4.12.14_GCC7.3.1/x86_64-native-linuxapp-gcc/fdd2452bc8d44f2bbc2f919d9f93ff17/dpdk/x86_64-native-linuxapp-gcc/include/rte_mbuf.h:38,
                 from /root/SUSE15-64_K4.12.14_GCC7.3.1/x86_64-native-linuxapp-gcc/fdd2452bc8d44f2bbc2f919d9f93ff17/dpdk/x86_64-native-linuxapp-gcc/include/rte_ip.h:24,
                 from /root/SUSE15-64_K4.12.14_GCC7.3.1/x86_64-native-linuxapp-gcc/fdd2452bc8d44f2bbc2f919d9f93ff17/dpdk/x86_64-native-linuxapp-gcc/include/rte_net.h:12,
                 from /root/SUSE15-64_K4.12.14_GCC7.3.1/x86_64-native-linuxapp-gcc/fdd2452bc8d44f2bbc2f919d9f93ff17/dpdk/drivers/net/virtio/virtio_rxtx_packed_avx.c:11:
/usr/lib64/gcc/x86_64-suse-linux/7/include/avx512fintrin.h:79:1: error: inlining failed in call to always_inline ‘_mm512_set_epi64’: target specific option mismatch
 _mm512_set_epi64 (long long __A, long long __B, long long __C,
 ^~~~~~~~~~~~~~~~
/root/SUSE15-64_K4.12.14_GCC7.3.1/x86_64-native-linuxapp-gcc/fdd2452bc8d44f2bbc2f919d9f93ff17/dpdk/drivers/net/virtio/virtio_rxtx_packed_avx.c:152:10: note: called from here
  __m512i new_descs = _mm512_set_epi64(
          ^~~~~~~~~
--
                 from /root/SUSE15-64_K4.12.14_GCC7.3.1/x86_64-native-linuxapp-gcc/fdd2452bc8d44f2bbc2f919d9f93ff17/dpdk/x86_64-native-linuxapp-gcc/include/rte_mempool.h:51,
                 from /root/SUSE15-64_K4.12.14_GCC7.3.1/x86_64-native-linuxapp-gcc/fdd2452bc8d44f2bbc2f919d9f93ff17/dpdk/x86_64-native-linuxapp-gcc/include/rte_mbuf.h:38,
                 from /root/SUSE15-64_K4.12.14_GCC7.3.1/x86_64-native-linuxapp-gcc/fdd2452bc8d44f2bbc2f919d9f93ff17/dpdk/x86_64-native-linuxapp-gcc/include/rte_ip.h:24,
                 from /root/SUSE15-64_K4.12.14_GCC7.3.1/x86_64-native-linuxapp-gcc/fdd2452bc8d44f2bbc2f919d9f93ff17/dpdk/x86_64-native-linuxapp-gcc/include/rte_net.h:12,
                 from /root/SUSE15-64_K4.12.14_GCC7.3.1/x86_64-native-linuxapp-gcc/fdd2452bc8d44f2bbc2f919d9f93ff17/dpdk/drivers/net/virtio/virtio_rxtx_packed_avx.c:11:
/usr/lib64/gcc/x86_64-suse-linux/7/include/avx512fintrin.h:5831:1: error: inlining failed in call to always_inline ‘_mm512_storeu_si512’: target specific option mismatch
 _mm512_storeu_si512 (void *__P, __m512i __A)
 ^~~~~~~~~~~~~~~~~~~
/root/SUSE15-64_K4.12.14_GCC7.3.1/x86_64-native-linuxapp-gcc/fdd2452bc8d44f2bbc2f919d9f93ff17/dpdk/drivers/net/virtio/virtio_rxtx_packed_avx.c:172:2: note: called from here
  _mm512_storeu_si512((void *)&vq->vq_packed.ring.desc[idx], new_descs);
  ^~~~~~~~~~~~~~~~~~~~~~~~~~~~~~~~~~~~~~~~~~~~~~~~~~~~~~~~~~~~~~~~~~~~~
--
                 from /root/SUSE15-64_K4.12.14_GCC7.3.1/x86_64-native-linuxapp-gcc/fdd2452bc8d44f2bbc2f919d9f93ff17/dpdk/x86_64-native-linuxapp-gcc/include/rte_mempool.h:51,
                 from /root/SUSE15-64_K4.12.14_GCC7.3.1/x86_64-native-linuxapp-gcc/fdd2452bc8d44f2bbc2f919d9f93ff17/dpdk/x86_64-native-linuxapp-gcc/include/rte_mbuf.h:38,
                 from /root/SUSE15-64_K4.12.14_GCC7.3.1/x86_64-native-linuxapp-gcc/fdd2452bc8d44f2bbc2f919d9f93ff17/dpdk/x86_64-native-linuxapp-gcc/include/rte_ip.h:24,
                 from /root/SUSE15-64_K4.12.14_GCC7.3.1/x86_64-native-linuxapp-gcc/fdd2452bc8d44f2bbc2f919d9f93ff17/dpdk/x86_64-native-linuxapp-gcc/include/rte_net.h:12,
                 from /root/SUSE15-64_K4.12.14_GCC7.3.1/x86_64-native-linuxapp-gcc/fdd2452bc8d44f2bbc2f919d9f93ff17/dpdk/drivers/net/virtio/virtio_rxtx_packed_avx.c:11:
/usr/lib64/gcc/x86_64-suse-linux/7/include/avx512vlbwintrin.h:3642:1: error: inlining failed in call to always_inline ‘_mm256_cmpneq_epu16_mask’: target specific option mismatch
 _mm256_cmpneq_epu16_mask (__m256i __X, __m256i __Y)
 ^~~~~~~~~~~~~~~~~~~~~~~~
/root/SUSE15-64_K4.12.14_GCC7.3.1/x86_64-native-linuxapp-gcc/fdd2452bc8d44f2bbc2f919d9f93ff17/dpdk/drivers/net/virtio/virtio_rxtx_packed_avx.c:132:11: note: called from here
  uint16_t cmp = _mm256_cmpneq_epu16_mask(mbufs, mbuf_ref);
           ^~~
--
                 from /root/SUSE15-64_K4.12.14_GCC7.3.1/x86_64-native-linuxapp-gcc/fdd2452bc8d44f2bbc2f919d9f93ff17/dpdk/x86_64-native-linuxapp-gcc/include/rte_mempool.h:51,
                 from /root/SUSE15-64_K4.12.14_GCC7.3.1/x86_64-native-linuxapp-gcc/fdd2452bc8d44f2bbc2f919d9f93ff17/dpdk/x86_64-native-linuxapp-gcc/include/rte_mbuf.h:38,
                 from /root/SUSE15-64_K4.12.14_GCC7.3.1/x86_64-native-linuxapp-gcc/fdd2452bc8d44f2bbc2f919d9f93ff17/dpdk/x86_64-native-linuxapp-gcc/include/rte_ip.h:24,
                 from /root/SUSE15-64_K4.12.14_GCC7.3.1/x86_64-native-linuxapp-gcc/fdd2452bc8d44f2bbc2f919d9f93ff17/dpdk/x86_64-native-linuxapp-gcc/include/rte_net.h:12,
                 from /root/SUSE15-64_K4.12.14_GCC7.3.1/x86_64-native-linuxapp-gcc/fdd2452bc8d44f2bbc2f919d9f93ff17/dpdk/drivers/net/virtio/virtio_rxtx_packed_avx.c:11:
/usr/lib64/gcc/x86_64-suse-linux/7/include/avx512fintrin.h:79:1: error: inlining failed in call to always_inline ‘_mm512_set_epi64’: target specific option mismatch
 _mm512_set_epi64 (long long __A, long long __B, long long __C,
 ^~~~~~~~~~~~~~~~
/root/SUSE15-64_K4.12.14_GCC7.3.1/x86_64-native-linuxapp-gcc/fdd2452bc8d44f2bbc2f919d9f93ff17/dpdk/drivers/net/virtio/virtio_rxtx_packed_avx.c:152:10: note: called from here
  __m512i new_descs = _mm512_set_epi64(
          ^~~~~~~~~
--
                 from /root/SUSE15-64_K4.12.14_GCC7.3.1/x86_64-native-linuxapp-gcc/fdd2452bc8d44f2bbc2f919d9f93ff17/dpdk/x86_64-native-linuxapp-gcc/include/rte_mempool.h:51,
                 from /root/SUSE15-64_K4.12.14_GCC7.3.1/x86_64-native-linuxapp-gcc/fdd2452bc8d44f2bbc2f919d9f93ff17/dpdk/x86_64-native-linuxapp-gcc/include/rte_mbuf.h:38,
                 from /root/SUSE15-64_K4.12.14_GCC7.3.1/x86_64-native-linuxapp-gcc/fdd2452bc8d44f2bbc2f919d9f93ff17/dpdk/x86_64-native-linuxapp-gcc/include/rte_ip.h:24,
                 from /root/SUSE15-64_K4.12.14_GCC7.3.1/x86_64-native-linuxapp-gcc/fdd2452bc8d44f2bbc2f919d9f93ff17/dpdk/x86_64-native-linuxapp-gcc/include/rte_net.h:12,
                 from /root/SUSE15-64_K4.12.14_GCC7.3.1/x86_64-native-linuxapp-gcc/fdd2452bc8d44f2bbc2f919d9f93ff17/dpdk/drivers/net/virtio/virtio_rxtx_packed_avx.c:11:
/usr/lib64/gcc/x86_64-suse-linux/7/include/avx512fintrin.h:5831:1: error: inlining failed in call to always_inline ‘_mm512_storeu_si512’: target specific option mismatch
 _mm512_storeu_si512 (void *__P, __m512i __A)
 ^~~~~~~~~~~~~~~~~~~
/root/SUSE15-64_K4.12.14_GCC7.3.1/x86_64-native-linuxapp-gcc/fdd2452bc8d44f2bbc2f919d9f93ff17/dpdk/drivers/net/virtio/virtio_rxtx_packed_avx.c:172:2: note: called from here
  _mm512_storeu_si512((void *)&vq->vq_packed.ring.desc[idx], new_descs);
  ^~~~~~~~~~~~~~~~~~~~~~~~~~~~~~~~~~~~~~~~~~~~~~~~~~~~~~~~~~~~~~~~~~~~~
/root/SUSE15-64_K4.12.14_GCC7.3.1/x86_64-native-linuxapp-gcc/fdd2452bc8d44f2bbc2f919d9f93ff17/dpdk/drivers/net/virtio/virtio_rxtx_packed_avx.c: At top level:
cc1: warning: unrecognized command line option ‘-Wno-address-of-packed-member’
make[6]: *** [/root/SUSE15-64_K4.12.14_GCC7.3.1/x86_64-native-linuxapp-gcc/fdd2452bc8d44f2bbc2f919d9f93ff17/dpdk/mk/internal/rte.compile-pre.mk:116: virtio_rxtx_packed_avx.o] Error 1
make[6]: *** Waiting for unfinished jobs....
  CC otx2_flow_parse.o
  CC sfc_dp.o
  PMDINFO qede_ethdev.o.pmd.c
  CC qede_ethdev.o.pmd.o
--
  CC sfc_ef10_essb_rx.o
  CC sfc_ef10_tx.o
  CC efx_bootcfg.o
  CC otx2_flow_utils.o
  CC otx2_ethdev_irq.o
make[5]: *** [/root/SUSE15-64_K4.12.14_GCC7.3.1/x86_64-native-linuxapp-gcc/fdd2452bc8d44f2bbc2f919d9f93ff17/dpdk/mk/rte.subdir.mk:35: virtio] Error 2
make[5]: *** Waiting for unfinished jobs....
  CC otx2_ethdev_ops.o
  CC otx2_ethdev_sec.o
  CC efx_crc32.o
  PMDINFO otx2_ethdev.o.pmd.c
--
  CC hunt_nic.o
  CC medford_nic.o
  CC medford2_nic.o
  AR librte_pmd_sfc_efx.a
  INSTALL-LIB librte_pmd_sfc_efx.a
make[4]: *** [/root/SUSE15-64_K4.12.14_GCC7.3.1/x86_64-native-linuxapp-gcc/fdd2452bc8d44f2bbc2f919d9f93ff17/dpdk/mk/rte.subdir.mk:35: net] Error 2
make[3]: *** [/root/SUSE15-64_K4.12.14_GCC7.3.1/x86_64-native-linuxapp-gcc/fdd2452bc8d44f2bbc2f919d9f93ff17/dpdk/mk/rte.sdkbuild.mk:46: drivers] Error 2
make[2]: *** [/root/SUSE15-64_K4.12.14_GCC7.3.1/x86_64-native-linuxapp-gcc/fdd2452bc8d44f2bbc2f919d9f93ff17/dpdk/mk/rte.sdkroot.mk:99: all] Error 2
make[1]: *** [/root/SUSE15-64_K4.12.14_GCC7.3.1/x86_64-native-linuxapp-gcc/fdd2452bc8d44f2bbc2f919d9f93ff17/dpdk/mk/rte.sdkinstall.mk:61: pre_install] Error 2
make: *** [/root/SUSE15-64_K4.12.14_GCC7.3.1/x86_64-native-linuxapp-gcc/fdd2452bc8d44f2bbc2f919d9f93ff17/dpdk/mk/rte.sdkroot.mk:77: install] Error 2


*Make Build Failed #8:
OS: FC31-64
Target: x86_64-native-linuxapp-gcc
                 from /root/FC31-64_K5.3.14_GCC9.2.1/x86_64-native-linuxapp-gcc/fdd2452bc8d44f2bbc2f919d9f93ff17/dpdk/x86_64-native-linuxapp-gcc/include/rte_mempool.h:51,
                 from /root/FC31-64_K5.3.14_GCC9.2.1/x86_64-native-linuxapp-gcc/fdd2452bc8d44f2bbc2f919d9f93ff17/dpdk/x86_64-native-linuxapp-gcc/include/rte_mbuf.h:38,
                 from /root/FC31-64_K5.3.14_GCC9.2.1/x86_64-native-linuxapp-gcc/fdd2452bc8d44f2bbc2f919d9f93ff17/dpdk/x86_64-native-linuxapp-gcc/include/rte_ip.h:24,
                 from /root/FC31-64_K5.3.14_GCC9.2.1/x86_64-native-linuxapp-gcc/fdd2452bc8d44f2bbc2f919d9f93ff17/dpdk/x86_64-native-linuxapp-gcc/include/rte_net.h:12,
                 from /root/FC31-64_K5.3.14_GCC9.2.1/x86_64-native-linuxapp-gcc/fdd2452bc8d44f2bbc2f919d9f93ff17/dpdk/drivers/net/virtio/virtio_rxtx_packed_avx.c:11:
/usr/lib/gcc/x86_64-redhat-linux/9/include/avx512vlbwintrin.h:3677:1: error: inlining failed in call to always_inline ‘_mm256_cmpneq_epu16_mask’: target specific option mismatch
 3677 | _mm256_cmpneq_epu16_mask (__m256i __X, __m256i __Y)
      | ^~~~~~~~~~~~~~~~~~~~~~~~
/root/FC31-64_K5.3.14_GCC9.2.1/x86_64-native-linuxapp-gcc/fdd2452bc8d44f2bbc2f919d9f93ff17/dpdk/drivers/net/virtio/virtio_rxtx_packed_avx.c:132:17: note: called from here
  132 |  uint16_t cmp = _mm256_cmpneq_epu16_mask(mbufs, mbuf_ref);
      |                 ^~~~~~~~~~~~~~~~~~~~~~~~~~~~~~~~~~~~~~~~~
--
                 from /root/FC31-64_K5.3.14_GCC9.2.1/x86_64-native-linuxapp-gcc/fdd2452bc8d44f2bbc2f919d9f93ff17/dpdk/x86_64-native-linuxapp-gcc/include/rte_mempool.h:51,
                 from /root/FC31-64_K5.3.14_GCC9.2.1/x86_64-native-linuxapp-gcc/fdd2452bc8d44f2bbc2f919d9f93ff17/dpdk/x86_64-native-linuxapp-gcc/include/rte_mbuf.h:38,
                 from /root/FC31-64_K5.3.14_GCC9.2.1/x86_64-native-linuxapp-gcc/fdd2452bc8d44f2bbc2f919d9f93ff17/dpdk/x86_64-native-linuxapp-gcc/include/rte_ip.h:24,
                 from /root/FC31-64_K5.3.14_GCC9.2.1/x86_64-native-linuxapp-gcc/fdd2452bc8d44f2bbc2f919d9f93ff17/dpdk/x86_64-native-linuxapp-gcc/include/rte_net.h:12,
                 from /root/FC31-64_K5.3.14_GCC9.2.1/x86_64-native-linuxapp-gcc/fdd2452bc8d44f2bbc2f919d9f93ff17/dpdk/drivers/net/virtio/virtio_rxtx_packed_avx.c:11:
/usr/lib/gcc/x86_64-redhat-linux/9/include/avx512vlbwintrin.h:3677:1: error: inlining failed in call to always_inline ‘_mm256_cmpneq_epu16_mask’: target specific option mismatch
 3677 | _mm256_cmpneq_epu16_mask (__m256i __X, __m256i __Y)
      | ^~~~~~~~~~~~~~~~~~~~~~~~
/root/FC31-64_K5.3.14_GCC9.2.1/x86_64-native-linuxapp-gcc/fdd2452bc8d44f2bbc2f919d9f93ff17/dpdk/drivers/net/virtio/virtio_rxtx_packed_avx.c:132:17: note: called from here
  132 |  uint16_t cmp = _mm256_cmpneq_epu16_mask(mbufs, mbuf_ref);
      |                 ^~~~~~~~~~~~~~~~~~~~~~~~~~~~~~~~~~~~~~~~~
--
                 from /root/FC31-64_K5.3.14_GCC9.2.1/x86_64-native-linuxapp-gcc/fdd2452bc8d44f2bbc2f919d9f93ff17/dpdk/x86_64-native-linuxapp-gcc/include/rte_mempool.h:51,
                 from /root/FC31-64_K5.3.14_GCC9.2.1/x86_64-native-linuxapp-gcc/fdd2452bc8d44f2bbc2f919d9f93ff17/dpdk/x86_64-native-linuxapp-gcc/include/rte_mbuf.h:38,
                 from /root/FC31-64_K5.3.14_GCC9.2.1/x86_64-native-linuxapp-gcc/fdd2452bc8d44f2bbc2f919d9f93ff17/dpdk/x86_64-native-linuxapp-gcc/include/rte_ip.h:24,
                 from /root/FC31-64_K5.3.14_GCC9.2.1/x86_64-native-linuxapp-gcc/fdd2452bc8d44f2bbc2f919d9f93ff17/dpdk/x86_64-native-linuxapp-gcc/include/rte_net.h:12,
                 from /root/FC31-64_K5.3.14_GCC9.2.1/x86_64-native-linuxapp-gcc/fdd2452bc8d44f2bbc2f919d9f93ff17/dpdk/drivers/net/virtio/virtio_rxtx_packed_avx.c:11:
/usr/lib/gcc/x86_64-redhat-linux/9/include/avx512fintrin.h:79:1: error: inlining failed in call to always_inline ‘_mm512_set_epi64’: target specific option mismatch
   79 | _mm512_set_epi64 (long long __A, long long __B, long long __C,
      | ^~~~~~~~~~~~~~~~
/root/FC31-64_K5.3.14_GCC9.2.1/x86_64-native-linuxapp-gcc/fdd2452bc8d44f2bbc2f919d9f93ff17/dpdk/drivers/net/virtio/virtio_rxtx_packed_avx.c:152:22: note: called from here
  152 |  __m512i new_descs = _mm512_set_epi64(
      |                      ^~~~~~~~~~~~~~~~~
--
                 from /root/FC31-64_K5.3.14_GCC9.2.1/x86_64-native-linuxapp-gcc/fdd2452bc8d44f2bbc2f919d9f93ff17/dpdk/x86_64-native-linuxapp-gcc/include/rte_mempool.h:51,
                 from /root/FC31-64_K5.3.14_GCC9.2.1/x86_64-native-linuxapp-gcc/fdd2452bc8d44f2bbc2f919d9f93ff17/dpdk/x86_64-native-linuxapp-gcc/include/rte_mbuf.h:38,
                 from /root/FC31-64_K5.3.14_GCC9.2.1/x86_64-native-linuxapp-gcc/fdd2452bc8d44f2bbc2f919d9f93ff17/dpdk/x86_64-native-linuxapp-gcc/include/rte_ip.h:24,
                 from /root/FC31-64_K5.3.14_GCC9.2.1/x86_64-native-linuxapp-gcc/fdd2452bc8d44f2bbc2f919d9f93ff17/dpdk/x86_64-native-linuxapp-gcc/include/rte_net.h:12,
                 from /root/FC31-64_K5.3.14_GCC9.2.1/x86_64-native-linuxapp-gcc/fdd2452bc8d44f2bbc2f919d9f93ff17/dpdk/drivers/net/virtio/virtio_rxtx_packed_avx.c:11:
/usr/lib/gcc/x86_64-redhat-linux/9/include/avx512fintrin.h:6408:1: error: inlining failed in call to always_inline ‘_mm512_storeu_si512’: target specific option mismatch
 6408 | _mm512_storeu_si512 (void *__P, __m512i __A)
      | ^~~~~~~~~~~~~~~~~~~
/root/FC31-64_K5.3.14_GCC9.2.1/x86_64-native-linuxapp-gcc/fdd2452bc8d44f2bbc2f919d9f93ff17/dpdk/drivers/net/virtio/virtio_rxtx_packed_avx.c:172:2: note: called from here
  172 |  _mm512_storeu_si512((void *)&vq->vq_packed.ring.desc[idx], new_descs);
      |  ^~~~~~~~~~~~~~~~~~~~~~~~~~~~~~~~~~~~~~~~~~~~~~~~~~~~~~~~~~~~~~~~~~~~~
--
                 from /root/FC31-64_K5.3.14_GCC9.2.1/x86_64-native-linuxapp-gcc/fdd2452bc8d44f2bbc2f919d9f93ff17/dpdk/x86_64-native-linuxapp-gcc/include/rte_mempool.h:51,
                 from /root/FC31-64_K5.3.14_GCC9.2.1/x86_64-native-linuxapp-gcc/fdd2452bc8d44f2bbc2f919d9f93ff17/dpdk/x86_64-native-linuxapp-gcc/include/rte_mbuf.h:38,
                 from /root/FC31-64_K5.3.14_GCC9.2.1/x86_64-native-linuxapp-gcc/fdd2452bc8d44f2bbc2f919d9f93ff17/dpdk/x86_64-native-linuxapp-gcc/include/rte_ip.h:24,
                 from /root/FC31-64_K5.3.14_GCC9.2.1/x86_64-native-linuxapp-gcc/fdd2452bc8d44f2bbc2f919d9f93ff17/dpdk/x86_64-native-linuxapp-gcc/include/rte_net.h:12,
                 from /root/FC31-64_K5.3.14_GCC9.2.1/x86_64-native-linuxapp-gcc/fdd2452bc8d44f2bbc2f919d9f93ff17/dpdk/drivers/net/virtio/virtio_rxtx_packed_avx.c:11:
/usr/lib/gcc/x86_64-redhat-linux/9/include/avx512vlbwintrin.h:3677:1: error: inlining failed in call to always_inline ‘_mm256_cmpneq_epu16_mask’: target specific option mismatch
 3677 | _mm256_cmpneq_epu16_mask (__m256i __X, __m256i __Y)
      | ^~~~~~~~~~~~~~~~~~~~~~~~
/root/FC31-64_K5.3.14_GCC9.2.1/x86_64-native-linuxapp-gcc/fdd2452bc8d44f2bbc2f919d9f93ff17/dpdk/drivers/net/virtio/virtio_rxtx_packed_avx.c:132:17: note: called from here
  132 |  uint16_t cmp = _mm256_cmpneq_epu16_mask(mbufs, mbuf_ref);
      |                 ^~~~~~~~~~~~~~~~~~~~~~~~~~~~~~~~~~~~~~~~~
--
                 from /root/FC31-64_K5.3.14_GCC9.2.1/x86_64-native-linuxapp-gcc/fdd2452bc8d44f2bbc2f919d9f93ff17/dpdk/x86_64-native-linuxapp-gcc/include/rte_mempool.h:51,
                 from /root/FC31-64_K5.3.14_GCC9.2.1/x86_64-native-linuxapp-gcc/fdd2452bc8d44f2bbc2f919d9f93ff17/dpdk/x86_64-native-linuxapp-gcc/include/rte_mbuf.h:38,
                 from /root/FC31-64_K5.3.14_GCC9.2.1/x86_64-native-linuxapp-gcc/fdd2452bc8d44f2bbc2f919d9f93ff17/dpdk/x86_64-native-linuxapp-gcc/include/rte_ip.h:24,
                 from /root/FC31-64_K5.3.14_GCC9.2.1/x86_64-native-linuxapp-gcc/fdd2452bc8d44f2bbc2f919d9f93ff17/dpdk/x86_64-native-linuxapp-gcc/include/rte_net.h:12,
                 from /root/FC31-64_K5.3.14_GCC9.2.1/x86_64-native-linuxapp-gcc/fdd2452bc8d44f2bbc2f919d9f93ff17/dpdk/drivers/net/virtio/virtio_rxtx_packed_avx.c:11:
/usr/lib/gcc/x86_64-redhat-linux/9/include/avx512fintrin.h:79:1: error: inlining failed in call to always_inline ‘_mm512_set_epi64’: target specific option mismatch
   79 | _mm512_set_epi64 (long long __A, long long __B, long long __C,
      | ^~~~~~~~~~~~~~~~
/root/FC31-64_K5.3.14_GCC9.2.1/x86_64-native-linuxapp-gcc/fdd2452bc8d44f2bbc2f919d9f93ff17/dpdk/drivers/net/virtio/virtio_rxtx_packed_avx.c:152:22: note: called from here
  152 |  __m512i new_descs = _mm512_set_epi64(
      |                      ^~~~~~~~~~~~~~~~~
--
                 from /root/FC31-64_K5.3.14_GCC9.2.1/x86_64-native-linuxapp-gcc/fdd2452bc8d44f2bbc2f919d9f93ff17/dpdk/x86_64-native-linuxapp-gcc/include/rte_mempool.h:51,
                 from /root/FC31-64_K5.3.14_GCC9.2.1/x86_64-native-linuxapp-gcc/fdd2452bc8d44f2bbc2f919d9f93ff17/dpdk/x86_64-native-linuxapp-gcc/include/rte_mbuf.h:38,
                 from /root/FC31-64_K5.3.14_GCC9.2.1/x86_64-native-linuxapp-gcc/fdd2452bc8d44f2bbc2f919d9f93ff17/dpdk/x86_64-native-linuxapp-gcc/include/rte_ip.h:24,
                 from /root/FC31-64_K5.3.14_GCC9.2.1/x86_64-native-linuxapp-gcc/fdd2452bc8d44f2bbc2f919d9f93ff17/dpdk/x86_64-native-linuxapp-gcc/include/rte_net.h:12,
                 from /root/FC31-64_K5.3.14_GCC9.2.1/x86_64-native-linuxapp-gcc/fdd2452bc8d44f2bbc2f919d9f93ff17/dpdk/drivers/net/virtio/virtio_rxtx_packed_avx.c:11:
/usr/lib/gcc/x86_64-redhat-linux/9/include/avx512fintrin.h:6408:1: error: inlining failed in call to always_inline ‘_mm512_storeu_si512’: target specific option mismatch
 6408 | _mm512_storeu_si512 (void *__P, __m512i __A)
      | ^~~~~~~~~~~~~~~~~~~
/root/FC31-64_K5.3.14_GCC9.2.1/x86_64-native-linuxapp-gcc/fdd2452bc8d44f2bbc2f919d9f93ff17/dpdk/drivers/net/virtio/virtio_rxtx_packed_avx.c:172:2: note: called from here
  172 |  _mm512_storeu_si512((void *)&vq->vq_packed.ring.desc[idx], new_descs);
      |  ^~~~~~~~~~~~~~~~~~~~~~~~~~~~~~~~~~~~~~~~~~~~~~~~~~~~~~~~~~~~~~~~~~~~~
make[6]: *** [/root/FC31-64_K5.3.14_GCC9.2.1/x86_64-native-linuxapp-gcc/fdd2452bc8d44f2bbc2f919d9f93ff17/dpdk/mk/internal/rte.compile-pre.mk:114: virtio_rxtx_packed_avx.o] Error 1
make[6]: *** Waiting for unfinished jobs....
  CC siena_nic.o
  AR librte_pmd_vmxnet3_uio.a
  INSTALL-LIB librte_pmd_vmxnet3_uio.a
  CC siena_nvram.o
  CC siena_phy.o
  CC otx2_flow_ctrl.o
  CC otx2_flow_parse.o
make[5]: *** [/root/FC31-64_K5.3.14_GCC9.2.1/x86_64-native-linuxapp-gcc/fdd2452bc8d44f2bbc2f919d9f93ff17/dpdk/mk/rte.subdir.mk:35: virtio] Error 2
make[5]: *** Waiting for unfinished jobs....
  CC bcm_osal.o
  CC siena_sram.o
  CC otx2_flow_utils.o
  SYMLINK-FILE include/rte_eth_softnic.h
--
  AR librte_pmd_sfc_efx.a
  INSTALL-LIB librte_pmd_sfc_efx.a
  CC conn.o
  AR librte_pmd_softnic.a
  INSTALL-LIB librte_pmd_softnic.a
make[4]: *** [/root/FC31-64_K5.3.14_GCC9.2.1/x86_64-native-linuxapp-gcc/fdd2452bc8d44f2bbc2f919d9f93ff17/dpdk/mk/rte.subdir.mk:35: net] Error 2
make[3]: *** [/root/FC31-64_K5.3.14_GCC9.2.1/x86_64-native-linuxapp-gcc/fdd2452bc8d44f2bbc2f919d9f93ff17/dpdk/mk/rte.sdkbuild.mk:46: drivers] Error 2
make[2]: *** [/root/FC31-64_K5.3.14_GCC9.2.1/x86_64-native-linuxapp-gcc/fdd2452bc8d44f2bbc2f919d9f93ff17/dpdk/mk/rte.sdkroot.mk:99: all] Error 2
make[1]: *** [/root/FC31-64_K5.3.14_GCC9.2.1/x86_64-native-linuxapp-gcc/fdd2452bc8d44f2bbc2f919d9f93ff17/dpdk/mk/rte.sdkinstall.mk:61: pre_install] Error 2
make: *** [/root/FC31-64_K5.3.14_GCC9.2.1/x86_64-native-linuxapp-gcc/fdd2452bc8d44f2bbc2f919d9f93ff17/dpdk/mk/rte.sdkroot.mk:77: install] Error 2


*Make Build Failed #9:
OS: RHEL80-64
Target: x86_64-native-linuxapp-gcc
                 from /root/RHEL80-64_K3.10.0_GCC8.2.1/x86_64-native-linuxapp-gcc/fdd2452bc8d44f2bbc2f919d9f93ff17/dpdk/x86_64-native-linuxapp-gcc/include/rte_mempool.h:51,
                 from /root/RHEL80-64_K3.10.0_GCC8.2.1/x86_64-native-linuxapp-gcc/fdd2452bc8d44f2bbc2f919d9f93ff17/dpdk/x86_64-native-linuxapp-gcc/include/rte_mbuf.h:38,
                 from /root/RHEL80-64_K3.10.0_GCC8.2.1/x86_64-native-linuxapp-gcc/fdd2452bc8d44f2bbc2f919d9f93ff17/dpdk/x86_64-native-linuxapp-gcc/include/rte_ip.h:24,
                 from /root/RHEL80-64_K3.10.0_GCC8.2.1/x86_64-native-linuxapp-gcc/fdd2452bc8d44f2bbc2f919d9f93ff17/dpdk/x86_64-native-linuxapp-gcc/include/rte_net.h:12,
                 from /root/RHEL80-64_K3.10.0_GCC8.2.1/x86_64-native-linuxapp-gcc/fdd2452bc8d44f2bbc2f919d9f93ff17/dpdk/drivers/net/virtio/virtio_rxtx_packed_avx.c:11:
/usr/lib/gcc/x86_64-redhat-linux/8/include/avx512vlbwintrin.h:3677:1: error: inlining failed in call to always_inline ‘_mm256_cmpneq_epu16_mask’: target specific option mismatch
 _mm256_cmpneq_epu16_mask (__m256i __X, __m256i __Y)
 ^~~~~~~~~~~~~~~~~~~~~~~~
/root/RHEL80-64_K3.10.0_GCC8.2.1/x86_64-native-linuxapp-gcc/fdd2452bc8d44f2bbc2f919d9f93ff17/dpdk/drivers/net/virtio/virtio_rxtx_packed_avx.c:132:17: note: called from here
  uint16_t cmp = _mm256_cmpneq_epu16_mask(mbufs, mbuf_ref);
                 ^~~~~~~~~~~~~~~~~~~~~~~~~~~~~~~~~~~~~~~~~
--
                 from /root/RHEL80-64_K3.10.0_GCC8.2.1/x86_64-native-linuxapp-gcc/fdd2452bc8d44f2bbc2f919d9f93ff17/dpdk/x86_64-native-linuxapp-gcc/include/rte_mempool.h:51,
                 from /root/RHEL80-64_K3.10.0_GCC8.2.1/x86_64-native-linuxapp-gcc/fdd2452bc8d44f2bbc2f919d9f93ff17/dpdk/x86_64-native-linuxapp-gcc/include/rte_mbuf.h:38,
                 from /root/RHEL80-64_K3.10.0_GCC8.2.1/x86_64-native-linuxapp-gcc/fdd2452bc8d44f2bbc2f919d9f93ff17/dpdk/x86_64-native-linuxapp-gcc/include/rte_ip.h:24,
                 from /root/RHEL80-64_K3.10.0_GCC8.2.1/x86_64-native-linuxapp-gcc/fdd2452bc8d44f2bbc2f919d9f93ff17/dpdk/x86_64-native-linuxapp-gcc/include/rte_net.h:12,
                 from /root/RHEL80-64_K3.10.0_GCC8.2.1/x86_64-native-linuxapp-gcc/fdd2452bc8d44f2bbc2f919d9f93ff17/dpdk/drivers/net/virtio/virtio_rxtx_packed_avx.c:11:
/usr/lib/gcc/x86_64-redhat-linux/8/include/avx512vlbwintrin.h:3677:1: error: inlining failed in call to always_inline ‘_mm256_cmpneq_epu16_mask’: target specific option mismatch
 _mm256_cmpneq_epu16_mask (__m256i __X, __m256i __Y)
 ^~~~~~~~~~~~~~~~~~~~~~~~
/root/RHEL80-64_K3.10.0_GCC8.2.1/x86_64-native-linuxapp-gcc/fdd2452bc8d44f2bbc2f919d9f93ff17/dpdk/drivers/net/virtio/virtio_rxtx_packed_avx.c:132:17: note: called from here
  uint16_t cmp = _mm256_cmpneq_epu16_mask(mbufs, mbuf_ref);
                 ^~~~~~~~~~~~~~~~~~~~~~~~~~~~~~~~~~~~~~~~~
--
                 from /root/RHEL80-64_K3.10.0_GCC8.2.1/x86_64-native-linuxapp-gcc/fdd2452bc8d44f2bbc2f919d9f93ff17/dpdk/x86_64-native-linuxapp-gcc/include/rte_mempool.h:51,
                 from /root/RHEL80-64_K3.10.0_GCC8.2.1/x86_64-native-linuxapp-gcc/fdd2452bc8d44f2bbc2f919d9f93ff17/dpdk/x86_64-native-linuxapp-gcc/include/rte_mbuf.h:38,
                 from /root/RHEL80-64_K3.10.0_GCC8.2.1/x86_64-native-linuxapp-gcc/fdd2452bc8d44f2bbc2f919d9f93ff17/dpdk/x86_64-native-linuxapp-gcc/include/rte_ip.h:24,
                 from /root/RHEL80-64_K3.10.0_GCC8.2.1/x86_64-native-linuxapp-gcc/fdd2452bc8d44f2bbc2f919d9f93ff17/dpdk/x86_64-native-linuxapp-gcc/include/rte_net.h:12,
                 from /root/RHEL80-64_K3.10.0_GCC8.2.1/x86_64-native-linuxapp-gcc/fdd2452bc8d44f2bbc2f919d9f93ff17/dpdk/drivers/net/virtio/virtio_rxtx_packed_avx.c:11:
/usr/lib/gcc/x86_64-redhat-linux/8/include/avx512fintrin.h:79:1: error: inlining failed in call to always_inline ‘_mm512_set_epi64’: target specific option mismatch
 _mm512_set_epi64 (long long __A, long long __B, long long __C,
 ^~~~~~~~~~~~~~~~
/root/RHEL80-64_K3.10.0_GCC8.2.1/x86_64-native-linuxapp-gcc/fdd2452bc8d44f2bbc2f919d9f93ff17/dpdk/drivers/net/virtio/virtio_rxtx_packed_avx.c:152:22: note: called from here
  __m512i new_descs = _mm512_set_epi64(
                      ^~~~~~~~~~~~~~~~~
--
                 from /root/RHEL80-64_K3.10.0_GCC8.2.1/x86_64-native-linuxapp-gcc/fdd2452bc8d44f2bbc2f919d9f93ff17/dpdk/x86_64-native-linuxapp-gcc/include/rte_mempool.h:51,
                 from /root/RHEL80-64_K3.10.0_GCC8.2.1/x86_64-native-linuxapp-gcc/fdd2452bc8d44f2bbc2f919d9f93ff17/dpdk/x86_64-native-linuxapp-gcc/include/rte_mbuf.h:38,
                 from /root/RHEL80-64_K3.10.0_GCC8.2.1/x86_64-native-linuxapp-gcc/fdd2452bc8d44f2bbc2f919d9f93ff17/dpdk/x86_64-native-linuxapp-gcc/include/rte_ip.h:24,
                 from /root/RHEL80-64_K3.10.0_GCC8.2.1/x86_64-native-linuxapp-gcc/fdd2452bc8d44f2bbc2f919d9f93ff17/dpdk/x86_64-native-linuxapp-gcc/include/rte_net.h:12,
                 from /root/RHEL80-64_K3.10.0_GCC8.2.1/x86_64-native-linuxapp-gcc/fdd2452bc8d44f2bbc2f919d9f93ff17/dpdk/drivers/net/virtio/virtio_rxtx_packed_avx.c:11:
/usr/lib/gcc/x86_64-redhat-linux/8/include/avx512fintrin.h:6260:1: error: inlining failed in call to always_inline ‘_mm512_storeu_si512’: target specific option mismatch
 _mm512_storeu_si512 (void *__P, __m512i __A)
 ^~~~~~~~~~~~~~~~~~~
/root/RHEL80-64_K3.10.0_GCC8.2.1/x86_64-native-linuxapp-gcc/fdd2452bc8d44f2bbc2f919d9f93ff17/dpdk/drivers/net/virtio/virtio_rxtx_packed_avx.c:172:2: note: called from here
  _mm512_storeu_si512((void *)&vq->vq_packed.ring.desc[idx], new_descs);
  ^~~~~~~~~~~~~~~~~~~~~~~~~~~~~~~~~~~~~~~~~~~~~~~~~~~~~~~~~~~~~~~~~~~~~
--
                 from /root/RHEL80-64_K3.10.0_GCC8.2.1/x86_64-native-linuxapp-gcc/fdd2452bc8d44f2bbc2f919d9f93ff17/dpdk/x86_64-native-linuxapp-gcc/include/rte_mempool.h:51,
                 from /root/RHEL80-64_K3.10.0_GCC8.2.1/x86_64-native-linuxapp-gcc/fdd2452bc8d44f2bbc2f919d9f93ff17/dpdk/x86_64-native-linuxapp-gcc/include/rte_mbuf.h:38,
                 from /root/RHEL80-64_K3.10.0_GCC8.2.1/x86_64-native-linuxapp-gcc/fdd2452bc8d44f2bbc2f919d9f93ff17/dpdk/x86_64-native-linuxapp-gcc/include/rte_ip.h:24,
                 from /root/RHEL80-64_K3.10.0_GCC8.2.1/x86_64-native-linuxapp-gcc/fdd2452bc8d44f2bbc2f919d9f93ff17/dpdk/x86_64-native-linuxapp-gcc/include/rte_net.h:12,
                 from /root/RHEL80-64_K3.10.0_GCC8.2.1/x86_64-native-linuxapp-gcc/fdd2452bc8d44f2bbc2f919d9f93ff17/dpdk/drivers/net/virtio/virtio_rxtx_packed_avx.c:11:
/usr/lib/gcc/x86_64-redhat-linux/8/include/avx512vlbwintrin.h:3677:1: error: inlining failed in call to always_inline ‘_mm256_cmpneq_epu16_mask’: target specific option mismatch
 _mm256_cmpneq_epu16_mask (__m256i __X, __m256i __Y)
 ^~~~~~~~~~~~~~~~~~~~~~~~
/root/RHEL80-64_K3.10.0_GCC8.2.1/x86_64-native-linuxapp-gcc/fdd2452bc8d44f2bbc2f919d9f93ff17/dpdk/drivers/net/virtio/virtio_rxtx_packed_avx.c:132:17: note: called from here
  uint16_t cmp = _mm256_cmpneq_epu16_mask(mbufs, mbuf_ref);
                 ^~~~~~~~~~~~~~~~~~~~~~~~~~~~~~~~~~~~~~~~~
--
                 from /root/RHEL80-64_K3.10.0_GCC8.2.1/x86_64-native-linuxapp-gcc/fdd2452bc8d44f2bbc2f919d9f93ff17/dpdk/x86_64-native-linuxapp-gcc/include/rte_mempool.h:51,
                 from /root/RHEL80-64_K3.10.0_GCC8.2.1/x86_64-native-linuxapp-gcc/fdd2452bc8d44f2bbc2f919d9f93ff17/dpdk/x86_64-native-linuxapp-gcc/include/rte_mbuf.h:38,
                 from /root/RHEL80-64_K3.10.0_GCC8.2.1/x86_64-native-linuxapp-gcc/fdd2452bc8d44f2bbc2f919d9f93ff17/dpdk/x86_64-native-linuxapp-gcc/include/rte_ip.h:24,
                 from /root/RHEL80-64_K3.10.0_GCC8.2.1/x86_64-native-linuxapp-gcc/fdd2452bc8d44f2bbc2f919d9f93ff17/dpdk/x86_64-native-linuxapp-gcc/include/rte_net.h:12,
                 from /root/RHEL80-64_K3.10.0_GCC8.2.1/x86_64-native-linuxapp-gcc/fdd2452bc8d44f2bbc2f919d9f93ff17/dpdk/drivers/net/virtio/virtio_rxtx_packed_avx.c:11:
/usr/lib/gcc/x86_64-redhat-linux/8/include/avx512fintrin.h:79:1: error: inlining failed in call to always_inline ‘_mm512_set_epi64’: target specific option mismatch
 _mm512_set_epi64 (long long __A, long long __B, long long __C,
 ^~~~~~~~~~~~~~~~
/root/RHEL80-64_K3.10.0_GCC8.2.1/x86_64-native-linuxapp-gcc/fdd2452bc8d44f2bbc2f919d9f93ff17/dpdk/drivers/net/virtio/virtio_rxtx_packed_avx.c:152:22: note: called from here
  __m512i new_descs = _mm512_set_epi64(
                      ^~~~~~~~~~~~~~~~~
--
                 from /root/RHEL80-64_K3.10.0_GCC8.2.1/x86_64-native-linuxapp-gcc/fdd2452bc8d44f2bbc2f919d9f93ff17/dpdk/x86_64-native-linuxapp-gcc/include/rte_mempool.h:51,
                 from /root/RHEL80-64_K3.10.0_GCC8.2.1/x86_64-native-linuxapp-gcc/fdd2452bc8d44f2bbc2f919d9f93ff17/dpdk/x86_64-native-linuxapp-gcc/include/rte_mbuf.h:38,
                 from /root/RHEL80-64_K3.10.0_GCC8.2.1/x86_64-native-linuxapp-gcc/fdd2452bc8d44f2bbc2f919d9f93ff17/dpdk/x86_64-native-linuxapp-gcc/include/rte_ip.h:24,
                 from /root/RHEL80-64_K3.10.0_GCC8.2.1/x86_64-native-linuxapp-gcc/fdd2452bc8d44f2bbc2f919d9f93ff17/dpdk/x86_64-native-linuxapp-gcc/include/rte_net.h:12,
                 from /root/RHEL80-64_K3.10.0_GCC8.2.1/x86_64-native-linuxapp-gcc/fdd2452bc8d44f2bbc2f919d9f93ff17/dpdk/drivers/net/virtio/virtio_rxtx_packed_avx.c:11:
/usr/lib/gcc/x86_64-redhat-linux/8/include/avx512fintrin.h:6260:1: error: inlining failed in call to always_inline ‘_mm512_storeu_si512’: target specific option mismatch
 _mm512_storeu_si512 (void *__P, __m512i __A)
 ^~~~~~~~~~~~~~~~~~~
/root/RHEL80-64_K3.10.0_GCC8.2.1/x86_64-native-linuxapp-gcc/fdd2452bc8d44f2bbc2f919d9f93ff17/dpdk/drivers/net/virtio/virtio_rxtx_packed_avx.c:172:2: note: called from here
  _mm512_storeu_si512((void *)&vq->vq_packed.ring.desc[idx], new_descs);
  ^~~~~~~~~~~~~~~~~~~~~~~~~~~~~~~~~~~~~~~~~~~~~~~~~~~~~~~~~~~~~~~~~~~~~
/root/RHEL80-64_K3.10.0_GCC8.2.1/x86_64-native-linuxapp-gcc/fdd2452bc8d44f2bbc2f919d9f93ff17/dpdk/drivers/net/virtio/virtio_rxtx_packed_avx.c: At top level:
cc1: warning: unrecognized command line option ‘-Wno-address-of-packed-member’
make[6]: *** [/root/RHEL80-64_K3.10.0_GCC8.2.1/x86_64-native-linuxapp-gcc/fdd2452bc8d44f2bbc2f919d9f93ff17/dpdk/mk/internal/rte.compile-pre.mk:116: virtio_rxtx_packed_avx.o] Error 1
make[6]: *** Waiting for unfinished jobs....
  CC sfc_dp.o
  CC sfc_ef10_rx.o
  PMDINFO rte_eth_vhost.o.pmd.c
  CC rte_eth_vhost.o.pmd.o
--
  CC virtio_ethdev.o.pmd.o
  INSTALL-LIB librte_pmd_vhost.a
  LD virtio_ethdev.o
  CC bcm_osal.o
  CC sfc_ef10_essb_rx.o
make[5]: *** [/root/RHEL80-64_K3.10.0_GCC8.2.1/x86_64-native-linuxapp-gcc/fdd2452bc8d44f2bbc2f919d9f93ff17/dpdk/mk/rte.subdir.mk:35: virtio] Error 2
make[5]: *** Waiting for unfinished jobs....
  CC sfc_ef10_tx.o
  CC efx_bootcfg.o
  CC ice_generic_flow.o
  CC rte_eth_softnic_link.o
--
  CC hunt_nic.o
  CC medford_nic.o
  CC medford2_nic.o
  AR librte_pmd_sfc_efx.a
  INSTALL-LIB librte_pmd_sfc_efx.a
make[4]: *** [/root/RHEL80-64_K3.10.0_GCC8.2.1/x86_64-native-linuxapp-gcc/fdd2452bc8d44f2bbc2f919d9f93ff17/dpdk/mk/rte.subdir.mk:35: net] Error 2
make[3]: *** [/root/RHEL80-64_K3.10.0_GCC8.2.1/x86_64-native-linuxapp-gcc/fdd2452bc8d44f2bbc2f919d9f93ff17/dpdk/mk/rte.sdkbuild.mk:46: drivers] Error 2
make[2]: *** [/root/RHEL80-64_K3.10.0_GCC8.2.1/x86_64-native-linuxapp-gcc/fdd2452bc8d44f2bbc2f919d9f93ff17/dpdk/mk/rte.sdkroot.mk:99: all] Error 2
make[1]: *** [/root/RHEL80-64_K3.10.0_GCC8.2.1/x86_64-native-linuxapp-gcc/fdd2452bc8d44f2bbc2f919d9f93ff17/dpdk/mk/rte.sdkinstall.mk:61: pre_install] Error 2
make: *** [/root/RHEL80-64_K3.10.0_GCC8.2.1/x86_64-native-linuxapp-gcc/fdd2452bc8d44f2bbc2f919d9f93ff17/dpdk/mk/rte.sdkroot.mk:77: install] Error 2


*Make Build Failed #10:
OS: SUSE15-64
Target: x86_64-native-linuxapp-clang
        ^
/usr/lib64/clang/5.0.1/include/avx512fintrin.h:8390:3: note: expanded from macro '_mm512_i64scatter_epi64'
  __builtin_ia32_scatterdiv8di((long long *)(addr), (__mmask8)-1, \
  ^
15 errors generated.
make[6]: *** [/root/SUSE15-64_K4.12.14_Clang5.0.1/x86_64-native-linuxapp-clang/fdd2452bc8d44f2bbc2f919d9f93ff17/dpdk/mk/internal/rte.compile-pre.mk:116: virtio_rxtx_packed_avx.o] Error 1
make[6]: *** Waiting for unfinished jobs....
  CC rte_eth_softnic_action.o
  CC efx_intr.o
  CC efx_lic.o
  CC rte_eth_softnic_pipeline.o
--
  CC rte_eth_softnic_thread.o
  CC efx_mcdi.o
  CC efx_mon.o
  CC rte_eth_softnic_cli.o
  CC rte_eth_softnic_flow.o
make[5]: *** [/root/SUSE15-64_K4.12.14_Clang5.0.1/x86_64-native-linuxapp-clang/fdd2452bc8d44f2bbc2f919d9f93ff17/dpdk/mk/rte.subdir.mk:35: virtio] Error 2
make[5]: *** Waiting for unfinished jobs....
  CC efx_nic.o
  CC rte_eth_softnic_meter.o
  CC efx_nvram.o
  CC rte_eth_softnic_cryptodev.o
--
  CC hunt_nic.o
  CC medford_nic.o
  CC medford2_nic.o
  AR librte_pmd_sfc_efx.a
  INSTALL-LIB librte_pmd_sfc_efx.a
make[4]: *** [/root/SUSE15-64_K4.12.14_Clang5.0.1/x86_64-native-linuxapp-clang/fdd2452bc8d44f2bbc2f919d9f93ff17/dpdk/mk/rte.subdir.mk:35: net] Error 2
make[3]: *** [/root/SUSE15-64_K4.12.14_Clang5.0.1/x86_64-native-linuxapp-clang/fdd2452bc8d44f2bbc2f919d9f93ff17/dpdk/mk/rte.sdkbuild.mk:46: drivers] Error 2
make[2]: *** [/root/SUSE15-64_K4.12.14_Clang5.0.1/x86_64-native-linuxapp-clang/fdd2452bc8d44f2bbc2f919d9f93ff17/dpdk/mk/rte.sdkroot.mk:99: all] Error 2
make[1]: *** [/root/SUSE15-64_K4.12.14_Clang5.0.1/x86_64-native-linuxapp-clang/fdd2452bc8d44f2bbc2f919d9f93ff17/dpdk/mk/rte.sdkinstall.mk:61: pre_install] Error 2
make: *** [/root/SUSE15-64_K4.12.14_Clang5.0.1/x86_64-native-linuxapp-clang/fdd2452bc8d44f2bbc2f919d9f93ff17/dpdk/mk/rte.sdkroot.mk:77: install] Error 2


*Make Build Failed #11:
OS: FC31-64
Target: x86_64-native-linuxapp-clang
        ^
/usr/lib64/clang/9.0.0/include/avx512fintrin.h:7737:3: note: expanded from macro '_mm512_i64scatter_epi64'
  __builtin_ia32_scatterdiv8di((void *)(addr), (__mmask8)-1, \
  ^
16 errors generated.
make[6]: *** [/root/FC31-64_K5.3.14_Clang9.0.0/x86_64-native-linuxapp-clang/fdd2452bc8d44f2bbc2f919d9f93ff17/dpdk/mk/internal/rte.compile-pre.mk:114: virtio_rxtx_packed_avx.o] Error 1
make[6]: *** Waiting for unfinished jobs....
  CC virtio_user/vhost_kernel.o
  CC efx_nvram.o
  CC rte_eth_softnic_link.o
  AR librte_pmd_qede.a
--
  AR librte_pmd_vhost.a
  INSTALL-LIB librte_pmd_vhost.a
  CC efx_proxy.o
  CC rte_eth_softnic_pipeline.o
  CC rte_eth_softnic_thread.o
make[5]: *** [/root/FC31-64_K5.3.14_Clang9.0.0/x86_64-native-linuxapp-clang/fdd2452bc8d44f2bbc2f919d9f93ff17/dpdk/mk/rte.subdir.mk:35: virtio] Error 2
make[5]: *** Waiting for unfinished jobs....
  CC rte_eth_softnic_cli.o
  CC efx_rx.o
  CC rte_eth_softnic_flow.o
  CC efx_sram.o
--
  CC hunt_nic.o
  CC medford_nic.o
  CC medford2_nic.o
  AR librte_pmd_sfc_efx.a
  INSTALL-LIB librte_pmd_sfc_efx.a
make[4]: *** [/root/FC31-64_K5.3.14_Clang9.0.0/x86_64-native-linuxapp-clang/fdd2452bc8d44f2bbc2f919d9f93ff17/dpdk/mk/rte.subdir.mk:35: net] Error 2
make[3]: *** [/root/FC31-64_K5.3.14_Clang9.0.0/x86_64-native-linuxapp-clang/fdd2452bc8d44f2bbc2f919d9f93ff17/dpdk/mk/rte.sdkbuild.mk:46: drivers] Error 2
make[2]: *** [/root/FC31-64_K5.3.14_Clang9.0.0/x86_64-native-linuxapp-clang/fdd2452bc8d44f2bbc2f919d9f93ff17/dpdk/mk/rte.sdkroot.mk:99: all] Error 2
make[1]: *** [/root/FC31-64_K5.3.14_Clang9.0.0/x86_64-native-linuxapp-clang/fdd2452bc8d44f2bbc2f919d9f93ff17/dpdk/mk/rte.sdkinstall.mk:61: pre_install] Error 2
make: *** [/root/FC31-64_K5.3.14_Clang9.0.0/x86_64-native-linuxapp-clang/fdd2452bc8d44f2bbc2f919d9f93ff17/dpdk/mk/rte.sdkroot.mk:77: install] Error 2


*Make Build Failed #12:
OS: UB1604-64
Target: x86_64-native-linuxapp-gcc
                 from /root/UB1604-64_K4.4.0_GCC5.4.0/x86_64-native-linuxapp-gcc/fdd2452bc8d44f2bbc2f919d9f93ff17/dpdk/x86_64-native-linuxapp-gcc/include/rte_mbuf.h:38,
                 from /root/UB1604-64_K4.4.0_GCC5.4.0/x86_64-native-linuxapp-gcc/fdd2452bc8d44f2bbc2f919d9f93ff17/dpdk/x86_64-native-linuxapp-gcc/include/rte_ip.h:24,
                 from /root/UB1604-64_K4.4.0_GCC5.4.0/x86_64-native-linuxapp-gcc/fdd2452bc8d44f2bbc2f919d9f93ff17/dpdk/x86_64-native-linuxapp-gcc/include/rte_net.h:12,
                 from /root/UB1604-64_K4.4.0_GCC5.4.0/x86_64-native-linuxapp-gcc/fdd2452bc8d44f2bbc2f919d9f93ff17/dpdk/drivers/net/virtio/virtio_rxtx_packed_avx.c:11:
/root/UB1604-64_K4.4.0_GCC5.4.0/x86_64-native-linuxapp-gcc/fdd2452bc8d44f2bbc2f919d9f93ff17/dpdk/drivers/net/virtio/virtio_rxtx_packed_avx.c: In function ‘virtqueue_enqueue_batch_packed_vec’:
/usr/lib/gcc/x86_64-linux-gnu/5/include/avx512vlbwintrin.h:3644:1: error: inlining failed in call to always_inline ‘_mm256_cmpneq_epu16_mask’: target specific option mismatch
 _mm256_cmpneq_epu16_mask (__m256i __X, __m256i __Y)
 ^
/root/UB1604-64_K4.4.0_GCC5.4.0/x86_64-native-linuxapp-gcc/fdd2452bc8d44f2bbc2f919d9f93ff17/dpdk/drivers/net/virtio/virtio_rxtx_packed_avx.c:132:11: error: called from here
  uint16_t cmp = _mm256_cmpneq_epu16_mask(mbufs, mbuf_ref);
           ^
--
                 from /root/UB1604-64_K4.4.0_GCC5.4.0/x86_64-native-linuxapp-gcc/fdd2452bc8d44f2bbc2f919d9f93ff17/dpdk/x86_64-native-linuxapp-gcc/include/rte_mempool.h:51,
                 from /root/UB1604-64_K4.4.0_GCC5.4.0/x86_64-native-linuxapp-gcc/fdd2452bc8d44f2bbc2f919d9f93ff17/dpdk/x86_64-native-linuxapp-gcc/include/rte_mbuf.h:38,
                 from /root/UB1604-64_K4.4.0_GCC5.4.0/x86_64-native-linuxapp-gcc/fdd2452bc8d44f2bbc2f919d9f93ff17/dpdk/x86_64-native-linuxapp-gcc/include/rte_ip.h:24,
                 from /root/UB1604-64_K4.4.0_GCC5.4.0/x86_64-native-linuxapp-gcc/fdd2452bc8d44f2bbc2f919d9f93ff17/dpdk/x86_64-native-linuxapp-gcc/include/rte_net.h:12,
                 from /root/UB1604-64_K4.4.0_GCC5.4.0/x86_64-native-linuxapp-gcc/fdd2452bc8d44f2bbc2f919d9f93ff17/dpdk/drivers/net/virtio/virtio_rxtx_packed_avx.c:11:
/usr/lib/gcc/x86_64-linux-gnu/5/include/avx512vlbwintrin.h:3644:1: error: inlining failed in call to always_inline ‘_mm256_cmpneq_epu16_mask’: target specific option mismatch
 _mm256_cmpneq_epu16_mask (__m256i __X, __m256i __Y)
 ^
/root/UB1604-64_K4.4.0_GCC5.4.0/x86_64-native-linuxapp-gcc/fdd2452bc8d44f2bbc2f919d9f93ff17/dpdk/drivers/net/virtio/virtio_rxtx_packed_avx.c:132:11: error: called from here
  uint16_t cmp = _mm256_cmpneq_epu16_mask(mbufs, mbuf_ref);
           ^
--
                 from /root/UB1604-64_K4.4.0_GCC5.4.0/x86_64-native-linuxapp-gcc/fdd2452bc8d44f2bbc2f919d9f93ff17/dpdk/x86_64-native-linuxapp-gcc/include/rte_mempool.h:51,
                 from /root/UB1604-64_K4.4.0_GCC5.4.0/x86_64-native-linuxapp-gcc/fdd2452bc8d44f2bbc2f919d9f93ff17/dpdk/x86_64-native-linuxapp-gcc/include/rte_mbuf.h:38,
                 from /root/UB1604-64_K4.4.0_GCC5.4.0/x86_64-native-linuxapp-gcc/fdd2452bc8d44f2bbc2f919d9f93ff17/dpdk/x86_64-native-linuxapp-gcc/include/rte_ip.h:24,
                 from /root/UB1604-64_K4.4.0_GCC5.4.0/x86_64-native-linuxapp-gcc/fdd2452bc8d44f2bbc2f919d9f93ff17/dpdk/x86_64-native-linuxapp-gcc/include/rte_net.h:12,
                 from /root/UB1604-64_K4.4.0_GCC5.4.0/x86_64-native-linuxapp-gcc/fdd2452bc8d44f2bbc2f919d9f93ff17/dpdk/drivers/net/virtio/virtio_rxtx_packed_avx.c:11:
/usr/lib/gcc/x86_64-linux-gnu/5/include/avx512vlbwintrin.h:3644:1: error: inlining failed in call to always_inline ‘_mm256_cmpneq_epu16_mask’: target specific option mismatch
 _mm256_cmpneq_epu16_mask (__m256i __X, __m256i __Y)
 ^
/root/UB1604-64_K4.4.0_GCC5.4.0/x86_64-native-linuxapp-gcc/fdd2452bc8d44f2bbc2f919d9f93ff17/dpdk/drivers/net/virtio/virtio_rxtx_packed_avx.c:132:11: error: called from here
  uint16_t cmp = _mm256_cmpneq_epu16_mask(mbufs, mbuf_ref);
           ^
/root/UB1604-64_K4.4.0_GCC5.4.0/x86_64-native-linuxapp-gcc/fdd2452bc8d44f2bbc2f919d9f93ff17/dpdk/drivers/net/virtio/virtio_rxtx_packed_avx.c: At top level:
cc1: warning: unrecognized command line option ‘-Wno-address-of-packed-member’
  INSTALL-LIB librte_pmd_vhost.a
/root/UB1604-64_K4.4.0_GCC5.4.0/x86_64-native-linuxapp-gcc/fdd2452bc8d44f2bbc2f919d9f93ff17/dpdk/mk/internal/rte.compile-pre.mk:114: recipe for target 'virtio_rxtx_packed_avx.o' failed
make[6]: *** [virtio_rxtx_packed_avx.o] Error 1
make[6]: *** Waiting for unfinished jobs....
  CC vmxnet3_ethdev.o
  CC otx2_ethdev_devargs.o
  CC sfc_dp.o
  CC sfc_ef10_rx.o
--
  CC ecore_dcbx.o
  CC bcm_osal.o
  PMDINFO vmxnet3_ethdev.o.pmd.c
  CC vmxnet3_ethdev.o.pmd.o
  LD vmxnet3_ethdev.o
/root/UB1604-64_K4.4.0_GCC5.4.0/x86_64-native-linuxapp-gcc/fdd2452bc8d44f2bbc2f919d9f93ff17/dpdk/mk/rte.subdir.mk:35: recipe for target 'virtio' failed
make[5]: *** [virtio] Error 2
make[5]: *** Waiting for unfinished jobs....
  CC ecore_sriov.o
  AR librte_pmd_vmxnet3_uio.a
  CC sfc_ef10_tx.o
  INSTALL-LIB librte_pmd_vmxnet3_uio.a
--
  CC medford2_nic.o
  AR librte_pmd_sfc_efx.a
  INSTALL-LIB librte_pmd_sfc_efx.a
  AR librte_pmd_qede.a
  INSTALL-LIB librte_pmd_qede.a
/root/UB1604-64_K4.4.0_GCC5.4.0/x86_64-native-linuxapp-gcc/fdd2452bc8d44f2bbc2f919d9f93ff17/dpdk/mk/rte.subdir.mk:35: recipe for target 'net' failed
make[4]: *** [net] Error 2
/root/UB1604-64_K4.4.0_GCC5.4.0/x86_64-native-linuxapp-gcc/fdd2452bc8d44f2bbc2f919d9f93ff17/dpdk/mk/rte.sdkbuild.mk:46: recipe for target 'drivers' failed
make[3]: *** [drivers] Error 2
/root/UB1604-64_K4.4.0_GCC5.4.0/x86_64-native-linuxapp-gcc/fdd2452bc8d44f2bbc2f919d9f93ff17/dpdk/mk/rte.sdkroot.mk:98: recipe for target 'all' failed
make[2]: *** [all] Error 2
/root/UB1604-64_K4.4.0_GCC5.4.0/x86_64-native-linuxapp-gcc/fdd2452bc8d44f2bbc2f919d9f93ff17/dpdk/mk/rte.sdkinstall.mk:60: recipe for target 'pre_install' failed
make[1]: *** [pre_install] Error 2
/root/UB1604-64_K4.4.0_GCC5.4.0/x86_64-native-linuxapp-gcc/fdd2452bc8d44f2bbc2f919d9f93ff17/dpdk/mk/rte.sdkroot.mk:77: recipe for target 'install' failed
make: *** [install] Error 2


*Make Build Failed #13:
OS: UB1804-64
Target: x86_64-native-linuxapp-gcc
                 from /root/UB1804-64_K4.15.0_GCC7.3.0/x86_64-native-linuxapp-gcc/fdd2452bc8d44f2bbc2f919d9f93ff17/dpdk/x86_64-native-linuxapp-gcc/include/rte_mempool.h:51,
                 from /root/UB1804-64_K4.15.0_GCC7.3.0/x86_64-native-linuxapp-gcc/fdd2452bc8d44f2bbc2f919d9f93ff17/dpdk/x86_64-native-linuxapp-gcc/include/rte_mbuf.h:38,
                 from /root/UB1804-64_K4.15.0_GCC7.3.0/x86_64-native-linuxapp-gcc/fdd2452bc8d44f2bbc2f919d9f93ff17/dpdk/x86_64-native-linuxapp-gcc/include/rte_ip.h:24,
                 from /root/UB1804-64_K4.15.0_GCC7.3.0/x86_64-native-linuxapp-gcc/fdd2452bc8d44f2bbc2f919d9f93ff17/dpdk/x86_64-native-linuxapp-gcc/include/rte_net.h:12,
                 from /root/UB1804-64_K4.15.0_GCC7.3.0/x86_64-native-linuxapp-gcc/fdd2452bc8d44f2bbc2f919d9f93ff17/dpdk/drivers/net/virtio/virtio_rxtx_packed_avx.c:11:
/usr/lib/gcc/x86_64-linux-gnu/7/include/avx512vlbwintrin.h:3642:1: error: inlining failed in call to always_inline ‘_mm256_cmpneq_epu16_mask’: target specific option mismatch
 _mm256_cmpneq_epu16_mask (__m256i __X, __m256i __Y)
 ^~~~~~~~~~~~~~~~~~~~~~~~
/root/UB1804-64_K4.15.0_GCC7.3.0/x86_64-native-linuxapp-gcc/fdd2452bc8d44f2bbc2f919d9f93ff17/dpdk/drivers/net/virtio/virtio_rxtx_packed_avx.c:132:11: note: called from here
  uint16_t cmp = _mm256_cmpneq_epu16_mask(mbufs, mbuf_ref);
           ^~~
--
                 from /root/UB1804-64_K4.15.0_GCC7.3.0/x86_64-native-linuxapp-gcc/fdd2452bc8d44f2bbc2f919d9f93ff17/dpdk/x86_64-native-linuxapp-gcc/include/rte_mempool.h:51,
                 from /root/UB1804-64_K4.15.0_GCC7.3.0/x86_64-native-linuxapp-gcc/fdd2452bc8d44f2bbc2f919d9f93ff17/dpdk/x86_64-native-linuxapp-gcc/include/rte_mbuf.h:38,
                 from /root/UB1804-64_K4.15.0_GCC7.3.0/x86_64-native-linuxapp-gcc/fdd2452bc8d44f2bbc2f919d9f93ff17/dpdk/x86_64-native-linuxapp-gcc/include/rte_ip.h:24,
                 from /root/UB1804-64_K4.15.0_GCC7.3.0/x86_64-native-linuxapp-gcc/fdd2452bc8d44f2bbc2f919d9f93ff17/dpdk/x86_64-native-linuxapp-gcc/include/rte_net.h:12,
                 from /root/UB1804-64_K4.15.0_GCC7.3.0/x86_64-native-linuxapp-gcc/fdd2452bc8d44f2bbc2f919d9f93ff17/dpdk/drivers/net/virtio/virtio_rxtx_packed_avx.c:11:
/usr/lib/gcc/x86_64-linux-gnu/7/include/avx512vlbwintrin.h:3642:1: error: inlining failed in call to always_inline ‘_mm256_cmpneq_epu16_mask’: target specific option mismatch
 _mm256_cmpneq_epu16_mask (__m256i __X, __m256i __Y)
 ^~~~~~~~~~~~~~~~~~~~~~~~
/root/UB1804-64_K4.15.0_GCC7.3.0/x86_64-native-linuxapp-gcc/fdd2452bc8d44f2bbc2f919d9f93ff17/dpdk/drivers/net/virtio/virtio_rxtx_packed_avx.c:132:11: note: called from here
  uint16_t cmp = _mm256_cmpneq_epu16_mask(mbufs, mbuf_ref);
           ^~~
--
                 from /root/UB1804-64_K4.15.0_GCC7.3.0/x86_64-native-linuxapp-gcc/fdd2452bc8d44f2bbc2f919d9f93ff17/dpdk/x86_64-native-linuxapp-gcc/include/rte_mempool.h:51,
                 from /root/UB1804-64_K4.15.0_GCC7.3.0/x86_64-native-linuxapp-gcc/fdd2452bc8d44f2bbc2f919d9f93ff17/dpdk/x86_64-native-linuxapp-gcc/include/rte_mbuf.h:38,
                 from /root/UB1804-64_K4.15.0_GCC7.3.0/x86_64-native-linuxapp-gcc/fdd2452bc8d44f2bbc2f919d9f93ff17/dpdk/x86_64-native-linuxapp-gcc/include/rte_ip.h:24,
                 from /root/UB1804-64_K4.15.0_GCC7.3.0/x86_64-native-linuxapp-gcc/fdd2452bc8d44f2bbc2f919d9f93ff17/dpdk/x86_64-native-linuxapp-gcc/include/rte_net.h:12,
                 from /root/UB1804-64_K4.15.0_GCC7.3.0/x86_64-native-linuxapp-gcc/fdd2452bc8d44f2bbc2f919d9f93ff17/dpdk/drivers/net/virtio/virtio_rxtx_packed_avx.c:11:
/usr/lib/gcc/x86_64-linux-gnu/7/include/avx512fintrin.h:79:1: error: inlining failed in call to always_inline ‘_mm512_set_epi64’: target specific option mismatch
 _mm512_set_epi64 (long long __A, long long __B, long long __C,
 ^~~~~~~~~~~~~~~~
/root/UB1804-64_K4.15.0_GCC7.3.0/x86_64-native-linuxapp-gcc/fdd2452bc8d44f2bbc2f919d9f93ff17/dpdk/drivers/net/virtio/virtio_rxtx_packed_avx.c:152:10: note: called from here
  __m512i new_descs = _mm512_set_epi64(
          ^~~~~~~~~
--
                 from /root/UB1804-64_K4.15.0_GCC7.3.0/x86_64-native-linuxapp-gcc/fdd2452bc8d44f2bbc2f919d9f93ff17/dpdk/x86_64-native-linuxapp-gcc/include/rte_mempool.h:51,
                 from /root/UB1804-64_K4.15.0_GCC7.3.0/x86_64-native-linuxapp-gcc/fdd2452bc8d44f2bbc2f919d9f93ff17/dpdk/x86_64-native-linuxapp-gcc/include/rte_mbuf.h:38,
                 from /root/UB1804-64_K4.15.0_GCC7.3.0/x86_64-native-linuxapp-gcc/fdd2452bc8d44f2bbc2f919d9f93ff17/dpdk/x86_64-native-linuxapp-gcc/include/rte_ip.h:24,
                 from /root/UB1804-64_K4.15.0_GCC7.3.0/x86_64-native-linuxapp-gcc/fdd2452bc8d44f2bbc2f919d9f93ff17/dpdk/x86_64-native-linuxapp-gcc/include/rte_net.h:12,
                 from /root/UB1804-64_K4.15.0_GCC7.3.0/x86_64-native-linuxapp-gcc/fdd2452bc8d44f2bbc2f919d9f93ff17/dpdk/drivers/net/virtio/virtio_rxtx_packed_avx.c:11:
/usr/lib/gcc/x86_64-linux-gnu/7/include/avx512fintrin.h:5831:1: error: inlining failed in call to always_inline ‘_mm512_storeu_si512’: target specific option mismatch
 _mm512_storeu_si512 (void *__P, __m512i __A)
 ^~~~~~~~~~~~~~~~~~~
/root/UB1804-64_K4.15.0_GCC7.3.0/x86_64-native-linuxapp-gcc/fdd2452bc8d44f2bbc2f919d9f93ff17/dpdk/drivers/net/virtio/virtio_rxtx_packed_avx.c:172:2: note: called from here
  _mm512_storeu_si512((void *)&vq->vq_packed.ring.desc[idx], new_descs);
  ^~~~~~~~~~~~~~~~~~~~~~~~~~~~~~~~~~~~~~~~~~~~~~~~~~~~~~~~~~~~~~~~~~~~~
--
                 from /root/UB1804-64_K4.15.0_GCC7.3.0/x86_64-native-linuxapp-gcc/fdd2452bc8d44f2bbc2f919d9f93ff17/dpdk/x86_64-native-linuxapp-gcc/include/rte_mempool.h:51,
                 from /root/UB1804-64_K4.15.0_GCC7.3.0/x86_64-native-linuxapp-gcc/fdd2452bc8d44f2bbc2f919d9f93ff17/dpdk/x86_64-native-linuxapp-gcc/include/rte_mbuf.h:38,
                 from /root/UB1804-64_K4.15.0_GCC7.3.0/x86_64-native-linuxapp-gcc/fdd2452bc8d44f2bbc2f919d9f93ff17/dpdk/x86_64-native-linuxapp-gcc/include/rte_ip.h:24,
                 from /root/UB1804-64_K4.15.0_GCC7.3.0/x86_64-native-linuxapp-gcc/fdd2452bc8d44f2bbc2f919d9f93ff17/dpdk/x86_64-native-linuxapp-gcc/include/rte_net.h:12,
                 from /root/UB1804-64_K4.15.0_GCC7.3.0/x86_64-native-linuxapp-gcc/fdd2452bc8d44f2bbc2f919d9f93ff17/dpdk/drivers/net/virtio/virtio_rxtx_packed_avx.c:11:
/usr/lib/gcc/x86_64-linux-gnu/7/include/avx512vlbwintrin.h:3642:1: error: inlining failed in call to always_inline ‘_mm256_cmpneq_epu16_mask’: target specific option mismatch
 _mm256_cmpneq_epu16_mask (__m256i __X, __m256i __Y)
 ^~~~~~~~~~~~~~~~~~~~~~~~
/root/UB1804-64_K4.15.0_GCC7.3.0/x86_64-native-linuxapp-gcc/fdd2452bc8d44f2bbc2f919d9f93ff17/dpdk/drivers/net/virtio/virtio_rxtx_packed_avx.c:132:11: note: called from here
  uint16_t cmp = _mm256_cmpneq_epu16_mask(mbufs, mbuf_ref);
           ^~~
--
                 from /root/UB1804-64_K4.15.0_GCC7.3.0/x86_64-native-linuxapp-gcc/fdd2452bc8d44f2bbc2f919d9f93ff17/dpdk/x86_64-native-linuxapp-gcc/include/rte_mempool.h:51,
                 from /root/UB1804-64_K4.15.0_GCC7.3.0/x86_64-native-linuxapp-gcc/fdd2452bc8d44f2bbc2f919d9f93ff17/dpdk/x86_64-native-linuxapp-gcc/include/rte_mbuf.h:38,
                 from /root/UB1804-64_K4.15.0_GCC7.3.0/x86_64-native-linuxapp-gcc/fdd2452bc8d44f2bbc2f919d9f93ff17/dpdk/x86_64-native-linuxapp-gcc/include/rte_ip.h:24,
                 from /root/UB1804-64_K4.15.0_GCC7.3.0/x86_64-native-linuxapp-gcc/fdd2452bc8d44f2bbc2f919d9f93ff17/dpdk/x86_64-native-linuxapp-gcc/include/rte_net.h:12,
                 from /root/UB1804-64_K4.15.0_GCC7.3.0/x86_64-native-linuxapp-gcc/fdd2452bc8d44f2bbc2f919d9f93ff17/dpdk/drivers/net/virtio/virtio_rxtx_packed_avx.c:11:
/usr/lib/gcc/x86_64-linux-gnu/7/include/avx512fintrin.h:79:1: error: inlining failed in call to always_inline ‘_mm512_set_epi64’: target specific option mismatch
 _mm512_set_epi64 (long long __A, long long __B, long long __C,
 ^~~~~~~~~~~~~~~~
/root/UB1804-64_K4.15.0_GCC7.3.0/x86_64-native-linuxapp-gcc/fdd2452bc8d44f2bbc2f919d9f93ff17/dpdk/drivers/net/virtio/virtio_rxtx_packed_avx.c:152:10: note: called from here
  __m512i new_descs = _mm512_set_epi64(
          ^~~~~~~~~
--
                 from /root/UB1804-64_K4.15.0_GCC7.3.0/x86_64-native-linuxapp-gcc/fdd2452bc8d44f2bbc2f919d9f93ff17/dpdk/x86_64-native-linuxapp-gcc/include/rte_mempool.h:51,
                 from /root/UB1804-64_K4.15.0_GCC7.3.0/x86_64-native-linuxapp-gcc/fdd2452bc8d44f2bbc2f919d9f93ff17/dpdk/x86_64-native-linuxapp-gcc/include/rte_mbuf.h:38,
                 from /root/UB1804-64_K4.15.0_GCC7.3.0/x86_64-native-linuxapp-gcc/fdd2452bc8d44f2bbc2f919d9f93ff17/dpdk/x86_64-native-linuxapp-gcc/include/rte_ip.h:24,
                 from /root/UB1804-64_K4.15.0_GCC7.3.0/x86_64-native-linuxapp-gcc/fdd2452bc8d44f2bbc2f919d9f93ff17/dpdk/x86_64-native-linuxapp-gcc/include/rte_net.h:12,
                 from /root/UB1804-64_K4.15.0_GCC7.3.0/x86_64-native-linuxapp-gcc/fdd2452bc8d44f2bbc2f919d9f93ff17/dpdk/drivers/net/virtio/virtio_rxtx_packed_avx.c:11:
/usr/lib/gcc/x86_64-linux-gnu/7/include/avx512fintrin.h:5831:1: error: inlining failed in call to always_inline ‘_mm512_storeu_si512’: target specific option mismatch
 _mm512_storeu_si512 (void *__P, __m512i __A)
 ^~~~~~~~~~~~~~~~~~~
/root/UB1804-64_K4.15.0_GCC7.3.0/x86_64-native-linuxapp-gcc/fdd2452bc8d44f2bbc2f919d9f93ff17/dpdk/drivers/net/virtio/virtio_rxtx_packed_avx.c:172:2: note: called from here
  _mm512_storeu_si512((void *)&vq->vq_packed.ring.desc[idx], new_descs);
  ^~~~~~~~~~~~~~~~~~~~~~~~~~~~~~~~~~~~~~~~~~~~~~~~~~~~~~~~~~~~~~~~~~~~~
/root/UB1804-64_K4.15.0_GCC7.3.0/x86_64-native-linuxapp-gcc/fdd2452bc8d44f2bbc2f919d9f93ff17/dpdk/drivers/net/virtio/virtio_rxtx_packed_avx.c: At top level:
cc1: warning: unrecognized command line option ‘-Wno-address-of-packed-member’
/root/UB1804-64_K4.15.0_GCC7.3.0/x86_64-native-linuxapp-gcc/fdd2452bc8d44f2bbc2f919d9f93ff17/dpdk/mk/internal/rte.compile-pre.mk:114: recipe for target 'virtio_rxtx_packed_avx.o' failed
make[6]: *** [virtio_rxtx_packed_avx.o] Error 1
make[6]: *** Waiting for unfinished jobs....
  CC otx2_stats.o
  CC efx_hash.o
  CC rte_eth_softnic_cli.o
  CC rte_eth_softnic_flow.o
--
  CC conn.o
  CC efx_intr.o
  PMDINFO virtio_user_ethdev.o.pmd.c
  CC virtio_user_ethdev.o.pmd.o
  LD virtio_user_ethdev.o
/root/UB1804-64_K4.15.0_GCC7.3.0/x86_64-native-linuxapp-gcc/fdd2452bc8d44f2bbc2f919d9f93ff17/dpdk/mk/rte.subdir.mk:35: recipe for target 'virtio' failed
make[5]: *** [virtio] Error 2
make[5]: *** Waiting for unfinished jobs....
  CC efx_lic.o
  CC efx_mac.o
  CC otx2_mcast.o
  CC otx2_lookup.o
--
  CC medford2_nic.o
  AR librte_pmd_qede.a
  INSTALL-LIB librte_pmd_qede.a
  AR librte_pmd_sfc_efx.a
  INSTALL-LIB librte_pmd_sfc_efx.a
/root/UB1804-64_K4.15.0_GCC7.3.0/x86_64-native-linuxapp-gcc/fdd2452bc8d44f2bbc2f919d9f93ff17/dpdk/mk/rte.subdir.mk:35: recipe for target 'net' failed
make[4]: *** [net] Error 2
/root/UB1804-64_K4.15.0_GCC7.3.0/x86_64-native-linuxapp-gcc/fdd2452bc8d44f2bbc2f919d9f93ff17/dpdk/mk/rte.sdkbuild.mk:46: recipe for target 'drivers' failed
make[3]: *** [drivers] Error 2
/root/UB1804-64_K4.15.0_GCC7.3.0/x86_64-native-linuxapp-gcc/fdd2452bc8d44f2bbc2f919d9f93ff17/dpdk/mk/rte.sdkroot.mk:98: recipe for target 'all' failed
make[2]: *** [all] Error 2
/root/UB1804-64_K4.15.0_GCC7.3.0/x86_64-native-linuxapp-gcc/fdd2452bc8d44f2bbc2f919d9f93ff17/dpdk/mk/rte.sdkinstall.mk:60: recipe for target 'pre_install' failed
make[1]: *** [pre_install] Error 2
/root/UB1804-64_K4.15.0_GCC7.3.0/x86_64-native-linuxapp-gcc/fdd2452bc8d44f2bbc2f919d9f93ff17/dpdk/mk/rte.sdkroot.mk:77: recipe for target 'install' failed
make: *** [install] Error 2


*Make Build Failed #14:
OS: FreeBSD1201-64
Target: x86_64-native-bsdapp-clang
        ^
/usr/lib/clang/8.0.1/include/avx512fintrin.h:7758:3: note: expanded from macro '_mm512_i64scatter_epi64'
  __builtin_ia32_scatterdiv8di((void *)(addr), (__mmask8)-1, \
  ^
16 errors generated.
gmake[6]: *** [/root/FreeBSD1201-64_K12.1_Clang8.0.1/x86_64-native-bsdapp-clang/fdd2452bc8d44f2bbc2f919d9f93ff17/dpdk/mk/internal/rte.compile-pre.mk:114: virtio_rxtx_packed_avx.o] Error 1
gmake[6]: *** Waiting for unfinished jobs....
  CC otx2_flow_ctrl.o
  CC sfc_ef10_rx.o
gmake[5]: *** [/root/FreeBSD1201-64_K12.1_Clang8.0.1/x86_64-native-bsdapp-clang/fdd2452bc8d44f2bbc2f919d9f93ff17/dpdk/mk/rte.subdir.mk:35: virtio] Error 2
gmake[5]: *** Waiting for unfinished jobs....
  CC qede_ethdev.o
  CC sfc_ef10_tx.o
  CC ecore_vf.o
  CC otx2_flow_parse.o
--
  CC hunt_nic.o
  CC medford_nic.o
  CC medford2_nic.o
  AR librte_pmd_sfc_efx.a
  INSTALL-LIB librte_pmd_sfc_efx.a
gmake[4]: *** [/root/FreeBSD1201-64_K12.1_Clang8.0.1/x86_64-native-bsdapp-clang/fdd2452bc8d44f2bbc2f919d9f93ff17/dpdk/mk/rte.subdir.mk:35: net] Error 2
gmake[3]: *** [/root/FreeBSD1201-64_K12.1_Clang8.0.1/x86_64-native-bsdapp-clang/fdd2452bc8d44f2bbc2f919d9f93ff17/dpdk/mk/rte.sdkbuild.mk:46: drivers] Error 2
gmake[2]: *** [/root/FreeBSD1201-64_K12.1_Clang8.0.1/x86_64-native-bsdapp-clang/fdd2452bc8d44f2bbc2f919d9f93ff17/dpdk/mk/rte.sdkroot.mk:99: all] Error 2
gmake[1]: *** [/root/FreeBSD1201-64_K12.1_Clang8.0.1/x86_64-native-bsdapp-clang/fdd2452bc8d44f2bbc2f919d9f93ff17/dpdk/mk/rte.sdkinstall.mk:61: pre_install] Error 2
gmake: *** [/root/FreeBSD1201-64_K12.1_Clang8.0.1/x86_64-native-bsdapp-clang/fdd2452bc8d44f2bbc2f919d9f93ff17/dpdk/mk/rte.sdkroot.mk:77: install] Error 2


*Make Build Failed #15:
OS: FreeBSD1201-64
Target: x86_64-native-bsdapp-gcc
                 from /root/FreeBSD1201-64_K12.1_GCC9.2.0/x86_64-native-bsdapp-gcc/fdd2452bc8d44f2bbc2f919d9f93ff17/dpdk/x86_64-native-bsdapp-gcc/include/rte_mempool.h:51,
                 from /root/FreeBSD1201-64_K12.1_GCC9.2.0/x86_64-native-bsdapp-gcc/fdd2452bc8d44f2bbc2f919d9f93ff17/dpdk/x86_64-native-bsdapp-gcc/include/rte_mbuf.h:38,
                 from /root/FreeBSD1201-64_K12.1_GCC9.2.0/x86_64-native-bsdapp-gcc/fdd2452bc8d44f2bbc2f919d9f93ff17/dpdk/x86_64-native-bsdapp-gcc/include/rte_ip.h:24,
                 from /root/FreeBSD1201-64_K12.1_GCC9.2.0/x86_64-native-bsdapp-gcc/fdd2452bc8d44f2bbc2f919d9f93ff17/dpdk/x86_64-native-bsdapp-gcc/include/rte_net.h:12,
                 from /root/FreeBSD1201-64_K12.1_GCC9.2.0/x86_64-native-bsdapp-gcc/fdd2452bc8d44f2bbc2f919d9f93ff17/dpdk/drivers/net/virtio/virtio_rxtx_packed_avx.c:11:
/usr/local/lib/gcc9/gcc/x86_64-portbld-freebsd12.0/9.2.0/include/avx512vlbwintrin.h:3677:1: error: inlining failed in call to always_inline '_mm256_cmpneq_epu16_mask': target specific option mismatch
 3677 | _mm256_cmpneq_epu16_mask (__m256i __X, __m256i __Y)
      | ^~~~~~~~~~~~~~~~~~~~~~~~
/root/FreeBSD1201-64_K12.1_GCC9.2.0/x86_64-native-bsdapp-gcc/fdd2452bc8d44f2bbc2f919d9f93ff17/dpdk/drivers/net/virtio/virtio_rxtx_packed_avx.c:132:17: note: called from here
  132 |  uint16_t cmp = _mm256_cmpneq_epu16_mask(mbufs, mbuf_ref);
      |                 ^~~~~~~~~~~~~~~~~~~~~~~~~~~~~~~~~~~~~~~~~
--
                 from /root/FreeBSD1201-64_K12.1_GCC9.2.0/x86_64-native-bsdapp-gcc/fdd2452bc8d44f2bbc2f919d9f93ff17/dpdk/x86_64-native-bsdapp-gcc/include/rte_mempool.h:51,
                 from /root/FreeBSD1201-64_K12.1_GCC9.2.0/x86_64-native-bsdapp-gcc/fdd2452bc8d44f2bbc2f919d9f93ff17/dpdk/x86_64-native-bsdapp-gcc/include/rte_mbuf.h:38,
                 from /root/FreeBSD1201-64_K12.1_GCC9.2.0/x86_64-native-bsdapp-gcc/fdd2452bc8d44f2bbc2f919d9f93ff17/dpdk/x86_64-native-bsdapp-gcc/include/rte_ip.h:24,
                 from /root/FreeBSD1201-64_K12.1_GCC9.2.0/x86_64-native-bsdapp-gcc/fdd2452bc8d44f2bbc2f919d9f93ff17/dpdk/x86_64-native-bsdapp-gcc/include/rte_net.h:12,
                 from /root/FreeBSD1201-64_K12.1_GCC9.2.0/x86_64-native-bsdapp-gcc/fdd2452bc8d44f2bbc2f919d9f93ff17/dpdk/drivers/net/virtio/virtio_rxtx_packed_avx.c:11:
/usr/local/lib/gcc9/gcc/x86_64-portbld-freebsd12.0/9.2.0/include/avx512vlbwintrin.h:3677:1: error: inlining failed in call to always_inline '_mm256_cmpneq_epu16_mask': target specific option mismatch
 3677 | _mm256_cmpneq_epu16_mask (__m256i __X, __m256i __Y)
      | ^~~~~~~~~~~~~~~~~~~~~~~~
/root/FreeBSD1201-64_K12.1_GCC9.2.0/x86_64-native-bsdapp-gcc/fdd2452bc8d44f2bbc2f919d9f93ff17/dpdk/drivers/net/virtio/virtio_rxtx_packed_avx.c:132:17: note: called from here
  132 |  uint16_t cmp = _mm256_cmpneq_epu16_mask(mbufs, mbuf_ref);
      |                 ^~~~~~~~~~~~~~~~~~~~~~~~~~~~~~~~~~~~~~~~~
--
                 from /root/FreeBSD1201-64_K12.1_GCC9.2.0/x86_64-native-bsdapp-gcc/fdd2452bc8d44f2bbc2f919d9f93ff17/dpdk/x86_64-native-bsdapp-gcc/include/rte_mempool.h:51,
                 from /root/FreeBSD1201-64_K12.1_GCC9.2.0/x86_64-native-bsdapp-gcc/fdd2452bc8d44f2bbc2f919d9f93ff17/dpdk/x86_64-native-bsdapp-gcc/include/rte_mbuf.h:38,
                 from /root/FreeBSD1201-64_K12.1_GCC9.2.0/x86_64-native-bsdapp-gcc/fdd2452bc8d44f2bbc2f919d9f93ff17/dpdk/x86_64-native-bsdapp-gcc/include/rte_ip.h:24,
                 from /root/FreeBSD1201-64_K12.1_GCC9.2.0/x86_64-native-bsdapp-gcc/fdd2452bc8d44f2bbc2f919d9f93ff17/dpdk/x86_64-native-bsdapp-gcc/include/rte_net.h:12,
                 from /root/FreeBSD1201-64_K12.1_GCC9.2.0/x86_64-native-bsdapp-gcc/fdd2452bc8d44f2bbc2f919d9f93ff17/dpdk/drivers/net/virtio/virtio_rxtx_packed_avx.c:11:
/usr/local/lib/gcc9/gcc/x86_64-portbld-freebsd12.0/9.2.0/include/avx512fintrin.h:79:1: error: inlining failed in call to always_inline '_mm512_set_epi64': target specific option mismatch
   79 | _mm512_set_epi64 (long long __A, long long __B, long long __C,
      | ^~~~~~~~~~~~~~~~
/root/FreeBSD1201-64_K12.1_GCC9.2.0/x86_64-native-bsdapp-gcc/fdd2452bc8d44f2bbc2f919d9f93ff17/dpdk/drivers/net/virtio/virtio_rxtx_packed_avx.c:152:22: note: called from here
  152 |  __m512i new_descs = _mm512_set_epi64(
      |                      ^~~~~~~~~~~~~~~~~
--
                 from /root/FreeBSD1201-64_K12.1_GCC9.2.0/x86_64-native-bsdapp-gcc/fdd2452bc8d44f2bbc2f919d9f93ff17/dpdk/x86_64-native-bsdapp-gcc/include/rte_mempool.h:51,
                 from /root/FreeBSD1201-64_K12.1_GCC9.2.0/x86_64-native-bsdapp-gcc/fdd2452bc8d44f2bbc2f919d9f93ff17/dpdk/x86_64-native-bsdapp-gcc/include/rte_mbuf.h:38,
                 from /root/FreeBSD1201-64_K12.1_GCC9.2.0/x86_64-native-bsdapp-gcc/fdd2452bc8d44f2bbc2f919d9f93ff17/dpdk/x86_64-native-bsdapp-gcc/include/rte_ip.h:24,
                 from /root/FreeBSD1201-64_K12.1_GCC9.2.0/x86_64-native-bsdapp-gcc/fdd2452bc8d44f2bbc2f919d9f93ff17/dpdk/x86_64-native-bsdapp-gcc/include/rte_net.h:12,
                 from /root/FreeBSD1201-64_K12.1_GCC9.2.0/x86_64-native-bsdapp-gcc/fdd2452bc8d44f2bbc2f919d9f93ff17/dpdk/drivers/net/virtio/virtio_rxtx_packed_avx.c:11:
/usr/local/lib/gcc9/gcc/x86_64-portbld-freebsd12.0/9.2.0/include/avx512fintrin.h:6408:1: error: inlining failed in call to always_inline '_mm512_storeu_si512': target specific option mismatch
 6408 | _mm512_storeu_si512 (void *__P, __m512i __A)
      | ^~~~~~~~~~~~~~~~~~~
/root/FreeBSD1201-64_K12.1_GCC9.2.0/x86_64-native-bsdapp-gcc/fdd2452bc8d44f2bbc2f919d9f93ff17/dpdk/drivers/net/virtio/virtio_rxtx_packed_avx.c:172:2: note: called from here
  172 |  _mm512_storeu_si512((void *)&vq->vq_packed.ring.desc[idx], new_descs);
      |  ^~~~~~~~~~~~~~~~~~~~~~~~~~~~~~~~~~~~~~~~~~~~~~~~~~~~~~~~~~~~~~~~~~~~~
--
                 from /root/FreeBSD1201-64_K12.1_GCC9.2.0/x86_64-native-bsdapp-gcc/fdd2452bc8d44f2bbc2f919d9f93ff17/dpdk/x86_64-native-bsdapp-gcc/include/rte_mempool.h:51,
                 from /root/FreeBSD1201-64_K12.1_GCC9.2.0/x86_64-native-bsdapp-gcc/fdd2452bc8d44f2bbc2f919d9f93ff17/dpdk/x86_64-native-bsdapp-gcc/include/rte_mbuf.h:38,
                 from /root/FreeBSD1201-64_K12.1_GCC9.2.0/x86_64-native-bsdapp-gcc/fdd2452bc8d44f2bbc2f919d9f93ff17/dpdk/x86_64-native-bsdapp-gcc/include/rte_ip.h:24,
                 from /root/FreeBSD1201-64_K12.1_GCC9.2.0/x86_64-native-bsdapp-gcc/fdd2452bc8d44f2bbc2f919d9f93ff17/dpdk/x86_64-native-bsdapp-gcc/include/rte_net.h:12,
                 from /root/FreeBSD1201-64_K12.1_GCC9.2.0/x86_64-native-bsdapp-gcc/fdd2452bc8d44f2bbc2f919d9f93ff17/dpdk/drivers/net/virtio/virtio_rxtx_packed_avx.c:11:
/usr/local/lib/gcc9/gcc/x86_64-portbld-freebsd12.0/9.2.0/include/avx512vlbwintrin.h:3677:1: error: inlining failed in call to always_inline '_mm256_cmpneq_epu16_mask': target specific option mismatch
 3677 | _mm256_cmpneq_epu16_mask (__m256i __X, __m256i __Y)
      | ^~~~~~~~~~~~~~~~~~~~~~~~
/root/FreeBSD1201-64_K12.1_GCC9.2.0/x86_64-native-bsdapp-gcc/fdd2452bc8d44f2bbc2f919d9f93ff17/dpdk/drivers/net/virtio/virtio_rxtx_packed_avx.c:132:17: note: called from here
  132 |  uint16_t cmp = _mm256_cmpneq_epu16_mask(mbufs, mbuf_ref);
      |                 ^~~~~~~~~~~~~~~~~~~~~~~~~~~~~~~~~~~~~~~~~
--
                 from /root/FreeBSD1201-64_K12.1_GCC9.2.0/x86_64-native-bsdapp-gcc/fdd2452bc8d44f2bbc2f919d9f93ff17/dpdk/x86_64-native-bsdapp-gcc/include/rte_mempool.h:51,
                 from /root/FreeBSD1201-64_K12.1_GCC9.2.0/x86_64-native-bsdapp-gcc/fdd2452bc8d44f2bbc2f919d9f93ff17/dpdk/x86_64-native-bsdapp-gcc/include/rte_mbuf.h:38,
                 from /root/FreeBSD1201-64_K12.1_GCC9.2.0/x86_64-native-bsdapp-gcc/fdd2452bc8d44f2bbc2f919d9f93ff17/dpdk/x86_64-native-bsdapp-gcc/include/rte_ip.h:24,
                 from /root/FreeBSD1201-64_K12.1_GCC9.2.0/x86_64-native-bsdapp-gcc/fdd2452bc8d44f2bbc2f919d9f93ff17/dpdk/x86_64-native-bsdapp-gcc/include/rte_net.h:12,
                 from /root/FreeBSD1201-64_K12.1_GCC9.2.0/x86_64-native-bsdapp-gcc/fdd2452bc8d44f2bbc2f919d9f93ff17/dpdk/drivers/net/virtio/virtio_rxtx_packed_avx.c:11:
/usr/local/lib/gcc9/gcc/x86_64-portbld-freebsd12.0/9.2.0/include/avx512fintrin.h:79:1: error: inlining failed in call to always_inline '_mm512_set_epi64': target specific option mismatch
   79 | _mm512_set_epi64 (long long __A, long long __B, long long __C,
      | ^~~~~~~~~~~~~~~~
/root/FreeBSD1201-64_K12.1_GCC9.2.0/x86_64-native-bsdapp-gcc/fdd2452bc8d44f2bbc2f919d9f93ff17/dpdk/drivers/net/virtio/virtio_rxtx_packed_avx.c:152:22: note: called from here
  152 |  __m512i new_descs = _mm512_set_epi64(
      |                      ^~~~~~~~~~~~~~~~~
--
                 from /root/FreeBSD1201-64_K12.1_GCC9.2.0/x86_64-native-bsdapp-gcc/fdd2452bc8d44f2bbc2f919d9f93ff17/dpdk/x86_64-native-bsdapp-gcc/include/rte_mempool.h:51,
                 from /root/FreeBSD1201-64_K12.1_GCC9.2.0/x86_64-native-bsdapp-gcc/fdd2452bc8d44f2bbc2f919d9f93ff17/dpdk/x86_64-native-bsdapp-gcc/include/rte_mbuf.h:38,
                 from /root/FreeBSD1201-64_K12.1_GCC9.2.0/x86_64-native-bsdapp-gcc/fdd2452bc8d44f2bbc2f919d9f93ff17/dpdk/x86_64-native-bsdapp-gcc/include/rte_ip.h:24,
                 from /root/FreeBSD1201-64_K12.1_GCC9.2.0/x86_64-native-bsdapp-gcc/fdd2452bc8d44f2bbc2f919d9f93ff17/dpdk/x86_64-native-bsdapp-gcc/include/rte_net.h:12,
                 from /root/FreeBSD1201-64_K12.1_GCC9.2.0/x86_64-native-bsdapp-gcc/fdd2452bc8d44f2bbc2f919d9f93ff17/dpdk/drivers/net/virtio/virtio_rxtx_packed_avx.c:11:
/usr/local/lib/gcc9/gcc/x86_64-portbld-freebsd12.0/9.2.0/include/avx512fintrin.h:6408:1: error: inlining failed in call to always_inline '_mm512_storeu_si512': target specific option mismatch
 6408 | _mm512_storeu_si512 (void *__P, __m512i __A)
      | ^~~~~~~~~~~~~~~~~~~
/root/FreeBSD1201-64_K12.1_GCC9.2.0/x86_64-native-bsdapp-gcc/fdd2452bc8d44f2bbc2f919d9f93ff17/dpdk/drivers/net/virtio/virtio_rxtx_packed_avx.c:172:2: note: called from here
  172 |  _mm512_storeu_si512((void *)&vq->vq_packed.ring.desc[idx], new_descs);
      |  ^~~~~~~~~~~~~~~~~~~~~~~~~~~~~~~~~~~~~~~~~~~~~~~~~~~~~~~~~~~~~~~~~~~~~
  CC qede_rxtx.o
gmake[6]: *** [/root/FreeBSD1201-64_K12.1_GCC9.2.0/x86_64-native-bsdapp-gcc/fdd2452bc8d44f2bbc2f919d9f93ff17/dpdk/mk/internal/rte.compile-pre.mk:116: virtio_rxtx_packed_avx.o] Error 1
gmake[5]: *** [/root/FreeBSD1201-64_K12.1_GCC9.2.0/x86_64-native-bsdapp-gcc/fdd2452bc8d44f2bbc2f919d9f93ff17/dpdk/mk/rte.subdir.mk:35: virtio] Error 2
gmake[5]: *** Waiting for unfinished jobs....
  CC qede_filter.o
  CC otx2_ethdev_sec.o
  CC sfc_filter.o
  CC sfc_flow.o
--
  CC hunt_nic.o
  CC medford_nic.o
  CC medford2_nic.o
  AR librte_pmd_sfc_efx.a
  INSTALL-LIB librte_pmd_sfc_efx.a
gmake[4]: *** [/root/FreeBSD1201-64_K12.1_GCC9.2.0/x86_64-native-bsdapp-gcc/fdd2452bc8d44f2bbc2f919d9f93ff17/dpdk/mk/rte.subdir.mk:35: net] Error 2
gmake[3]: *** [/root/FreeBSD1201-64_K12.1_GCC9.2.0/x86_64-native-bsdapp-gcc/fdd2452bc8d44f2bbc2f919d9f93ff17/dpdk/mk/rte.sdkbuild.mk:46: drivers] Error 2
gmake[2]: *** [/root/FreeBSD1201-64_K12.1_GCC9.2.0/x86_64-native-bsdapp-gcc/fdd2452bc8d44f2bbc2f919d9f93ff17/dpdk/mk/rte.sdkroot.mk:99: all] Error 2
gmake[1]: *** [/root/FreeBSD1201-64_K12.1_GCC9.2.0/x86_64-native-bsdapp-gcc/fdd2452bc8d44f2bbc2f919d9f93ff17/dpdk/mk/rte.sdkinstall.mk:61: pre_install] Error 2
gmake: *** [/root/FreeBSD1201-64_K12.1_GCC9.2.0/x86_64-native-bsdapp-gcc/fdd2452bc8d44f2bbc2f919d9f93ff17/dpdk/mk/rte.sdkroot.mk:77: install] Error 2


*Make Build Failed #16:
OS: FreeBSD1201-64
Target: x86_64-native-bsdapp-gcc+debug
                 from /root/FreeBSD1201-64_K12.1_GCC7.3.0/x86_64-native-bsdapp-gcc+debug/fdd2452bc8d44f2bbc2f919d9f93ff17/dpdk/x86_64-native-bsdapp-gcc/include/rte_mempool.h:51,
                 from /root/FreeBSD1201-64_K12.1_GCC7.3.0/x86_64-native-bsdapp-gcc+debug/fdd2452bc8d44f2bbc2f919d9f93ff17/dpdk/x86_64-native-bsdapp-gcc/include/rte_mbuf.h:38,
                 from /root/FreeBSD1201-64_K12.1_GCC7.3.0/x86_64-native-bsdapp-gcc+debug/fdd2452bc8d44f2bbc2f919d9f93ff17/dpdk/x86_64-native-bsdapp-gcc/include/rte_ip.h:24,
                 from /root/FreeBSD1201-64_K12.1_GCC7.3.0/x86_64-native-bsdapp-gcc+debug/fdd2452bc8d44f2bbc2f919d9f93ff17/dpdk/x86_64-native-bsdapp-gcc/include/rte_net.h:12,
                 from /root/FreeBSD1201-64_K12.1_GCC7.3.0/x86_64-native-bsdapp-gcc+debug/fdd2452bc8d44f2bbc2f919d9f93ff17/dpdk/drivers/net/virtio/virtio_rxtx_packed_avx.c:11:
/usr/local/lib/gcc9/gcc/x86_64-portbld-freebsd12.0/9.2.0/include/avx512vlbwintrin.h:3677:1: error: inlining failed in call to always_inline '_mm256_cmpneq_epu16_mask': target specific option mismatch
 3677 | _mm256_cmpneq_epu16_mask (__m256i __X, __m256i __Y)
      | ^~~~~~~~~~~~~~~~~~~~~~~~
/root/FreeBSD1201-64_K12.1_GCC7.3.0/x86_64-native-bsdapp-gcc+debug/fdd2452bc8d44f2bbc2f919d9f93ff17/dpdk/drivers/net/virtio/virtio_rxtx_packed_avx.c:132:17: note: called from here
  132 |  uint16_t cmp = _mm256_cmpneq_epu16_mask(mbufs, mbuf_ref);
      |                 ^~~~~~~~~~~~~~~~~~~~~~~~~~~~~~~~~~~~~~~~~
--
                 from /root/FreeBSD1201-64_K12.1_GCC7.3.0/x86_64-native-bsdapp-gcc+debug/fdd2452bc8d44f2bbc2f919d9f93ff17/dpdk/x86_64-native-bsdapp-gcc/include/rte_mempool.h:51,
                 from /root/FreeBSD1201-64_K12.1_GCC7.3.0/x86_64-native-bsdapp-gcc+debug/fdd2452bc8d44f2bbc2f919d9f93ff17/dpdk/x86_64-native-bsdapp-gcc/include/rte_mbuf.h:38,
                 from /root/FreeBSD1201-64_K12.1_GCC7.3.0/x86_64-native-bsdapp-gcc+debug/fdd2452bc8d44f2bbc2f919d9f93ff17/dpdk/x86_64-native-bsdapp-gcc/include/rte_ip.h:24,
                 from /root/FreeBSD1201-64_K12.1_GCC7.3.0/x86_64-native-bsdapp-gcc+debug/fdd2452bc8d44f2bbc2f919d9f93ff17/dpdk/x86_64-native-bsdapp-gcc/include/rte_net.h:12,
                 from /root/FreeBSD1201-64_K12.1_GCC7.3.0/x86_64-native-bsdapp-gcc+debug/fdd2452bc8d44f2bbc2f919d9f93ff17/dpdk/drivers/net/virtio/virtio_rxtx_packed_avx.c:11:
/usr/local/lib/gcc9/gcc/x86_64-portbld-freebsd12.0/9.2.0/include/avx512vlbwintrin.h:3677:1: error: inlining failed in call to always_inline '_mm256_cmpneq_epu16_mask': target specific option mismatch
 3677 | _mm256_cmpneq_epu16_mask (__m256i __X, __m256i __Y)
      | ^~~~~~~~~~~~~~~~~~~~~~~~
/root/FreeBSD1201-64_K12.1_GCC7.3.0/x86_64-native-bsdapp-gcc+debug/fdd2452bc8d44f2bbc2f919d9f93ff17/dpdk/drivers/net/virtio/virtio_rxtx_packed_avx.c:132:17: note: called from here
  132 |  uint16_t cmp = _mm256_cmpneq_epu16_mask(mbufs, mbuf_ref);
      |                 ^~~~~~~~~~~~~~~~~~~~~~~~~~~~~~~~~~~~~~~~~
--
                 from /root/FreeBSD1201-64_K12.1_GCC7.3.0/x86_64-native-bsdapp-gcc+debug/fdd2452bc8d44f2bbc2f919d9f93ff17/dpdk/x86_64-native-bsdapp-gcc/include/rte_mempool.h:51,
                 from /root/FreeBSD1201-64_K12.1_GCC7.3.0/x86_64-native-bsdapp-gcc+debug/fdd2452bc8d44f2bbc2f919d9f93ff17/dpdk/x86_64-native-bsdapp-gcc/include/rte_mbuf.h:38,
                 from /root/FreeBSD1201-64_K12.1_GCC7.3.0/x86_64-native-bsdapp-gcc+debug/fdd2452bc8d44f2bbc2f919d9f93ff17/dpdk/x86_64-native-bsdapp-gcc/include/rte_ip.h:24,
                 from /root/FreeBSD1201-64_K12.1_GCC7.3.0/x86_64-native-bsdapp-gcc+debug/fdd2452bc8d44f2bbc2f919d9f93ff17/dpdk/x86_64-native-bsdapp-gcc/include/rte_net.h:12,
                 from /root/FreeBSD1201-64_K12.1_GCC7.3.0/x86_64-native-bsdapp-gcc+debug/fdd2452bc8d44f2bbc2f919d9f93ff17/dpdk/drivers/net/virtio/virtio_rxtx_packed_avx.c:11:
/usr/local/lib/gcc9/gcc/x86_64-portbld-freebsd12.0/9.2.0/include/avx512fintrin.h:79:1: error: inlining failed in call to always_inline '_mm512_set_epi64': target specific option mismatch
   79 | _mm512_set_epi64 (long long __A, long long __B, long long __C,
      | ^~~~~~~~~~~~~~~~
/root/FreeBSD1201-64_K12.1_GCC7.3.0/x86_64-native-bsdapp-gcc+debug/fdd2452bc8d44f2bbc2f919d9f93ff17/dpdk/drivers/net/virtio/virtio_rxtx_packed_avx.c:152:22: note: called from here
  152 |  __m512i new_descs = _mm512_set_epi64(
      |                      ^~~~~~~~~~~~~~~~~
--
                 from /root/FreeBSD1201-64_K12.1_GCC7.3.0/x86_64-native-bsdapp-gcc+debug/fdd2452bc8d44f2bbc2f919d9f93ff17/dpdk/x86_64-native-bsdapp-gcc/include/rte_mempool.h:51,
                 from /root/FreeBSD1201-64_K12.1_GCC7.3.0/x86_64-native-bsdapp-gcc+debug/fdd2452bc8d44f2bbc2f919d9f93ff17/dpdk/x86_64-native-bsdapp-gcc/include/rte_mbuf.h:38,
                 from /root/FreeBSD1201-64_K12.1_GCC7.3.0/x86_64-native-bsdapp-gcc+debug/fdd2452bc8d44f2bbc2f919d9f93ff17/dpdk/x86_64-native-bsdapp-gcc/include/rte_ip.h:24,
                 from /root/FreeBSD1201-64_K12.1_GCC7.3.0/x86_64-native-bsdapp-gcc+debug/fdd2452bc8d44f2bbc2f919d9f93ff17/dpdk/x86_64-native-bsdapp-gcc/include/rte_net.h:12,
                 from /root/FreeBSD1201-64_K12.1_GCC7.3.0/x86_64-native-bsdapp-gcc+debug/fdd2452bc8d44f2bbc2f919d9f93ff17/dpdk/drivers/net/virtio/virtio_rxtx_packed_avx.c:11:
/usr/local/lib/gcc9/gcc/x86_64-portbld-freebsd12.0/9.2.0/include/avx512fintrin.h:6408:1: error: inlining failed in call to always_inline '_mm512_storeu_si512': target specific option mismatch
 6408 | _mm512_storeu_si512 (void *__P, __m512i __A)
      | ^~~~~~~~~~~~~~~~~~~
/root/FreeBSD1201-64_K12.1_GCC7.3.0/x86_64-native-bsdapp-gcc+debug/fdd2452bc8d44f2bbc2f919d9f93ff17/dpdk/drivers/net/virtio/virtio_rxtx_packed_avx.c:172:2: note: called from here
  172 |  _mm512_storeu_si512((void *)&vq->vq_packed.ring.desc[idx], new_descs);
      |  ^~~~~~~~~~~~~~~~~~~~~~~~~~~~~~~~~~~~~~~~~~~~~~~~~~~~~~~~~~~~~~~~~~~~~
--
                 from /root/FreeBSD1201-64_K12.1_GCC7.3.0/x86_64-native-bsdapp-gcc+debug/fdd2452bc8d44f2bbc2f919d9f93ff17/dpdk/x86_64-native-bsdapp-gcc/include/rte_mempool.h:51,
                 from /root/FreeBSD1201-64_K12.1_GCC7.3.0/x86_64-native-bsdapp-gcc+debug/fdd2452bc8d44f2bbc2f919d9f93ff17/dpdk/x86_64-native-bsdapp-gcc/include/rte_mbuf.h:38,
                 from /root/FreeBSD1201-64_K12.1_GCC7.3.0/x86_64-native-bsdapp-gcc+debug/fdd2452bc8d44f2bbc2f919d9f93ff17/dpdk/x86_64-native-bsdapp-gcc/include/rte_ip.h:24,
                 from /root/FreeBSD1201-64_K12.1_GCC7.3.0/x86_64-native-bsdapp-gcc+debug/fdd2452bc8d44f2bbc2f919d9f93ff17/dpdk/x86_64-native-bsdapp-gcc/include/rte_net.h:12,
                 from /root/FreeBSD1201-64_K12.1_GCC7.3.0/x86_64-native-bsdapp-gcc+debug/fdd2452bc8d44f2bbc2f919d9f93ff17/dpdk/drivers/net/virtio/virtio_rxtx_packed_avx.c:11:
/usr/local/lib/gcc9/gcc/x86_64-portbld-freebsd12.0/9.2.0/include/avx512vlbwintrin.h:3677:1: error: inlining failed in call to always_inline '_mm256_cmpneq_epu16_mask': target specific option mismatch
 3677 | _mm256_cmpneq_epu16_mask (__m256i __X, __m256i __Y)
      | ^~~~~~~~~~~~~~~~~~~~~~~~
/root/FreeBSD1201-64_K12.1_GCC7.3.0/x86_64-native-bsdapp-gcc+debug/fdd2452bc8d44f2bbc2f919d9f93ff17/dpdk/drivers/net/virtio/virtio_rxtx_packed_avx.c:132:17: note: called from here
  132 |  uint16_t cmp = _mm256_cmpneq_epu16_mask(mbufs, mbuf_ref);
      |                 ^~~~~~~~~~~~~~~~~~~~~~~~~~~~~~~~~~~~~~~~~
--
                 from /root/FreeBSD1201-64_K12.1_GCC7.3.0/x86_64-native-bsdapp-gcc+debug/fdd2452bc8d44f2bbc2f919d9f93ff17/dpdk/x86_64-native-bsdapp-gcc/include/rte_mempool.h:51,
                 from /root/FreeBSD1201-64_K12.1_GCC7.3.0/x86_64-native-bsdapp-gcc+debug/fdd2452bc8d44f2bbc2f919d9f93ff17/dpdk/x86_64-native-bsdapp-gcc/include/rte_mbuf.h:38,
                 from /root/FreeBSD1201-64_K12.1_GCC7.3.0/x86_64-native-bsdapp-gcc+debug/fdd2452bc8d44f2bbc2f919d9f93ff17/dpdk/x86_64-native-bsdapp-gcc/include/rte_ip.h:24,
                 from /root/FreeBSD1201-64_K12.1_GCC7.3.0/x86_64-native-bsdapp-gcc+debug/fdd2452bc8d44f2bbc2f919d9f93ff17/dpdk/x86_64-native-bsdapp-gcc/include/rte_net.h:12,
                 from /root/FreeBSD1201-64_K12.1_GCC7.3.0/x86_64-native-bsdapp-gcc+debug/fdd2452bc8d44f2bbc2f919d9f93ff17/dpdk/drivers/net/virtio/virtio_rxtx_packed_avx.c:11:
/usr/local/lib/gcc9/gcc/x86_64-portbld-freebsd12.0/9.2.0/include/avx512fintrin.h:79:1: error: inlining failed in call to always_inline '_mm512_set_epi64': target specific option mismatch
   79 | _mm512_set_epi64 (long long __A, long long __B, long long __C,
      | ^~~~~~~~~~~~~~~~
/root/FreeBSD1201-64_K12.1_GCC7.3.0/x86_64-native-bsdapp-gcc+debug/fdd2452bc8d44f2bbc2f919d9f93ff17/dpdk/drivers/net/virtio/virtio_rxtx_packed_avx.c:152:22: note: called from here
  152 |  __m512i new_descs = _mm512_set_epi64(
      |                      ^~~~~~~~~~~~~~~~~
--
                 from /root/FreeBSD1201-64_K12.1_GCC7.3.0/x86_64-native-bsdapp-gcc+debug/fdd2452bc8d44f2bbc2f919d9f93ff17/dpdk/x86_64-native-bsdapp-gcc/include/rte_mempool.h:51,
                 from /root/FreeBSD1201-64_K12.1_GCC7.3.0/x86_64-native-bsdapp-gcc+debug/fdd2452bc8d44f2bbc2f919d9f93ff17/dpdk/x86_64-native-bsdapp-gcc/include/rte_mbuf.h:38,
                 from /root/FreeBSD1201-64_K12.1_GCC7.3.0/x86_64-native-bsdapp-gcc+debug/fdd2452bc8d44f2bbc2f919d9f93ff17/dpdk/x86_64-native-bsdapp-gcc/include/rte_ip.h:24,
                 from /root/FreeBSD1201-64_K12.1_GCC7.3.0/x86_64-native-bsdapp-gcc+debug/fdd2452bc8d44f2bbc2f919d9f93ff17/dpdk/x86_64-native-bsdapp-gcc/include/rte_net.h:12,
                 from /root/FreeBSD1201-64_K12.1_GCC7.3.0/x86_64-native-bsdapp-gcc+debug/fdd2452bc8d44f2bbc2f919d9f93ff17/dpdk/drivers/net/virtio/virtio_rxtx_packed_avx.c:11:
/usr/local/lib/gcc9/gcc/x86_64-portbld-freebsd12.0/9.2.0/include/avx512fintrin.h:6408:1: error: inlining failed in call to always_inline '_mm512_storeu_si512': target specific option mismatch
 6408 | _mm512_storeu_si512 (void *__P, __m512i __A)
      | ^~~~~~~~~~~~~~~~~~~
/root/FreeBSD1201-64_K12.1_GCC7.3.0/x86_64-native-bsdapp-gcc+debug/fdd2452bc8d44f2bbc2f919d9f93ff17/dpdk/drivers/net/virtio/virtio_rxtx_packed_avx.c:172:2: note: called from here
  172 |  _mm512_storeu_si512((void *)&vq->vq_packed.ring.desc[idx], new_descs);
      |  ^~~~~~~~~~~~~~~~~~~~~~~~~~~~~~~~~~~~~~~~~~~~~~~~~~~~~~~~~~~~~~~~~~~~~
gmake[6]: *** [/root/FreeBSD1201-64_K12.1_GCC7.3.0/x86_64-native-bsdapp-gcc+debug/fdd2452bc8d44f2bbc2f919d9f93ff17/dpdk/mk/internal/rte.compile-pre.mk:116: virtio_rxtx_packed_avx.o] Error 1
gmake[6]: *** Waiting for unfinished jobs....
gmake[5]: *** [/root/FreeBSD1201-64_K12.1_GCC7.3.0/x86_64-native-bsdapp-gcc+debug/fdd2452bc8d44f2bbc2f919d9f93ff17/dpdk/mk/rte.subdir.mk:35: virtio] Error 2
  CC otx2_flow_ctrl.o
gmake[5]: *** Waiting for unfinished jobs....
  CC qede_rxtx.o
  CC qede_filter.o
  CC otx2_flow_parse.o
--
  CC hunt_nic.o
  CC medford_nic.o
  CC medford2_nic.o
  AR librte_pmd_sfc_efx.a
  INSTALL-LIB librte_pmd_sfc_efx.a
gmake[4]: *** [/root/FreeBSD1201-64_K12.1_GCC7.3.0/x86_64-native-bsdapp-gcc+debug/fdd2452bc8d44f2bbc2f919d9f93ff17/dpdk/mk/rte.subdir.mk:35: net] Error 2
gmake[3]: *** [/root/FreeBSD1201-64_K12.1_GCC7.3.0/x86_64-native-bsdapp-gcc+debug/fdd2452bc8d44f2bbc2f919d9f93ff17/dpdk/mk/rte.sdkbuild.mk:46: drivers] Error 2
gmake[2]: *** [/root/FreeBSD1201-64_K12.1_GCC7.3.0/x86_64-native-bsdapp-gcc+debug/fdd2452bc8d44f2bbc2f919d9f93ff17/dpdk/mk/rte.sdkroot.mk:99: all] Error 2
gmake[1]: *** [/root/FreeBSD1201-64_K12.1_GCC7.3.0/x86_64-native-bsdapp-gcc+debug/fdd2452bc8d44f2bbc2f919d9f93ff17/dpdk/mk/rte.sdkinstall.mk:61: pre_install] Error 2
gmake: *** [/root/FreeBSD1201-64_K12.1_GCC7.3.0/x86_64-native-bsdapp-gcc+debug/fdd2452bc8d44f2bbc2f919d9f93ff17/dpdk/mk/rte.sdkroot.mk:77: install] Error 2


*Make Build Failed #17:
OS: FreeBSD1201-64
Target: x86_64-native-bsdapp-gcc+shared
                 from /root/FreeBSD1201-64_K12.1_GCC7.3.0/x86_64-native-bsdapp-gcc+shared/fdd2452bc8d44f2bbc2f919d9f93ff17/dpdk/x86_64-native-bsdapp-gcc/include/rte_mempool.h:51,
                 from /root/FreeBSD1201-64_K12.1_GCC7.3.0/x86_64-native-bsdapp-gcc+shared/fdd2452bc8d44f2bbc2f919d9f93ff17/dpdk/x86_64-native-bsdapp-gcc/include/rte_mbuf.h:38,
                 from /root/FreeBSD1201-64_K12.1_GCC7.3.0/x86_64-native-bsdapp-gcc+shared/fdd2452bc8d44f2bbc2f919d9f93ff17/dpdk/x86_64-native-bsdapp-gcc/include/rte_ip.h:24,
                 from /root/FreeBSD1201-64_K12.1_GCC7.3.0/x86_64-native-bsdapp-gcc+shared/fdd2452bc8d44f2bbc2f919d9f93ff17/dpdk/x86_64-native-bsdapp-gcc/include/rte_net.h:12,
                 from /root/FreeBSD1201-64_K12.1_GCC7.3.0/x86_64-native-bsdapp-gcc+shared/fdd2452bc8d44f2bbc2f919d9f93ff17/dpdk/drivers/net/virtio/virtio_rxtx_packed_avx.c:11:
/usr/local/lib/gcc9/gcc/x86_64-portbld-freebsd12.0/9.2.0/include/avx512vlbwintrin.h:3677:1: error: inlining failed in call to always_inline '_mm256_cmpneq_epu16_mask': target specific option mismatch
 3677 | _mm256_cmpneq_epu16_mask (__m256i __X, __m256i __Y)
      | ^~~~~~~~~~~~~~~~~~~~~~~~
/root/FreeBSD1201-64_K12.1_GCC7.3.0/x86_64-native-bsdapp-gcc+shared/fdd2452bc8d44f2bbc2f919d9f93ff17/dpdk/drivers/net/virtio/virtio_rxtx_packed_avx.c:132:17: note: called from here
  132 |  uint16_t cmp = _mm256_cmpneq_epu16_mask(mbufs, mbuf_ref);
      |                 ^~~~~~~~~~~~~~~~~~~~~~~~~~~~~~~~~~~~~~~~~
--
                 from /root/FreeBSD1201-64_K12.1_GCC7.3.0/x86_64-native-bsdapp-gcc+shared/fdd2452bc8d44f2bbc2f919d9f93ff17/dpdk/x86_64-native-bsdapp-gcc/include/rte_mempool.h:51,
                 from /root/FreeBSD1201-64_K12.1_GCC7.3.0/x86_64-native-bsdapp-gcc+shared/fdd2452bc8d44f2bbc2f919d9f93ff17/dpdk/x86_64-native-bsdapp-gcc/include/rte_mbuf.h:38,
                 from /root/FreeBSD1201-64_K12.1_GCC7.3.0/x86_64-native-bsdapp-gcc+shared/fdd2452bc8d44f2bbc2f919d9f93ff17/dpdk/x86_64-native-bsdapp-gcc/include/rte_ip.h:24,
                 from /root/FreeBSD1201-64_K12.1_GCC7.3.0/x86_64-native-bsdapp-gcc+shared/fdd2452bc8d44f2bbc2f919d9f93ff17/dpdk/x86_64-native-bsdapp-gcc/include/rte_net.h:12,
                 from /root/FreeBSD1201-64_K12.1_GCC7.3.0/x86_64-native-bsdapp-gcc+shared/fdd2452bc8d44f2bbc2f919d9f93ff17/dpdk/drivers/net/virtio/virtio_rxtx_packed_avx.c:11:
/usr/local/lib/gcc9/gcc/x86_64-portbld-freebsd12.0/9.2.0/include/avx512vlbwintrin.h:3677:1: error: inlining failed in call to always_inline '_mm256_cmpneq_epu16_mask': target specific option mismatch
 3677 | _mm256_cmpneq_epu16_mask (__m256i __X, __m256i __Y)
      | ^~~~~~~~~~~~~~~~~~~~~~~~
/root/FreeBSD1201-64_K12.1_GCC7.3.0/x86_64-native-bsdapp-gcc+shared/fdd2452bc8d44f2bbc2f919d9f93ff17/dpdk/drivers/net/virtio/virtio_rxtx_packed_avx.c:132:17: note: called from here
  132 |  uint16_t cmp = _mm256_cmpneq_epu16_mask(mbufs, mbuf_ref);
      |                 ^~~~~~~~~~~~~~~~~~~~~~~~~~~~~~~~~~~~~~~~~
--
                 from /root/FreeBSD1201-64_K12.1_GCC7.3.0/x86_64-native-bsdapp-gcc+shared/fdd2452bc8d44f2bbc2f919d9f93ff17/dpdk/x86_64-native-bsdapp-gcc/include/rte_mempool.h:51,
                 from /root/FreeBSD1201-64_K12.1_GCC7.3.0/x86_64-native-bsdapp-gcc+shared/fdd2452bc8d44f2bbc2f919d9f93ff17/dpdk/x86_64-native-bsdapp-gcc/include/rte_mbuf.h:38,
                 from /root/FreeBSD1201-64_K12.1_GCC7.3.0/x86_64-native-bsdapp-gcc+shared/fdd2452bc8d44f2bbc2f919d9f93ff17/dpdk/x86_64-native-bsdapp-gcc/include/rte_ip.h:24,
                 from /root/FreeBSD1201-64_K12.1_GCC7.3.0/x86_64-native-bsdapp-gcc+shared/fdd2452bc8d44f2bbc2f919d9f93ff17/dpdk/x86_64-native-bsdapp-gcc/include/rte_net.h:12,
                 from /root/FreeBSD1201-64_K12.1_GCC7.3.0/x86_64-native-bsdapp-gcc+shared/fdd2452bc8d44f2bbc2f919d9f93ff17/dpdk/drivers/net/virtio/virtio_rxtx_packed_avx.c:11:
/usr/local/lib/gcc9/gcc/x86_64-portbld-freebsd12.0/9.2.0/include/avx512fintrin.h:79:1: error: inlining failed in call to always_inline '_mm512_set_epi64': target specific option mismatch
   79 | _mm512_set_epi64 (long long __A, long long __B, long long __C,
      | ^~~~~~~~~~~~~~~~
/root/FreeBSD1201-64_K12.1_GCC7.3.0/x86_64-native-bsdapp-gcc+shared/fdd2452bc8d44f2bbc2f919d9f93ff17/dpdk/drivers/net/virtio/virtio_rxtx_packed_avx.c:152:22: note: called from here
  152 |  __m512i new_descs = _mm512_set_epi64(
      |                      ^~~~~~~~~~~~~~~~~
--
                 from /root/FreeBSD1201-64_K12.1_GCC7.3.0/x86_64-native-bsdapp-gcc+shared/fdd2452bc8d44f2bbc2f919d9f93ff17/dpdk/x86_64-native-bsdapp-gcc/include/rte_mempool.h:51,
                 from /root/FreeBSD1201-64_K12.1_GCC7.3.0/x86_64-native-bsdapp-gcc+shared/fdd2452bc8d44f2bbc2f919d9f93ff17/dpdk/x86_64-native-bsdapp-gcc/include/rte_mbuf.h:38,
                 from /root/FreeBSD1201-64_K12.1_GCC7.3.0/x86_64-native-bsdapp-gcc+shared/fdd2452bc8d44f2bbc2f919d9f93ff17/dpdk/x86_64-native-bsdapp-gcc/include/rte_ip.h:24,
                 from /root/FreeBSD1201-64_K12.1_GCC7.3.0/x86_64-native-bsdapp-gcc+shared/fdd2452bc8d44f2bbc2f919d9f93ff17/dpdk/x86_64-native-bsdapp-gcc/include/rte_net.h:12,
                 from /root/FreeBSD1201-64_K12.1_GCC7.3.0/x86_64-native-bsdapp-gcc+shared/fdd2452bc8d44f2bbc2f919d9f93ff17/dpdk/drivers/net/virtio/virtio_rxtx_packed_avx.c:11:
/usr/local/lib/gcc9/gcc/x86_64-portbld-freebsd12.0/9.2.0/include/avx512fintrin.h:6408:1: error: inlining failed in call to always_inline '_mm512_storeu_si512': target specific option mismatch
 6408 | _mm512_storeu_si512 (void *__P, __m512i __A)
      | ^~~~~~~~~~~~~~~~~~~
/root/FreeBSD1201-64_K12.1_GCC7.3.0/x86_64-native-bsdapp-gcc+shared/fdd2452bc8d44f2bbc2f919d9f93ff17/dpdk/drivers/net/virtio/virtio_rxtx_packed_avx.c:172:2: note: called from here
  172 |  _mm512_storeu_si512((void *)&vq->vq_packed.ring.desc[idx], new_descs);
      |  ^~~~~~~~~~~~~~~~~~~~~~~~~~~~~~~~~~~~~~~~~~~~~~~~~~~~~~~~~~~~~~~~~~~~~
--
                 from /root/FreeBSD1201-64_K12.1_GCC7.3.0/x86_64-native-bsdapp-gcc+shared/fdd2452bc8d44f2bbc2f919d9f93ff17/dpdk/x86_64-native-bsdapp-gcc/include/rte_mempool.h:51,
                 from /root/FreeBSD1201-64_K12.1_GCC7.3.0/x86_64-native-bsdapp-gcc+shared/fdd2452bc8d44f2bbc2f919d9f93ff17/dpdk/x86_64-native-bsdapp-gcc/include/rte_mbuf.h:38,
                 from /root/FreeBSD1201-64_K12.1_GCC7.3.0/x86_64-native-bsdapp-gcc+shared/fdd2452bc8d44f2bbc2f919d9f93ff17/dpdk/x86_64-native-bsdapp-gcc/include/rte_ip.h:24,
                 from /root/FreeBSD1201-64_K12.1_GCC7.3.0/x86_64-native-bsdapp-gcc+shared/fdd2452bc8d44f2bbc2f919d9f93ff17/dpdk/x86_64-native-bsdapp-gcc/include/rte_net.h:12,
                 from /root/FreeBSD1201-64_K12.1_GCC7.3.0/x86_64-native-bsdapp-gcc+shared/fdd2452bc8d44f2bbc2f919d9f93ff17/dpdk/drivers/net/virtio/virtio_rxtx_packed_avx.c:11:
/usr/local/lib/gcc9/gcc/x86_64-portbld-freebsd12.0/9.2.0/include/avx512vlbwintrin.h:3677:1: error: inlining failed in call to always_inline '_mm256_cmpneq_epu16_mask': target specific option mismatch
 3677 | _mm256_cmpneq_epu16_mask (__m256i __X, __m256i __Y)
      | ^~~~~~~~~~~~~~~~~~~~~~~~
/root/FreeBSD1201-64_K12.1_GCC7.3.0/x86_64-native-bsdapp-gcc+shared/fdd2452bc8d44f2bbc2f919d9f93ff17/dpdk/drivers/net/virtio/virtio_rxtx_packed_avx.c:132:17: note: called from here
  132 |  uint16_t cmp = _mm256_cmpneq_epu16_mask(mbufs, mbuf_ref);
      |                 ^~~~~~~~~~~~~~~~~~~~~~~~~~~~~~~~~~~~~~~~~
--
                 from /root/FreeBSD1201-64_K12.1_GCC7.3.0/x86_64-native-bsdapp-gcc+shared/fdd2452bc8d44f2bbc2f919d9f93ff17/dpdk/x86_64-native-bsdapp-gcc/include/rte_mempool.h:51,
                 from /root/FreeBSD1201-64_K12.1_GCC7.3.0/x86_64-native-bsdapp-gcc+shared/fdd2452bc8d44f2bbc2f919d9f93ff17/dpdk/x86_64-native-bsdapp-gcc/include/rte_mbuf.h:38,
                 from /root/FreeBSD1201-64_K12.1_GCC7.3.0/x86_64-native-bsdapp-gcc+shared/fdd2452bc8d44f2bbc2f919d9f93ff17/dpdk/x86_64-native-bsdapp-gcc/include/rte_ip.h:24,
                 from /root/FreeBSD1201-64_K12.1_GCC7.3.0/x86_64-native-bsdapp-gcc+shared/fdd2452bc8d44f2bbc2f919d9f93ff17/dpdk/x86_64-native-bsdapp-gcc/include/rte_net.h:12,
                 from /root/FreeBSD1201-64_K12.1_GCC7.3.0/x86_64-native-bsdapp-gcc+shared/fdd2452bc8d44f2bbc2f919d9f93ff17/dpdk/drivers/net/virtio/virtio_rxtx_packed_avx.c:11:
/usr/local/lib/gcc9/gcc/x86_64-portbld-freebsd12.0/9.2.0/include/avx512fintrin.h:79:1: error: inlining failed in call to always_inline '_mm512_set_epi64': target specific option mismatch
   79 | _mm512_set_epi64 (long long __A, long long __B, long long __C,
      | ^~~~~~~~~~~~~~~~
/root/FreeBSD1201-64_K12.1_GCC7.3.0/x86_64-native-bsdapp-gcc+shared/fdd2452bc8d44f2bbc2f919d9f93ff17/dpdk/drivers/net/virtio/virtio_rxtx_packed_avx.c:152:22: note: called from here
  152 |  __m512i new_descs = _mm512_set_epi64(
      |                      ^~~~~~~~~~~~~~~~~
--
                 from /root/FreeBSD1201-64_K12.1_GCC7.3.0/x86_64-native-bsdapp-gcc+shared/fdd2452bc8d44f2bbc2f919d9f93ff17/dpdk/x86_64-native-bsdapp-gcc/include/rte_mempool.h:51,
                 from /root/FreeBSD1201-64_K12.1_GCC7.3.0/x86_64-native-bsdapp-gcc+shared/fdd2452bc8d44f2bbc2f919d9f93ff17/dpdk/x86_64-native-bsdapp-gcc/include/rte_mbuf.h:38,
                 from /root/FreeBSD1201-64_K12.1_GCC7.3.0/x86_64-native-bsdapp-gcc+shared/fdd2452bc8d44f2bbc2f919d9f93ff17/dpdk/x86_64-native-bsdapp-gcc/include/rte_ip.h:24,
                 from /root/FreeBSD1201-64_K12.1_GCC7.3.0/x86_64-native-bsdapp-gcc+shared/fdd2452bc8d44f2bbc2f919d9f93ff17/dpdk/x86_64-native-bsdapp-gcc/include/rte_net.h:12,
                 from /root/FreeBSD1201-64_K12.1_GCC7.3.0/x86_64-native-bsdapp-gcc+shared/fdd2452bc8d44f2bbc2f919d9f93ff17/dpdk/drivers/net/virtio/virtio_rxtx_packed_avx.c:11:
/usr/local/lib/gcc9/gcc/x86_64-portbld-freebsd12.0/9.2.0/include/avx512fintrin.h:6408:1: error: inlining failed in call to always_inline '_mm512_storeu_si512': target specific option mismatch
 6408 | _mm512_storeu_si512 (void *__P, __m512i __A)
      | ^~~~~~~~~~~~~~~~~~~
  CC otx2_ethdev_ops.o
/root/FreeBSD1201-64_K12.1_GCC7.3.0/x86_64-native-bsdapp-gcc+shared/fdd2452bc8d44f2bbc2f919d9f93ff17/dpdk/drivers/net/virtio/virtio_rxtx_packed_avx.c:172:2: note: called from here
  172 |  _mm512_storeu_si512((void *)&vq->vq_packed.ring.desc[idx], new_descs);
      |  ^~~~~~~~~~~~~~~~~~~~~~~~~~~~~~~~~~~~~~~~~~~~~~~~~~~~~~~~~~~~~~~~~~~~~
gmake[6]: *** [/root/FreeBSD1201-64_K12.1_GCC7.3.0/x86_64-native-bsdapp-gcc+shared/fdd2452bc8d44f2bbc2f919d9f93ff17/dpdk/mk/internal/rte.compile-pre.mk:114: virtio_rxtx_packed_avx.o] Error 1
gmake[6]: *** Waiting for unfinished jobs....
  LD vmxnet3_ethdev.o
  CC sfc_dp.o
  CC qede_main.o
  LD librte_pmd_vmxnet3_uio.so.20.0.1
--
  CC efx_evb.o
  CC efx_filter.o
  CC efx_hash.o
  CC efx_intr.o
  LD librte_pmd_octeontx2.so.20.0.1
gmake[5]: *** [/root/FreeBSD1201-64_K12.1_GCC7.3.0/x86_64-native-bsdapp-gcc+shared/fdd2452bc8d44f2bbc2f919d9f93ff17/dpdk/mk/rte.subdir.mk:35: virtio] Error 2
gmake[5]: *** Waiting for unfinished jobs....
  CC efx_lic.o
  CC efx_mac.o
  INSTALL-LIB librte_pmd_octeontx2.so.20.0.1
  CC efx_mcdi.o
--
  CC medford_nic.o
  CC hunt_nic.o
  CC medford2_nic.o
  LD librte_pmd_sfc_efx.so.20.0.1
  INSTALL-LIB librte_pmd_sfc_efx.so.20.0.1
gmake[4]: *** [/root/FreeBSD1201-64_K12.1_GCC7.3.0/x86_64-native-bsdapp-gcc+shared/fdd2452bc8d44f2bbc2f919d9f93ff17/dpdk/mk/rte.subdir.mk:35: net] Error 2
gmake[3]: *** [/root/FreeBSD1201-64_K12.1_GCC7.3.0/x86_64-native-bsdapp-gcc+shared/fdd2452bc8d44f2bbc2f919d9f93ff17/dpdk/mk/rte.sdkbuild.mk:46: drivers] Error 2
gmake[2]: *** [/root/FreeBSD1201-64_K12.1_GCC7.3.0/x86_64-native-bsdapp-gcc+shared/fdd2452bc8d44f2bbc2f919d9f93ff17/dpdk/mk/rte.sdkroot.mk:99: all] Error 2
gmake[1]: *** [/root/FreeBSD1201-64_K12.1_GCC7.3.0/x86_64-native-bsdapp-gcc+shared/fdd2452bc8d44f2bbc2f919d9f93ff17/dpdk/mk/rte.sdkinstall.mk:61: pre_install] Error 2
gmake: *** [/root/FreeBSD1201-64_K12.1_GCC7.3.0/x86_64-native-bsdapp-gcc+shared/fdd2452bc8d44f2bbc2f919d9f93ff17/dpdk/mk/rte.sdkroot.mk:77: install] Error 2

*Meson Build Failed #1:
OS: UB1604-32
Target:./build-gcc-static
FAILED: drivers/a715181@@tmp_rte_pmd_virtio@sta/net_virtio_virtio_rxtx_packed_avx.c.o 
gcc -Idrivers/a715181@@tmp_rte_pmd_virtio@sta -Idrivers -I../drivers -Idrivers/net/virtio -I../drivers/net/virtio -Ilib/librte_ethdev -I../lib/librte_ethdev -I. -I../ -Iconfig -I../config -Ilib/librte_eal/common/include -I../lib/librte_eal/common/include -I../lib/librte_eal/linux/eal/include -Ilib/librte_eal/common -I../lib/librte_eal/common -Ilib/librte_eal/common/include/arch/x86 -I../lib/librte_eal/common/include/arch/x86 -Ilib/librte_eal -I../lib/librte_eal -Ilib/librte_kvargs -I../lib/librte_kvargs -Ilib/librte_net -I../lib/librte_net -Ilib/librte_mbuf -I../lib/librte_mbuf -Ilib/librte_mempool -I../lib/librte_mempool -Ilib/librte_ring -I../lib/librte_ring -Ilib/librte_meter -I../lib/librte_meter -Idrivers/bus/pci -I../drivers/bus/pci -I../drivers/bus/pci/linux -Ilib/librte_pci -I../lib/librte_pci -Idrivers/bus/vdev -I../drivers/bus/vdev -fdiagnostics-color=always -pipe -D_FILE_OFFSET_BITS=64 -Wall -Winvalid-pch -Werror -O2 -g -include rte_config.h -Wextra -Wcast-qual -Wdeprecated -Wformat-nonliteral -Wformat-security -Wmissing-declarations -Wmissing-prototypes -Wnested-externs -Wold-style-definition -Wpointer-arith -Wsign-compare -Wstrict-prototypes -Wundef -Wwrite-strings -Wno-missing-field-initializers -Wno-pointer-to-int-cast -D_GNU_SOURCE -fPIC -march=native -DALLOW_EXPERIMENTAL_API -MD -MQ 'drivers/a715181@@tmp_rte_pmd_virtio@sta/net_virtio_virtio_rxtx_packed_avx.c.o' -MF 'drivers/a715181@@tmp_rte_pmd_virtio@sta/net_virtio_virtio_rxtx_packed_avx.c.o.d' -o 'drivers/a715181@@tmp_rte_pmd_virtio@sta/net_virtio_virtio_rxtx_packed_avx.c.o' -c ../drivers/net/virtio/virtio_rxtx_packed_avx.c
../drivers/net/virtio/virtio_rxtx_packed_avx.c: In function ‘virtqueue_enqueue_batch_packed_vec’:
../drivers/net/virtio/virtio_rxtx_packed_avx.c:152:10: error: AVX512F vector return without AVX512F enabled changes the ABI [-Werror=psabi]
  __m512i new_descs = _mm512_set_epi64(
          ^
In file included from /usr/lib/gcc/i686-linux-gnu/5/include/immintrin.h:59:0,
                 from /usr/lib/gcc/i686-linux-gnu/5/include/x86intrin.h:46,
                 from ../lib/librte_eal/common/include/arch/x86/rte_vect.h:30,
                 from ../lib/librte_eal/common/include/arch/x86/rte_memcpy.h:17,
                 from ../lib/librte_mempool/rte_mempool.h:51,
                 from ../lib/librte_mbuf/rte_mbuf.h:38,
                 from ../lib/librte_net/rte_ip.h:24,
                 from ../lib/librte_net/rte_net.h:12,
                 from ../drivers/net/virtio/virtio_rxtx_packed_avx.c:11:
/usr/lib/gcc/i686-linux-gnu/5/include/avx512vlbwintrin.h:3644:1: error: inlining failed in call to always_inline ‘_mm256_cmpneq_epu16_mask’: target specific option mismatch
 _mm256_cmpneq_epu16_mask (__m256i __X, __m256i __Y)
 ^
../drivers/net/virtio/virtio_rxtx_packed_avx.c:132:11: error: called from here
  uint16_t cmp = _mm256_cmpneq_epu16_mask(mbufs, mbuf_ref);
           ^
In file included from /usr/lib/gcc/i686-linux-gnu/5/include/immintrin.h:59:0,
                 from /usr/lib/gcc/i686-linux-gnu/5/include/x86intrin.h:46,
                 from ../lib/librte_eal/common/include/arch/x86/rte_vect.h:30,
                 from ../lib/librte_eal/common/include/arch/x86/rte_memcpy.h:17,
                 from ../lib/librte_mempool/rte_mempool.h:51,
                 from ../lib/librte_mbuf/rte_mbuf.h:38,
                 from ../lib/librte_net/rte_ip.h:24,
                 from ../lib/librte_net/rte_net.h:12,
                 from ../drivers/net/virtio/virtio_rxtx_packed_avx.c:11:
/usr/lib/gcc/i686-linux-gnu/5/include/avx512vlbwintrin.h:3644:1: error: inlining failed in call to always_inline ‘_mm256_cmpneq_epu16_mask’: target specific option mismatch
 _mm256_cmpneq_epu16_mask (__m256i __X, __m256i __Y)
 ^
../drivers/net/virtio/virtio_rxtx_packed_avx.c:132:11: error: called from here
  uint16_t cmp = _mm256_cmpneq_epu16_mask(mbufs, mbuf_ref);
           ^
In file included from /usr/lib/gcc/i686-linux-gnu/5/include/immintrin.h:45:0,
                 from /usr/lib/gcc/i686-linux-gnu/5/include/x86intrin.h:46,
                 from ../lib/librte_eal/common/include/arch/x86/rte_vect.h:30,
                 from ../lib/librte_eal/common/include/arch/x86/rte_memcpy.h:17,
                 from ../lib/librte_mempool/rte_mempool.h:51,
                 from ../lib/librte_mbuf/rte_mbuf.h:38,
                 from ../lib/librte_net/rte_ip.h:24,
                 from ../lib/librte_net/rte_net.h:12,
                 from ../drivers/net/virtio/virtio_rxtx_packed_avx.c:11:
/usr/lib/gcc/i686-linux-gnu/5/include/avx512fintrin.h:60:1: error: inlining failed in call to always_inline ‘_mm512_set_epi64’: target specific option mismatch
 _mm512_set_epi64 (long long __A, long long __B, long long __C,
 ^
../drivers/net/virtio/virtio_rxtx_packed_avx.c:152:10: error: called from here
  __m512i new_descs = _mm512_set_epi64(
          ^
In file included from /usr/lib/gcc/i686-linux-gnu/5/include/immintrin.h:45:0,
                 from /usr/lib/gcc/i686-linux-gnu/5/include/x86intrin.h:46,
                 from ../lib/librte_eal/common/include/arch/x86/rte_vect.h:30,
                 from ../lib/librte_eal/common/include/arch/x86/rte_memcpy.h:17,
                 from ../lib/librte_mempool/rte_mempool.h:51,
                 from ../lib/librte_mbuf/rte_mbuf.h:38,
                 from ../lib/librte_net/rte_ip.h:24,
                 from ../lib/librte_net/rte_net.h:12,
                 from ../drivers/net/virtio/virtio_rxtx_packed_avx.c:11:
/usr/lib/gcc/i686-linux-gnu/5/include/avx512fintrin.h:5818:1: error: inlining failed in call to always_inline ‘_mm512_storeu_si512’: target specific option mismatch
 _mm512_storeu_si512 (void *__P, __m512i __A)
 ^
../drivers/net/virtio/virtio_rxtx_packed_avx.c:172:2: error: called from here
  _mm512_storeu_si512((void *)&vq->vq_packed.ring.desc[idx], new_descs);
  ^
In file included from /usr/lib/gcc/i686-linux-gnu/5/include/immintrin.h:59:0,
                 from /usr/lib/gcc/i686-linux-gnu/5/include/x86intrin.h:46,
                 from ../lib/librte_eal/common/include/arch/x86/rte_vect.h:30,
                 from ../lib/librte_eal/common/include/arch/x86/rte_memcpy.h:17,
                 from ../lib/librte_mempool/rte_mempool.h:51,
                 from ../lib/librte_mbuf/rte_mbuf.h:38,
                 from ../lib/librte_net/rte_ip.h:24,
                 from ../lib/librte_net/rte_net.h:12,
                 from ../drivers/net/virtio/virtio_rxtx_packed_avx.c:11:
/usr/lib/gcc/i686-linux-gnu/5/include/avx512vlbwintrin.h:3644:1: error: inlining failed in call to always_inline ‘_mm256_cmpneq_epu16_mask’: target specific option mismatch
 _mm256_cmpneq_epu16_mask (__m256i __X, __m256i __Y)
 ^
../drivers/net/virtio/virtio_rxtx_packed_avx.c:132:11: error: called from here
  uint16_t cmp = _mm256_cmpneq_epu16_mask(mbufs, mbuf_ref);
           ^
In file included from /usr/lib/gcc/i686-linux-gnu/5/include/immintrin.h:45:0,
                 from /usr/lib/gcc/i686-linux-gnu/5/include/x86intrin.h:46,
                 from ../lib/librte_eal/common/include/arch/x86/rte_vect.h:30,
                 from ../lib/librte_eal/common/include/arch/x86/rte_memcpy.h:17,
                 from ../lib/librte_mempool/rte_mempool.h:51,
                 from ../lib/librte_mbuf/rte_mbuf.h:38,
                 from ../lib/librte_net/rte_ip.h:24,
                 from ../lib/librte_net/rte_net.h:12,
                 from ../drivers/net/virtio/virtio_rxtx_packed_avx.c:11:
/usr/lib/gcc/i686-linux-gnu/5/include/avx512fintrin.h:60:1: error: inlining failed in call to always_inline ‘_mm512_set_epi64’: target specific option mismatch
 _mm512_set_epi64 (long long __A, long long __B, long long __C,
 ^
../drivers/net/virtio/virtio_rxtx_packed_avx.c:152:10: error: called from here
  __m512i new_descs = _mm512_set_epi64(
          ^
In file included from /usr/lib/gcc/i686-linux-gnu/5/include/immintrin.h:45:0,
                 from /usr/lib/gcc/i686-linux-gnu/5/include/x86intrin.h:46,
                 from ../lib/librte_eal/common/include/arch/x86/rte_vect.h:30,
                 from ../lib/librte_eal/common/include/arch/x86/rte_memcpy.h:17,
                 from ../lib/librte_mempool/rte_mempool.h:51,
                 from ../lib/librte_mbuf/rte_mbuf.h:38,
                 from ../lib/librte_net/rte_ip.h:24,
                 from ../lib/librte_net/rte_net.h:12,
                 from ../drivers/net/virtio/virtio_rxtx_packed_avx.c:11:
/usr/lib/gcc/i686-linux-gnu/5/include/avx512fintrin.h:5818:1: error: inlining failed in call to always_inline ‘_mm512_storeu_si512’: target specific option mismatch
 _mm512_storeu_si512 (void *__P, __m512i __A)
 ^
../drivers/net/virtio/virtio_rxtx_packed_avx.c:172:2: error: called from here
  _mm512_storeu_si512((void *)&vq->vq_packed.ring.desc[idx], new_descs);
  ^
cc1: all warnings being treated as errors
[1227/1973] Compiling C object 'drivers/a715181@@tmp_rte_pmd_virtio@sta/net_virtio_virtio_rxtx_simple_sse.c.o'.
[1228/1973] Compiling C object 'drivers/a715181@@tmp_rte_pmd_virtio@sta/net_virtio_virtqueue.c.o'.
[1229/1973] Generating rte_pmd_vhost.exp_chk with a meson_exe.py custom command.
[1230/1973] Compiling C object 'drivers/a715181@@tmp_rte_pmd_virtio@sta/net_virtio_virtio_user_vhost_kernel.c.o'.
[1231/1973] Compiling C object 'drivers/a715181@@tmp_rte_pmd_thunderx@sta/net_thunderx_nicvf_ethdev.c.o'.
[1232/1973] Compiling C object 'drivers/a715181@@tmp_rte_pmd_virtio@sta/net_virtio_virtio_ethdev.c.o'.
[1233/1973] Compiling C object 'drivers/a715181@@tmp_rte_pmd_virtio@sta/net_virtio_virtio_user_ethdev.c.o'.
[1234/1973] Compiling C object 'drivers/a715181@@tmp_rte_pmd_virtio@sta/net_virtio_virtio_rxtx.c.o'.
[1235/1973] Compiling C object 'drivers/a715181@@tmp_rte_pmd_octeontx2@sta/net_octeontx2_otx2_tx.c.o'.
ninja: build stopped: subcommand failed




*Meson Build Failed #2:
OS: CENTOS77-64
Target:./build-gcc-static
FAILED: drivers/a715181@@tmp_rte_pmd_virtio@sta/net_virtio_virtio_rxtx_packed_avx.c.o 
gcc -Idrivers/a715181@@tmp_rte_pmd_virtio@sta -Idrivers -I../drivers -Idrivers/net/virtio -I../drivers/net/virtio -Ilib/librte_ethdev -I../lib/librte_ethdev -I. -I../ -Iconfig -I../config -Ilib/librte_eal/common/include -I../lib/librte_eal/common/include -I../lib/librte_eal/linux/eal/include -Ilib/librte_eal/common -I../lib/librte_eal/common -Ilib/librte_eal/common/include/arch/x86 -I../lib/librte_eal/common/include/arch/x86 -Ilib/librte_eal -I../lib/librte_eal -Ilib/librte_kvargs -I../lib/librte_kvargs -Ilib/librte_net -I../lib/librte_net -Ilib/librte_mbuf -I../lib/librte_mbuf -Ilib/librte_mempool -I../lib/librte_mempool -Ilib/librte_ring -I../lib/librte_ring -Ilib/librte_meter -I../lib/librte_meter -Idrivers/bus/pci -I../drivers/bus/pci -I../drivers/bus/pci/linux -Ilib/librte_pci -I../lib/librte_pci -Idrivers/bus/vdev -I../drivers/bus/vdev -pipe -D_FILE_OFFSET_BITS=64 -Wall -Winvalid-pch -Werror -O2 -g -include rte_config.h -Wextra -Wcast-qual -Wdeprecated -Wformat-nonliteral -Wformat-security -Wmissing-declarations -Wmissing-prototypes -Wnested-externs -Wold-style-definition -Wpointer-arith -Wsign-compare -Wstrict-prototypes -Wundef -Wwrite-strings -Wno-missing-field-initializers -D_GNU_SOURCE -fPIC -march=native -DALLOW_EXPERIMENTAL_API -MD -MQ 'drivers/a715181@@tmp_rte_pmd_virtio@sta/net_virtio_virtio_rxtx_packed_avx.c.o' -MF 'drivers/a715181@@tmp_rte_pmd_virtio@sta/net_virtio_virtio_rxtx_packed_avx.c.o.d' -o 'drivers/a715181@@tmp_rte_pmd_virtio@sta/net_virtio_virtio_rxtx_packed_avx.c.o' -c ../drivers/net/virtio/virtio_rxtx_packed_avx.c
../drivers/net/virtio/virtio_rxtx_packed_avx.c: In function ‘virtqueue_enqueue_batch_packed_vec’:
../drivers/net/virtio/virtio_rxtx_packed_avx.c:132:2: error: implicit declaration of function ‘_mm256_cmpneq_epu16_mask’ [-Werror=implicit-function-declaration]
  uint16_t cmp = _mm256_cmpneq_epu16_mask(mbufs, mbuf_ref);
  ^
../drivers/net/virtio/virtio_rxtx_packed_avx.c:132:2: error: nested extern declaration of ‘_mm256_cmpneq_epu16_mask’ [-Werror=nested-externs]
../drivers/net/virtio/virtio_rxtx_packed_avx.c:152:2: error: unknown type name ‘__m512i’
  __m512i new_descs = _mm512_set_epi64(
  ^
../drivers/net/virtio/virtio_rxtx_packed_avx.c:152:2: error: implicit declaration of function ‘_mm512_set_epi64’ [-Werror=implicit-function-declaration]
../drivers/net/virtio/virtio_rxtx_packed_avx.c:152:2: error: nested extern declaration of ‘_mm512_set_epi64’ [-Werror=nested-externs]
../drivers/net/virtio/virtio_rxtx_packed_avx.c:172:2: error: implicit declaration of function ‘_mm512_storeu_si512’ [-Werror=implicit-function-declaration]
  _mm512_storeu_si512((void *)&vq->vq_packed.ring.desc[idx], new_descs);
  ^
../drivers/net/virtio/virtio_rxtx_packed_avx.c:172:2: error: nested extern declaration of ‘_mm512_storeu_si512’ [-Werror=nested-externs]
../drivers/net/virtio/virtio_rxtx_packed_avx.c: In function ‘virtqueue_dequeue_batch_packed_vec’:
../drivers/net/virtio/virtio_rxtx_packed_avx.c:353:2: error: unknown type name ‘__m512i’
  __m512i desc_flags = _mm512_set_epi64(
  ^
../drivers/net/virtio/virtio_rxtx_packed_avx.c:361:2: error: unknown type name ‘__m512i’
  __m512i packed_desc = _mm512_loadu_si512(desc_addr);
  ^
../drivers/net/virtio/virtio_rxtx_packed_avx.c:361:2: error: implicit declaration of function ‘_mm512_loadu_si512’ [-Werror=implicit-function-declaration]
../drivers/net/virtio/virtio_rxtx_packed_avx.c:361:2: error: nested extern declaration of ‘_mm512_loadu_si512’ [-Werror=nested-externs]
../drivers/net/virtio/virtio_rxtx_packed_avx.c:362:2: error: unknown type name ‘__m512i’
  __m512i flags_mask  = _mm512_maskz_and_epi64(0xff, packed_desc,
  ^
../drivers/net/virtio/virtio_rxtx_packed_avx.c:362:2: error: implicit declaration of function ‘_mm512_maskz_and_epi64’ [-Werror=implicit-function-declaration]
../drivers/net/virtio/virtio_rxtx_packed_avx.c:362:2: error: nested extern declaration of ‘_mm512_maskz_and_epi64’ [-Werror=nested-externs]
../drivers/net/virtio/virtio_rxtx_packed_avx.c:365:2: error: unknown type name ‘__m512i’
  __m512i used_flags;
  ^
../drivers/net/virtio/virtio_rxtx_packed_avx.c:381:2: error: implicit declaration of function ‘_mm512_cmp_epu64_mask’ [-Werror=implicit-function-declaration]
  desc_stats = _mm512_cmp_epu64_mask(flags_mask, used_flags,
  ^
../drivers/net/virtio/virtio_rxtx_packed_avx.c:381:2: error: nested extern declaration of ‘_mm512_cmp_epu64_mask’ [-Werror=nested-externs]
../drivers/net/virtio/virtio_rxtx_packed_avx.c:382:4: error: ‘_MM_CMPINT_EQ’ undeclared (first use in this function)
    _MM_CMPINT_EQ);
    ^
../drivers/net/virtio/virtio_rxtx_packed_avx.c:382:4: note: each undeclared identifier is reported only once for each function it appears in
../drivers/net/virtio/virtio_rxtx_packed_avx.c:402:2: error: unknown type name ‘__m512i’
  __m512i vindex = _mm512_set_epi64(
  ^
../drivers/net/virtio/virtio_rxtx_packed_avx.c:412:2: error: unknown type name ‘__m512i’
  __m512i value = _mm512_maskz_shuffle_epi32(0x6666, packed_desc, 0xAA);
  ^
../drivers/net/virtio/virtio_rxtx_packed_avx.c:412:2: error: implicit declaration of function ‘_mm512_maskz_shuffle_epi32’ [-Werror=implicit-function-declaration]
../drivers/net/virtio/virtio_rxtx_packed_avx.c:412:2: error: nested extern declaration of ‘_mm512_maskz_shuffle_epi32’ [-Werror=nested-externs]
../drivers/net/virtio/virtio_rxtx_packed_avx.c:414:2: error: unknown type name ‘__m512i’
  __m512i mbuf_len_offset = _mm512_set_epi32(
  ^
../drivers/net/virtio/virtio_rxtx_packed_avx.c:414:2: error: implicit declaration of function ‘_mm512_set_epi32’ [-Werror=implicit-function-declaration]
../drivers/net/virtio/virtio_rxtx_packed_avx.c:414:2: error: nested extern declaration of ‘_mm512_set_epi32’ [-Werror=nested-externs]
../drivers/net/virtio/virtio_rxtx_packed_avx.c:420:2: error: implicit declaration of function ‘_mm512_add_epi32’ [-Werror=implicit-function-declaration]
  value = _mm512_add_epi32(value, mbuf_len_offset);
  ^
../drivers/net/virtio/virtio_rxtx_packed_avx.c:420:2: error: nested extern declaration of ‘_mm512_add_epi32’ [-Werror=nested-externs]
../drivers/net/virtio/virtio_rxtx_packed_avx.c:422:2: error: implicit declaration of function ‘_mm512_i64scatter_epi64’ [-Werror=implicit-function-declaration]
  _mm512_i64scatter_epi64(0, vindex, value, 1);
  ^
../drivers/net/virtio/virtio_rxtx_packed_avx.c:422:2: error: nested extern declaration of ‘_mm512_i64scatter_epi64’ [-Werror=nested-externs]
cc1: all warnings being treated as errors
[1378/2239] Generating rte_pmd_thunderx.pmd.c with a custom command.
[1379/2239] Compiling C object 'drivers/a715181@@tmp_rte_pmd_virtio@sta/net_virtio_virtio_rxtx_simple_sse.c.o'.
[1380/2239] Generating rte_pmd_vhost.exp_chk with a meson_exe.py custom command.
[1381/2239] Compiling C object 'drivers/a715181@@tmp_rte_pmd_virtio@sta/net_virtio_virtio_user_ethdev.c.o'.
[1382/2239] Compiling C object 'drivers/a715181@@tmp_rte_pmd_virtio@sta/net_virtio_virtqueue.c.o'.
[1383/2239] Generating rte_pmd_softnic.exp_chk with a meson_exe.py custom command.
[1384/2239] Compiling C object 'drivers/a715181@@tmp_rte_pmd_octeontx2@sta/net_octeontx2_otx2_rx.c.o'.
[1385/2239] Compiling C object 'drivers/a715181@@tmp_rte_pmd_virtio@sta/net_virtio_virtio_rxtx.c.o'.
[1386/2239] Compiling C object 'drivers/a715181@@tmp_rte_pmd_octeontx2@sta/net_octeontx2_otx2_tx.c.o'.
ninja: build stopped: subcommand failed




*Meson Build Failed #3:
OS: FC31-64
Target:./build-gcc-static
FAILED: drivers/a715181@@tmp_rte_pmd_virtio@sta/net_virtio_virtio_rxtx_packed_avx.c.o 
gcc -Idrivers/a715181@@tmp_rte_pmd_virtio@sta -Idrivers -I../drivers -Idrivers/net/virtio -I../drivers/net/virtio -Ilib/librte_ethdev -I../lib/librte_ethdev -I. -I../ -Iconfig -I../config -Ilib/librte_eal/common/include -I../lib/librte_eal/common/include -I../lib/librte_eal/linux/eal/include -Ilib/librte_eal/common -I../lib/librte_eal/common -Ilib/librte_eal/common/include/arch/x86 -I../lib/librte_eal/common/include/arch/x86 -Ilib/librte_eal -I../lib/librte_eal -Ilib/librte_kvargs -I../lib/librte_kvargs -Ilib/librte_net -I../lib/librte_net -Ilib/librte_mbuf -I../lib/librte_mbuf -Ilib/librte_mempool -I../lib/librte_mempool -Ilib/librte_ring -I../lib/librte_ring -Ilib/librte_meter -I../lib/librte_meter -Idrivers/bus/pci -I../drivers/bus/pci -I../drivers/bus/pci/linux -Ilib/librte_pci -I../lib/librte_pci -Idrivers/bus/vdev -I../drivers/bus/vdev -fdiagnostics-color=always -pipe -D_FILE_OFFSET_BITS=64 -Wall -Winvalid-pch -Werror -O2 -g -include rte_config.h -Wextra -Wcast-qual -Wdeprecated -Wformat-nonliteral -Wformat-security -Wmissing-declarations -Wmissing-prototypes -Wnested-externs -Wold-style-definition -Wpointer-arith -Wsign-compare -Wstrict-prototypes -Wundef -Wwrite-strings -Wno-address-of-packed-member -Wno-packed-not-aligned -Wno-missing-field-initializers -D_GNU_SOURCE -fPIC -march=native -Wno-format-truncation -DALLOW_EXPERIMENTAL_API -MD -MQ 'drivers/a715181@@tmp_rte_pmd_virtio@sta/net_virtio_virtio_rxtx_packed_avx.c.o' -MF 'drivers/a715181@@tmp_rte_pmd_virtio@sta/net_virtio_virtio_rxtx_packed_avx.c.o.d' -o 'drivers/a715181@@tmp_rte_pmd_virtio@sta/net_virtio_virtio_rxtx_packed_avx.c.o' -c ../drivers/net/virtio/virtio_rxtx_packed_avx.c
../drivers/net/virtio/virtio_rxtx_packed_avx.c: In function ‘virtqueue_enqueue_batch_packed_vec’:
../drivers/net/virtio/virtio_rxtx_packed_avx.c:152:10: error: AVX512F vector return without AVX512F enabled changes the ABI [-Werror=psabi]
  152 |  __m512i new_descs = _mm512_set_epi64(
      |          ^~~~~~~~~
In file included from /usr/lib/gcc/x86_64-redhat-linux/9/include/immintrin.h:69,
                 from /usr/lib/gcc/x86_64-redhat-linux/9/include/x86intrin.h:32,
                 from ../lib/librte_eal/common/include/arch/x86/rte_vect.h:30,
                 from ../lib/librte_eal/common/include/arch/x86/rte_memcpy.h:17,
                 from ../lib/librte_mempool/rte_mempool.h:51,
                 from ../lib/librte_mbuf/rte_mbuf.h:38,
                 from ../lib/librte_net/rte_ip.h:24,
                 from ../lib/librte_net/rte_net.h:12,
                 from ../drivers/net/virtio/virtio_rxtx_packed_avx.c:11:
/usr/lib/gcc/x86_64-redhat-linux/9/include/avx512vlbwintrin.h:3677:1: error: inlining failed in call to always_inline ‘_mm256_cmpneq_epu16_mask’: target specific option mismatch
 3677 | _mm256_cmpneq_epu16_mask (__m256i __X, __m256i __Y)
      | ^~~~~~~~~~~~~~~~~~~~~~~~
../drivers/net/virtio/virtio_rxtx_packed_avx.c:132:17: note: called from here
  132 |  uint16_t cmp = _mm256_cmpneq_epu16_mask(mbufs, mbuf_ref);
      |                 ^~~~~~~~~~~~~~~~~~~~~~~~~~~~~~~~~~~~~~~~~
In file included from /usr/lib/gcc/x86_64-redhat-linux/9/include/immintrin.h:69,
                 from /usr/lib/gcc/x86_64-redhat-linux/9/include/x86intrin.h:32,
                 from ../lib/librte_eal/common/include/arch/x86/rte_vect.h:30,
                 from ../lib/librte_eal/common/include/arch/x86/rte_memcpy.h:17,
                 from ../lib/librte_mempool/rte_mempool.h:51,
                 from ../lib/librte_mbuf/rte_mbuf.h:38,
                 from ../lib/librte_net/rte_ip.h:24,
                 from ../lib/librte_net/rte_net.h:12,
                 from ../drivers/net/virtio/virtio_rxtx_packed_avx.c:11:
/usr/lib/gcc/x86_64-redhat-linux/9/include/avx512vlbwintrin.h:3677:1: error: inlining failed in call to always_inline ‘_mm256_cmpneq_epu16_mask’: target specific option mismatch
 3677 | _mm256_cmpneq_epu16_mask (__m256i __X, __m256i __Y)
      | ^~~~~~~~~~~~~~~~~~~~~~~~
../drivers/net/virtio/virtio_rxtx_packed_avx.c:132:17: note: called from here
  132 |  uint16_t cmp = _mm256_cmpneq_epu16_mask(mbufs, mbuf_ref);
      |                 ^~~~~~~~~~~~~~~~~~~~~~~~~~~~~~~~~~~~~~~~~
In file included from /usr/lib/gcc/x86_64-redhat-linux/9/include/immintrin.h:55,
                 from /usr/lib/gcc/x86_64-redhat-linux/9/include/x86intrin.h:32,
                 from ../lib/librte_eal/common/include/arch/x86/rte_vect.h:30,
                 from ../lib/librte_eal/common/include/arch/x86/rte_memcpy.h:17,
                 from ../lib/librte_mempool/rte_mempool.h:51,
                 from ../lib/librte_mbuf/rte_mbuf.h:38,
                 from ../lib/librte_net/rte_ip.h:24,
                 from ../lib/librte_net/rte_net.h:12,
                 from ../drivers/net/virtio/virtio_rxtx_packed_avx.c:11:
/usr/lib/gcc/x86_64-redhat-linux/9/include/avx512fintrin.h:79:1: error: inlining failed in call to always_inline ‘_mm512_set_epi64’: target specific option mismatch
   79 | _mm512_set_epi64 (long long __A, long long __B, long long __C,
      | ^~~~~~~~~~~~~~~~
../drivers/net/virtio/virtio_rxtx_packed_avx.c:152:22: note: called from here
  152 |  __m512i new_descs = _mm512_set_epi64(
      |                      ^~~~~~~~~~~~~~~~~
  153 |    descs[3], VIRTIO_MBUF_DATA_DMA_ADDR(tx_pkts[3], vq),
      |    ~~~~~~~~~~~~~~~~~~~~~~~~~~~~~~~~~~~~~~~~~~~~~~~~~~~~
  154 |    descs[2], VIRTIO_MBUF_DATA_DMA_ADDR(tx_pkts[2], vq),
      |    ~~~~~~~~~~~~~~~~~~~~~~~~~~~~~~~~~~~~~~~~~~~~~~~~~~~~
  155 |    descs[1], VIRTIO_MBUF_DATA_DMA_ADDR(tx_pkts[1], vq),
      |    ~~~~~~~~~~~~~~~~~~~~~~~~~~~~~~~~~~~~~~~~~~~~~~~~~~~~
  156 |    descs[0], VIRTIO_MBUF_DATA_DMA_ADDR(tx_pkts[0], vq));
      |    ~~~~~~~~~~~~~~~~~~~~~~~~~~~~~~~~~~~~~~~~~~~~~~~~~~~~
In file included from /usr/lib/gcc/x86_64-redhat-linux/9/include/immintrin.h:55,
                 from /usr/lib/gcc/x86_64-redhat-linux/9/include/x86intrin.h:32,
                 from ../lib/librte_eal/common/include/arch/x86/rte_vect.h:30,
                 from ../lib/librte_eal/common/include/arch/x86/rte_memcpy.h:17,
                 from ../lib/librte_mempool/rte_mempool.h:51,
                 from ../lib/librte_mbuf/rte_mbuf.h:38,
                 from ../lib/librte_net/rte_ip.h:24,
                 from ../lib/librte_net/rte_net.h:12,
                 from ../drivers/net/virtio/virtio_rxtx_packed_avx.c:11:
/usr/lib/gcc/x86_64-redhat-linux/9/include/avx512fintrin.h:6408:1: error: inlining failed in call to always_inline ‘_mm512_storeu_si512’: target specific option mismatch
 6408 | _mm512_storeu_si512 (void *__P, __m512i __A)
      | ^~~~~~~~~~~~~~~~~~~
../drivers/net/virtio/virtio_rxtx_packed_avx.c:172:2: note: called from here
  172 |  _mm512_storeu_si512((void *)&vq->vq_packed.ring.desc[idx], new_descs);
      |  ^~~~~~~~~~~~~~~~~~~~~~~~~~~~~~~~~~~~~~~~~~~~~~~~~~~~~~~~~~~~~~~~~~~~~
In file included from /usr/lib/gcc/x86_64-redhat-linux/9/include/immintrin.h:69,
                 from /usr/lib/gcc/x86_64-redhat-linux/9/include/x86intrin.h:32,
                 from ../lib/librte_eal/common/include/arch/x86/rte_vect.h:30,
                 from ../lib/librte_eal/common/include/arch/x86/rte_memcpy.h:17,
                 from ../lib/librte_mempool/rte_mempool.h:51,
                 from ../lib/librte_mbuf/rte_mbuf.h:38,
                 from ../lib/librte_net/rte_ip.h:24,
                 from ../lib/librte_net/rte_net.h:12,
                 from ../drivers/net/virtio/virtio_rxtx_packed_avx.c:11:
/usr/lib/gcc/x86_64-redhat-linux/9/include/avx512vlbwintrin.h:3677:1: error: inlining failed in call to always_inline ‘_mm256_cmpneq_epu16_mask’: target specific option mismatch
 3677 | _mm256_cmpneq_epu16_mask (__m256i __X, __m256i __Y)
      | ^~~~~~~~~~~~~~~~~~~~~~~~
../drivers/net/virtio/virtio_rxtx_packed_avx.c:132:17: note: called from here
  132 |  uint16_t cmp = _mm256_cmpneq_epu16_mask(mbufs, mbuf_ref);
      |                 ^~~~~~~~~~~~~~~~~~~~~~~~~~~~~~~~~~~~~~~~~
In file included from /usr/lib/gcc/x86_64-redhat-linux/9/include/immintrin.h:55,
                 from /usr/lib/gcc/x86_64-redhat-linux/9/include/x86intrin.h:32,
                 from ../lib/librte_eal/common/include/arch/x86/rte_vect.h:30,
                 from ../lib/librte_eal/common/include/arch/x86/rte_memcpy.h:17,
                 from ../lib/librte_mempool/rte_mempool.h:51,
                 from ../lib/librte_mbuf/rte_mbuf.h:38,
                 from ../lib/librte_net/rte_ip.h:24,
                 from ../lib/librte_net/rte_net.h:12,
                 from ../drivers/net/virtio/virtio_rxtx_packed_avx.c:11:
/usr/lib/gcc/x86_64-redhat-linux/9/include/avx512fintrin.h:79:1: error: inlining failed in call to always_inline ‘_mm512_set_epi64’: target specific option mismatch
   79 | _mm512_set_epi64 (long long __A, long long __B, long long __C,
      | ^~~~~~~~~~~~~~~~
../drivers/net/virtio/virtio_rxtx_packed_avx.c:152:22: note: called from here
  152 |  __m512i new_descs = _mm512_set_epi64(
      |                      ^~~~~~~~~~~~~~~~~
  153 |    descs[3], VIRTIO_MBUF_DATA_DMA_ADDR(tx_pkts[3], vq),
      |    ~~~~~~~~~~~~~~~~~~~~~~~~~~~~~~~~~~~~~~~~~~~~~~~~~~~~
  154 |    descs[2], VIRTIO_MBUF_DATA_DMA_ADDR(tx_pkts[2], vq),
      |    ~~~~~~~~~~~~~~~~~~~~~~~~~~~~~~~~~~~~~~~~~~~~~~~~~~~~
  155 |    descs[1], VIRTIO_MBUF_DATA_DMA_ADDR(tx_pkts[1], vq),
      |    ~~~~~~~~~~~~~~~~~~~~~~~~~~~~~~~~~~~~~~~~~~~~~~~~~~~~
  156 |    descs[0], VIRTIO_MBUF_DATA_DMA_ADDR(tx_pkts[0], vq));
      |    ~~~~~~~~~~~~~~~~~~~~~~~~~~~~~~~~~~~~~~~~~~~~~~~~~~~~
In file included from /usr/lib/gcc/x86_64-redhat-linux/9/include/immintrin.h:55,
                 from /usr/lib/gcc/x86_64-redhat-linux/9/include/x86intrin.h:32,
                 from ../lib/librte_eal/common/include/arch/x86/rte_vect.h:30,
                 from ../lib/librte_eal/common/include/arch/x86/rte_memcpy.h:17,
                 from ../lib/librte_mempool/rte_mempool.h:51,
                 from ../lib/librte_mbuf/rte_mbuf.h:38,
                 from ../lib/librte_net/rte_ip.h:24,
                 from ../lib/librte_net/rte_net.h:12,
                 from ../drivers/net/virtio/virtio_rxtx_packed_avx.c:11:
/usr/lib/gcc/x86_64-redhat-linux/9/include/avx512fintrin.h:6408:1: error: inlining failed in call to always_inline ‘_mm512_storeu_si512’: target specific option mismatch
 6408 | _mm512_storeu_si512 (void *__P, __m512i __A)
      | ^~~~~~~~~~~~~~~~~~~
../drivers/net/virtio/virtio_rxtx_packed_avx.c:172:2: note: called from here
  172 |  _mm512_storeu_si512((void *)&vq->vq_packed.ring.desc[idx], new_descs);
      |  ^~~~~~~~~~~~~~~~~~~~~~~~~~~~~~~~~~~~~~~~~~~~~~~~~~~~~~~~~~~~~~~~~~~~~
cc1: all warnings being treated as errors
[1396/2248] Compiling C object 'drivers/a715181@@tmp_rte_pmd_virtio@sta/net_virtio_virtio_user_vhost_kernel.c.o'.
[1397/2248] Compiling C object 'drivers/a715181@@rte_pmd_tap@sta/meson-generated_.._rte_pmd_tap.pmd.c.o'.
[1398/2248] Compiling C object 'drivers/a715181@@tmp_rte_pmd_virtio@sta/net_virtio_virtio_user_ethdev.c.o'.
[1399/2248] Compiling C object 'drivers/a715181@@tmp_rte_pmd_virtio@sta/net_virtio_virtio_rxtx_simple_sse.c.o'.
[1400/2248] Generating rte_pmd_vhost.exp_chk with a meson_exe.py custom command.
[1401/2248] Compiling C object 'drivers/a715181@@tmp_rte_pmd_virtio@sta/net_virtio_virtio_ethdev.c.o'.
[1402/2248] Compiling C object 'drivers/a715181@@tmp_rte_pmd_virtio@sta/net_virtio_virtio_user_virtio_user_dev.c.o'.
[1403/2248] Compiling C object 'drivers/a715181@@tmp_rte_pmd_virtio@sta/net_virtio_virtio_user_vhost_user.c.o'.
[1404/2248] Compiling C object 'drivers/a715181@@tmp_rte_pmd_virtio@sta/net_virtio_virtio_rxtx.c.o'.
ninja: build stopped: subcommand failed




*Meson Build Failed #4:
OS: UB1804-64
Target:./build-gcc-static
FAILED: drivers/a715181@@tmp_rte_pmd_virtio@sta/net_virtio_virtio_rxtx_packed_avx.c.o 
gcc -Idrivers/a715181@@tmp_rte_pmd_virtio@sta -Idrivers -I../drivers -Idrivers/net/virtio -I../drivers/net/virtio -Ilib/librte_ethdev -I../lib/librte_ethdev -I. -I../ -Iconfig -I../config -Ilib/librte_eal/common/include -I../lib/librte_eal/common/include -I../lib/librte_eal/linux/eal/include -Ilib/librte_eal/common -I../lib/librte_eal/common -Ilib/librte_eal/common/include/arch/x86 -I../lib/librte_eal/common/include/arch/x86 -Ilib/librte_eal -I../lib/librte_eal -Ilib/librte_kvargs -I../lib/librte_kvargs -Ilib/librte_net -I../lib/librte_net -Ilib/librte_mbuf -I../lib/librte_mbuf -Ilib/librte_mempool -I../lib/librte_mempool -Ilib/librte_ring -I../lib/librte_ring -Ilib/librte_meter -I../lib/librte_meter -Idrivers/bus/pci -I../drivers/bus/pci -I../drivers/bus/pci/linux -Ilib/librte_pci -I../lib/librte_pci -Idrivers/bus/vdev -I../drivers/bus/vdev -fdiagnostics-color=always -pipe -D_FILE_OFFSET_BITS=64 -Wall -Winvalid-pch -Werror -O2 -g -include rte_config.h -Wextra -Wcast-qual -Wdeprecated -Wformat-nonliteral -Wformat-security -Wmissing-declarations -Wmissing-prototypes -Wnested-externs -Wold-style-definition -Wpointer-arith -Wsign-compare -Wstrict-prototypes -Wundef -Wwrite-strings -Wno-missing-field-initializers -D_GNU_SOURCE -fPIC -march=native -mno-avx512f -Wno-format-truncation -DALLOW_EXPERIMENTAL_API -MD -MQ 'drivers/a715181@@tmp_rte_pmd_virtio@sta/net_virtio_virtio_rxtx_packed_avx.c.o' -MF 'drivers/a715181@@tmp_rte_pmd_virtio@sta/net_virtio_virtio_rxtx_packed_avx.c.o.d' -o 'drivers/a715181@@tmp_rte_pmd_virtio@sta/net_virtio_virtio_rxtx_packed_avx.c.o' -c ../drivers/net/virtio/virtio_rxtx_packed_avx.c
../drivers/net/virtio/virtio_rxtx_packed_avx.c: In function ‘virtqueue_enqueue_batch_packed_vec’:
../drivers/net/virtio/virtio_rxtx_packed_avx.c:152:10: error: AVX512F vector return without AVX512F enabled changes the ABI [-Werror=psabi]
  __m512i new_descs = _mm512_set_epi64(
          ^~~~~~~~~
In file included from /usr/lib/gcc/x86_64-linux-gnu/7/include/immintrin.h:59:0,
                 from /usr/lib/gcc/x86_64-linux-gnu/7/include/x86intrin.h:48,
                 from ../lib/librte_eal/common/include/arch/x86/rte_vect.h:30,
                 from ../lib/librte_eal/common/include/arch/x86/rte_memcpy.h:17,
                 from ../lib/librte_mempool/rte_mempool.h:51,
                 from ../lib/librte_mbuf/rte_mbuf.h:38,
                 from ../lib/librte_net/rte_ip.h:24,
                 from ../lib/librte_net/rte_net.h:12,
                 from ../drivers/net/virtio/virtio_rxtx_packed_avx.c:11:
/usr/lib/gcc/x86_64-linux-gnu/7/include/avx512vlbwintrin.h:3642:1: error: inlining failed in call to always_inline ‘_mm256_cmpneq_epu16_mask’: target specific option mismatch
 _mm256_cmpneq_epu16_mask (__m256i __X, __m256i __Y)
 ^~~~~~~~~~~~~~~~~~~~~~~~
../drivers/net/virtio/virtio_rxtx_packed_avx.c:132:11: note: called from here
  uint16_t cmp = _mm256_cmpneq_epu16_mask(mbufs, mbuf_ref);
           ^~~
In file included from /usr/lib/gcc/x86_64-linux-gnu/7/include/immintrin.h:59:0,
                 from /usr/lib/gcc/x86_64-linux-gnu/7/include/x86intrin.h:48,
                 from ../lib/librte_eal/common/include/arch/x86/rte_vect.h:30,
                 from ../lib/librte_eal/common/include/arch/x86/rte_memcpy.h:17,
                 from ../lib/librte_mempool/rte_mempool.h:51,
                 from ../lib/librte_mbuf/rte_mbuf.h:38,
                 from ../lib/librte_net/rte_ip.h:24,
                 from ../lib/librte_net/rte_net.h:12,
                 from ../drivers/net/virtio/virtio_rxtx_packed_avx.c:11:
/usr/lib/gcc/x86_64-linux-gnu/7/include/avx512vlbwintrin.h:3642:1: error: inlining failed in call to always_inline ‘_mm256_cmpneq_epu16_mask’: target specific option mismatch
 _mm256_cmpneq_epu16_mask (__m256i __X, __m256i __Y)
 ^~~~~~~~~~~~~~~~~~~~~~~~
../drivers/net/virtio/virtio_rxtx_packed_avx.c:132:11: note: called from here
  uint16_t cmp = _mm256_cmpneq_epu16_mask(mbufs, mbuf_ref);
           ^~~
In file included from /usr/lib/gcc/x86_64-linux-gnu/7/include/immintrin.h:45:0,
                 from /usr/lib/gcc/x86_64-linux-gnu/7/include/x86intrin.h:48,
                 from ../lib/librte_eal/common/include/arch/x86/rte_vect.h:30,
                 from ../lib/librte_eal/common/include/arch/x86/rte_memcpy.h:17,
                 from ../lib/librte_mempool/rte_mempool.h:51,
                 from ../lib/librte_mbuf/rte_mbuf.h:38,
                 from ../lib/librte_net/rte_ip.h:24,
                 from ../lib/librte_net/rte_net.h:12,
                 from ../drivers/net/virtio/virtio_rxtx_packed_avx.c:11:
/usr/lib/gcc/x86_64-linux-gnu/7/include/avx512fintrin.h:79:1: error: inlining failed in call to always_inline ‘_mm512_set_epi64’: target specific option mismatch
 _mm512_set_epi64 (long long __A, long long __B, long long __C,
 ^~~~~~~~~~~~~~~~
../drivers/net/virtio/virtio_rxtx_packed_avx.c:152:10: note: called from here
  __m512i new_descs = _mm512_set_epi64(
          ^~~~~~~~~
In file included from /usr/lib/gcc/x86_64-linux-gnu/7/include/immintrin.h:45:0,
                 from /usr/lib/gcc/x86_64-linux-gnu/7/include/x86intrin.h:48,
                 from ../lib/librte_eal/common/include/arch/x86/rte_vect.h:30,
                 from ../lib/librte_eal/common/include/arch/x86/rte_memcpy.h:17,
                 from ../lib/librte_mempool/rte_mempool.h:51,
                 from ../lib/librte_mbuf/rte_mbuf.h:38,
                 from ../lib/librte_net/rte_ip.h:24,
                 from ../lib/librte_net/rte_net.h:12,
                 from ../drivers/net/virtio/virtio_rxtx_packed_avx.c:11:
/usr/lib/gcc/x86_64-linux-gnu/7/include/avx512fintrin.h:5831:1: error: inlining failed in call to always_inline ‘_mm512_storeu_si512’: target specific option mismatch
 _mm512_storeu_si512 (void *__P, __m512i __A)
 ^~~~~~~~~~~~~~~~~~~
../drivers/net/virtio/virtio_rxtx_packed_avx.c:172:2: note: called from here
  _mm512_storeu_si512((void *)&vq->vq_packed.ring.desc[idx], new_descs);
  ^~~~~~~~~~~~~~~~~~~~~~~~~~~~~~~~~~~~~~~~~~~~~~~~~~~~~~~~~~~~~~~~~~~~~
In file included from /usr/lib/gcc/x86_64-linux-gnu/7/include/immintrin.h:59:0,
                 from /usr/lib/gcc/x86_64-linux-gnu/7/include/x86intrin.h:48,
                 from ../lib/librte_eal/common/include/arch/x86/rte_vect.h:30,
                 from ../lib/librte_eal/common/include/arch/x86/rte_memcpy.h:17,
                 from ../lib/librte_mempool/rte_mempool.h:51,
                 from ../lib/librte_mbuf/rte_mbuf.h:38,
                 from ../lib/librte_net/rte_ip.h:24,
                 from ../lib/librte_net/rte_net.h:12,
                 from ../drivers/net/virtio/virtio_rxtx_packed_avx.c:11:
/usr/lib/gcc/x86_64-linux-gnu/7/include/avx512vlbwintrin.h:3642:1: error: inlining failed in call to always_inline ‘_mm256_cmpneq_epu16_mask’: target specific option mismatch
 _mm256_cmpneq_epu16_mask (__m256i __X, __m256i __Y)
 ^~~~~~~~~~~~~~~~~~~~~~~~
../drivers/net/virtio/virtio_rxtx_packed_avx.c:132:11: note: called from here
  uint16_t cmp = _mm256_cmpneq_epu16_mask(mbufs, mbuf_ref);
           ^~~
In file included from /usr/lib/gcc/x86_64-linux-gnu/7/include/immintrin.h:45:0,
                 from /usr/lib/gcc/x86_64-linux-gnu/7/include/x86intrin.h:48,
                 from ../lib/librte_eal/common/include/arch/x86/rte_vect.h:30,
                 from ../lib/librte_eal/common/include/arch/x86/rte_memcpy.h:17,
                 from ../lib/librte_mempool/rte_mempool.h:51,
                 from ../lib/librte_mbuf/rte_mbuf.h:38,
                 from ../lib/librte_net/rte_ip.h:24,
                 from ../lib/librte_net/rte_net.h:12,
                 from ../drivers/net/virtio/virtio_rxtx_packed_avx.c:11:
/usr/lib/gcc/x86_64-linux-gnu/7/include/avx512fintrin.h:79:1: error: inlining failed in call to always_inline ‘_mm512_set_epi64’: target specific option mismatch
 _mm512_set_epi64 (long long __A, long long __B, long long __C,
 ^~~~~~~~~~~~~~~~
../drivers/net/virtio/virtio_rxtx_packed_avx.c:152:10: note: called from here
  __m512i new_descs = _mm512_set_epi64(
          ^~~~~~~~~
In file included from /usr/lib/gcc/x86_64-linux-gnu/7/include/immintrin.h:45:0,
                 from /usr/lib/gcc/x86_64-linux-gnu/7/include/x86intrin.h:48,
                 from ../lib/librte_eal/common/include/arch/x86/rte_vect.h:30,
                 from ../lib/librte_eal/common/include/arch/x86/rte_memcpy.h:17,
                 from ../lib/librte_mempool/rte_mempool.h:51,
                 from ../lib/librte_mbuf/rte_mbuf.h:38,
                 from ../lib/librte_net/rte_ip.h:24,
                 from ../lib/librte_net/rte_net.h:12,
                 from ../drivers/net/virtio/virtio_rxtx_packed_avx.c:11:
/usr/lib/gcc/x86_64-linux-gnu/7/include/avx512fintrin.h:5831:1: error: inlining failed in call to always_inline ‘_mm512_storeu_si512’: target specific option mismatch
 _mm512_storeu_si512 (void *__P, __m512i __A)
 ^~~~~~~~~~~~~~~~~~~
../drivers/net/virtio/virtio_rxtx_packed_avx.c:172:2: note: called from here
  _mm512_storeu_si512((void *)&vq->vq_packed.ring.desc[idx], new_descs);
  ^~~~~~~~~~~~~~~~~~~~~~~~~~~~~~~~~~~~~~~~~~~~~~~~~~~~~~~~~~~~~~~~~~~~~
cc1: all warnings being treated as errors
[1386/2161] Compiling C object 'drivers/a715181@@tmp_rte_pmd_virtio@sta/net_virtio_virtio_rxtx_simple_sse.c.o'.
[1387/2161] Generating rte_pmd_tap.exp_chk with a meson_exe.py custom command.
[1388/2161] Compiling C object 'drivers/a715181@@tmp_rte_pmd_vhost@sta/net_vhost_rte_eth_vhost.c.o'.
[1389/2161] Compiling C object 'drivers/a715181@@tmp_rte_pmd_virtio@sta/net_virtio_virtqueue.c.o'.
[1390/2161] Generating rte_pmd_softnic.exp_chk with a meson_exe.py custom command.
[1391/2161] Compiling C object 'drivers/a715181@@tmp_rte_pmd_virtio@sta/net_virtio_virtio_user_ethdev.c.o'.
[1392/2161] Compiling C object 'drivers/a715181@@tmp_rte_pmd_thunderx@sta/net_thunderx_nicvf_ethdev.c.o'.
[1393/2161] Compiling C object 'drivers/a715181@@tmp_rte_pmd_virtio@sta/net_virtio_virtio_ethdev.c.o'.
[1394/2161] Compiling C object 'drivers/a715181@@tmp_rte_pmd_virtio@sta/net_virtio_virtio_rxtx.c.o'.
ninja: build stopped: subcommand failed




*Meson Build Failed #5:
OS: FreeBSD1201-64
Target:./build-gcc-static
FAILED: drivers/a715181@@tmp_rte_pmd_virtio@sta/net_virtio_virtio_rxtx_packed_avx.c.o 
gcc -Idrivers/a715181@@tmp_rte_pmd_virtio@sta -Idrivers -I../drivers -Idrivers/net/virtio -I../drivers/net/virtio -Ilib/librte_ethdev -I../lib/librte_ethdev -I. -I../ -Iconfig -I../config -Ilib/librte_eal/common/include -I../lib/librte_eal/common/include -I../lib/librte_eal/freebsd/eal/include -Ilib/librte_eal/common -I../lib/librte_eal/common -Ilib/librte_eal/common/include/arch/x86 -I../lib/librte_eal/common/include/arch/x86 -Ilib/librte_eal -I../lib/librte_eal -Ilib/librte_kvargs -I../lib/librte_kvargs -Ilib/librte_net -I../lib/librte_net -Ilib/librte_mbuf -I../lib/librte_mbuf -Ilib/librte_mempool -I../lib/librte_mempool -Ilib/librte_ring -I../lib/librte_ring -Ilib/librte_meter -I../lib/librte_meter -Idrivers/bus/pci -I../drivers/bus/pci -I../drivers/bus/pci/bsd -Ilib/librte_pci -I../lib/librte_pci -Idrivers/bus/vdev -I../drivers/bus/vdev -fdiagnostics-color=always -pipe -D_FILE_OFFSET_BITS=64 -Wall -Winvalid-pch -Werror -O2 -g -include rte_config.h -Wextra -Wcast-qual -Wdeprecated -Wformat-nonliteral -Wformat-security -Wmissing-declarations -Wmissing-prototypes -Wnested-externs -Wold-style-definition -Wpointer-arith -Wsign-compare -Wstrict-prototypes -Wundef -Wwrite-strings -Wno-address-of-packed-member -Wno-packed-not-aligned -Wno-missing-field-initializers -D_GNU_SOURCE -D__BSD_VISIBLE -fPIC -march=native -Wno-format-truncation -DALLOW_EXPERIMENTAL_API -MD -MQ 'drivers/a715181@@tmp_rte_pmd_virtio@sta/net_virtio_virtio_rxtx_packed_avx.c.o' -MF 'drivers/a715181@@tmp_rte_pmd_virtio@sta/net_virtio_virtio_rxtx_packed_avx.c.o.d' -o 'drivers/a715181@@tmp_rte_pmd_virtio@sta/net_virtio_virtio_rxtx_packed_avx.c.o' -c ../drivers/net/virtio/virtio_rxtx_packed_avx.c
../drivers/net/virtio/virtio_rxtx_packed_avx.c: In function 'virtqueue_enqueue_batch_packed_vec':
../drivers/net/virtio/virtio_rxtx_packed_avx.c:152:10: error: AVX512F vector return without AVX512F enabled changes the ABI [-Werror=psabi]
  152 |  __m512i new_descs = _mm512_set_epi64(
      |          ^~~~~~~~~
In file included from /usr/local/lib/gcc9/gcc/x86_64-portbld-freebsd12.0/9.2.0/include/immintrin.h:69,
                 from /usr/local/lib/gcc9/gcc/x86_64-portbld-freebsd12.0/9.2.0/include/x86intrin.h:32,
                 from ../lib/librte_eal/common/include/arch/x86/rte_vect.h:30,
                 from ../lib/librte_eal/common/include/arch/x86/rte_memcpy.h:17,
                 from ../lib/librte_mempool/rte_mempool.h:51,
                 from ../lib/librte_mbuf/rte_mbuf.h:38,
                 from ../lib/librte_net/rte_ip.h:24,
                 from ../lib/librte_net/rte_net.h:12,
                 from ../drivers/net/virtio/virtio_rxtx_packed_avx.c:11:
/usr/local/lib/gcc9/gcc/x86_64-portbld-freebsd12.0/9.2.0/include/avx512vlbwintrin.h:3677:1: error: inlining failed in call to always_inline '_mm256_cmpneq_epu16_mask': target specific option mismatch
 3677 | _mm256_cmpneq_epu16_mask (__m256i __X, __m256i __Y)
      | ^~~~~~~~~~~~~~~~~~~~~~~~
../drivers/net/virtio/virtio_rxtx_packed_avx.c:132:17: note: called from here
  132 |  uint16_t cmp = _mm256_cmpneq_epu16_mask(mbufs, mbuf_ref);
      |                 ^~~~~~~~~~~~~~~~~~~~~~~~~~~~~~~~~~~~~~~~~
In file included from /usr/local/lib/gcc9/gcc/x86_64-portbld-freebsd12.0/9.2.0/include/immintrin.h:69,
                 from /usr/local/lib/gcc9/gcc/x86_64-portbld-freebsd12.0/9.2.0/include/x86intrin.h:32,
                 from ../lib/librte_eal/common/include/arch/x86/rte_vect.h:30,
                 from ../lib/librte_eal/common/include/arch/x86/rte_memcpy.h:17,
                 from ../lib/librte_mempool/rte_mempool.h:51,
                 from ../lib/librte_mbuf/rte_mbuf.h:38,
                 from ../lib/librte_net/rte_ip.h:24,
                 from ../lib/librte_net/rte_net.h:12,
                 from ../drivers/net/virtio/virtio_rxtx_packed_avx.c:11:
/usr/local/lib/gcc9/gcc/x86_64-portbld-freebsd12.0/9.2.0/include/avx512vlbwintrin.h:3677:1: error: inlining failed in call to always_inline '_mm256_cmpneq_epu16_mask': target specific option mismatch
 3677 | _mm256_cmpneq_epu16_mask (__m256i __X, __m256i __Y)
      | ^~~~~~~~~~~~~~~~~~~~~~~~
../drivers/net/virtio/virtio_rxtx_packed_avx.c:132:17: note: called from here
  132 |  uint16_t cmp = _mm256_cmpneq_epu16_mask(mbufs, mbuf_ref);
      |                 ^~~~~~~~~~~~~~~~~~~~~~~~~~~~~~~~~~~~~~~~~
In file included from /usr/local/lib/gcc9/gcc/x86_64-portbld-freebsd12.0/9.2.0/include/immintrin.h:55,
                 from /usr/local/lib/gcc9/gcc/x86_64-portbld-freebsd12.0/9.2.0/include/x86intrin.h:32,
                 from ../lib/librte_eal/common/include/arch/x86/rte_vect.h:30,
                 from ../lib/librte_eal/common/include/arch/x86/rte_memcpy.h:17,
                 from ../lib/librte_mempool/rte_mempool.h:51,
                 from ../lib/librte_mbuf/rte_mbuf.h:38,
                 from ../lib/librte_net/rte_ip.h:24,
                 from ../lib/librte_net/rte_net.h:12,
                 from ../drivers/net/virtio/virtio_rxtx_packed_avx.c:11:
/usr/local/lib/gcc9/gcc/x86_64-portbld-freebsd12.0/9.2.0/include/avx512fintrin.h:79:1: error: inlining failed in call to always_inline '_mm512_set_epi64': target specific option mismatch
   79 | _mm512_set_epi64 (long long __A, long long __B, long long __C,
      | ^~~~~~~~~~~~~~~~
../drivers/net/virtio/virtio_rxtx_packed_avx.c:152:22: note: called from here
  152 |  __m512i new_descs = _mm512_set_epi64(
      |                      ^~~~~~~~~~~~~~~~~
  153 |    descs[3], VIRTIO_MBUF_DATA_DMA_ADDR(tx_pkts[3], vq),
      |    ~~~~~~~~~~~~~~~~~~~~~~~~~~~~~~~~~~~~~~~~~~~~~~~~~~~~
  154 |    descs[2], VIRTIO_MBUF_DATA_DMA_ADDR(tx_pkts[2], vq),
      |    ~~~~~~~~~~~~~~~~~~~~~~~~~~~~~~~~~~~~~~~~~~~~~~~~~~~~
  155 |    descs[1], VIRTIO_MBUF_DATA_DMA_ADDR(tx_pkts[1], vq),
      |    ~~~~~~~~~~~~~~~~~~~~~~~~~~~~~~~~~~~~~~~~~~~~~~~~~~~~
  156 |    descs[0], VIRTIO_MBUF_DATA_DMA_ADDR(tx_pkts[0], vq));
      |    ~~~~~~~~~~~~~~~~~~~~~~~~~~~~~~~~~~~~~~~~~~~~~~~~~~~~
In file included from /usr/local/lib/gcc9/gcc/x86_64-portbld-freebsd12.0/9.2.0/include/immintrin.h:55,
                 from /usr/local/lib/gcc9/gcc/x86_64-portbld-freebsd12.0/9.2.0/include/x86intrin.h:32,
                 from ../lib/librte_eal/common/include/arch/x86/rte_vect.h:30,
                 from ../lib/librte_eal/common/include/arch/x86/rte_memcpy.h:17,
                 from ../lib/librte_mempool/rte_mempool.h:51,
                 from ../lib/librte_mbuf/rte_mbuf.h:38,
                 from ../lib/librte_net/rte_ip.h:24,
                 from ../lib/librte_net/rte_net.h:12,
                 from ../drivers/net/virtio/virtio_rxtx_packed_avx.c:11:
/usr/local/lib/gcc9/gcc/x86_64-portbld-freebsd12.0/9.2.0/include/avx512fintrin.h:6408:1: error: inlining failed in call to always_inline '_mm512_storeu_si512': target specific option mismatch
 6408 | _mm512_storeu_si512 (void *__P, __m512i __A)
      | ^~~~~~~~~~~~~~~~~~~
../drivers/net/virtio/virtio_rxtx_packed_avx.c:172:2: note: called from here
  172 |  _mm512_storeu_si512((void *)&vq->vq_packed.ring.desc[idx], new_descs);
      |  ^~~~~~~~~~~~~~~~~~~~~~~~~~~~~~~~~~~~~~~~~~~~~~~~~~~~~~~~~~~~~~~~~~~~~
In file included from /usr/local/lib/gcc9/gcc/x86_64-portbld-freebsd12.0/9.2.0/include/immintrin.h:69,
                 from /usr/local/lib/gcc9/gcc/x86_64-portbld-freebsd12.0/9.2.0/include/x86intrin.h:32,
                 from ../lib/librte_eal/common/include/arch/x86/rte_vect.h:30,
                 from ../lib/librte_eal/common/include/arch/x86/rte_memcpy.h:17,
                 from ../lib/librte_mempool/rte_mempool.h:51,
                 from ../lib/librte_mbuf/rte_mbuf.h:38,
                 from ../lib/librte_net/rte_ip.h:24,
                 from ../lib/librte_net/rte_net.h:12,
                 from ../drivers/net/virtio/virtio_rxtx_packed_avx.c:11:
/usr/local/lib/gcc9/gcc/x86_64-portbld-freebsd12.0/9.2.0/include/avx512vlbwintrin.h:3677:1: error: inlining failed in call to always_inline '_mm256_cmpneq_epu16_mask': target specific option mismatch
 3677 | _mm256_cmpneq_epu16_mask (__m256i __X, __m256i __Y)
      | ^~~~~~~~~~~~~~~~~~~~~~~~
../drivers/net/virtio/virtio_rxtx_packed_avx.c:132:17: note: called from here
  132 |  uint16_t cmp = _mm256_cmpneq_epu16_mask(mbufs, mbuf_ref);
      |                 ^~~~~~~~~~~~~~~~~~~~~~~~~~~~~~~~~~~~~~~~~
In file included from /usr/local/lib/gcc9/gcc/x86_64-portbld-freebsd12.0/9.2.0/include/immintrin.h:55,
                 from /usr/local/lib/gcc9/gcc/x86_64-portbld-freebsd12.0/9.2.0/include/x86intrin.h:32,
                 from ../lib/librte_eal/common/include/arch/x86/rte_vect.h:30,
                 from ../lib/librte_eal/common/include/arch/x86/rte_memcpy.h:17,
                 from ../lib/librte_mempool/rte_mempool.h:51,
                 from ../lib/librte_mbuf/rte_mbuf.h:38,
                 from ../lib/librte_net/rte_ip.h:24,
                 from ../lib/librte_net/rte_net.h:12,
                 from ../drivers/net/virtio/virtio_rxtx_packed_avx.c:11:
/usr/local/lib/gcc9/gcc/x86_64-portbld-freebsd12.0/9.2.0/include/avx512fintrin.h:79:1: error: inlining failed in call to always_inline '_mm512_set_epi64': target specific option mismatch
   79 | _mm512_set_epi64 (long long __A, long long __B, long long __C,
      | ^~~~~~~~~~~~~~~~
../drivers/net/virtio/virtio_rxtx_packed_avx.c:152:22: note: called from here
  152 |  __m512i new_descs = _mm512_set_epi64(
      |                      ^~~~~~~~~~~~~~~~~
  153 |    descs[3], VIRTIO_MBUF_DATA_DMA_ADDR(tx_pkts[3], vq),
      |    ~~~~~~~~~~~~~~~~~~~~~~~~~~~~~~~~~~~~~~~~~~~~~~~~~~~~
  154 |    descs[2], VIRTIO_MBUF_DATA_DMA_ADDR(tx_pkts[2], vq),
      |    ~~~~~~~~~~~~~~~~~~~~~~~~~~~~~~~~~~~~~~~~~~~~~~~~~~~~
  155 |    descs[1], VIRTIO_MBUF_DATA_DMA_ADDR(tx_pkts[1], vq),
      |    ~~~~~~~~~~~~~~~~~~~~~~~~~~~~~~~~~~~~~~~~~~~~~~~~~~~~
  156 |    descs[0], VIRTIO_MBUF_DATA_DMA_ADDR(tx_pkts[0], vq));
      |    ~~~~~~~~~~~~~~~~~~~~~~~~~~~~~~~~~~~~~~~~~~~~~~~~~~~~
In file included from /usr/local/lib/gcc9/gcc/x86_64-portbld-freebsd12.0/9.2.0/include/immintrin.h:55,
                 from /usr/local/lib/gcc9/gcc/x86_64-portbld-freebsd12.0/9.2.0/include/x86intrin.h:32,
                 from ../lib/librte_eal/common/include/arch/x86/rte_vect.h:30,
                 from ../lib/librte_eal/common/include/arch/x86/rte_memcpy.h:17,
                 from ../lib/librte_mempool/rte_mempool.h:51,
                 from ../lib/librte_mbuf/rte_mbuf.h:38,
                 from ../lib/librte_net/rte_ip.h:24,
                 from ../lib/librte_net/rte_net.h:12,
                 from ../drivers/net/virtio/virtio_rxtx_packed_avx.c:11:
/usr/local/lib/gcc9/gcc/x86_64-portbld-freebsd12.0/9.2.0/include/avx512fintrin.h:6408:1: error: inlining failed in call to always_inline '_mm512_storeu_si512': target specific option mismatch
 6408 | _mm512_storeu_si512 (void *__P, __m512i __A)
      | ^~~~~~~~~~~~~~~~~~~
../drivers/net/virtio/virtio_rxtx_packed_avx.c:172:2: note: called from here
  172 |  _mm512_storeu_si512((void *)&vq->vq_packed.ring.desc[idx], new_descs);
      |  ^~~~~~~~~~~~~~~~~~~~~~~~~~~~~~~~~~~~~~~~~~~~~~~~~~~~~~~~~~~~~~~~~~~~~
cc1: all warnings being treated as errors
[1031/1640] Compiling C object 'drivers/a715181@@tmp_rte_pmd_sfc@sta/net_sfc_sfc_ef10_tx.c.o'.
[1032/1640] Generating rte_rawdev_ioat_def with a custom command.
[1033/1640] Compiling C object 'drivers/a715181@@tmp_rte_pmd_thunderx@sta/net_thunderx_nicvf_ethdev.c.o'.
[1034/1640] Compiling C object 'drivers/a715181@@tmp_rte_rawdev_ioat@sta/raw_ioat_ioat_rawdev.c.o'.
[1035/1640] Compiling C object 'drivers/a715181@@tmp_rte_pmd_virtio@sta/net_virtio_virtio_ethdev.c.o'.
[1036/1640] Compiling C object 'drivers/a715181@@tmp_rte_rawdev_ioat@sta/raw_ioat_ioat_rawdev_test.c.o'.
[1037/1640] Compiling C object 'drivers/a715181@@tmp_rte_pmd_vmxnet3@sta/net_vmxnet3_vmxnet3_ethdev.c.o'.
[1038/1640] Compiling C object 'drivers/a715181@@tmp_rte_pmd_vmxnet3@sta/net_vmxnet3_vmxnet3_rxtx.c.o'.
[1039/1640] Compiling C object 'drivers/a715181@@tmp_rte_pmd_virtio@sta/net_virtio_virtio_rxtx.c.o'.
ninja: build stopped: subcommand failed




*Meson Build Failed #6:
OS: SUSE15-64
Target:./build-gcc-static
FAILED: drivers/a715181@@tmp_rte_pmd_virtio@sta/net_virtio_virtio_rxtx_packed_avx.c.o 
gcc -Idrivers/a715181@@tmp_rte_pmd_virtio@sta -Idrivers -I../drivers -Idrivers/net/virtio -I../drivers/net/virtio -Ilib/librte_ethdev -I../lib/librte_ethdev -I. -I../ -Iconfig -I../config -Ilib/librte_eal/common/include -I../lib/librte_eal/common/include -I../lib/librte_eal/linux/eal/include -Ilib/librte_eal/common -I../lib/librte_eal/common -Ilib/librte_eal/common/include/arch/x86 -I../lib/librte_eal/common/include/arch/x86 -Ilib/librte_eal -I../lib/librte_eal -Ilib/librte_kvargs -I../lib/librte_kvargs -Ilib/librte_net -I../lib/librte_net -Ilib/librte_mbuf -I../lib/librte_mbuf -Ilib/librte_mempool -I../lib/librte_mempool -Ilib/librte_ring -I../lib/librte_ring -Ilib/librte_meter -I../lib/librte_meter -Idrivers/bus/pci -I../drivers/bus/pci -I../drivers/bus/pci/linux -Ilib/librte_pci -I../lib/librte_pci -Idrivers/bus/vdev -I../drivers/bus/vdev -fdiagnostics-color=always -pipe -D_FILE_OFFSET_BITS=64 -Wall -Winvalid-pch -Werror -O2 -g -include rte_config.h -Wextra -Wcast-qual -Wdeprecated -Wformat-nonliteral -Wformat-security -Wmissing-declarations -Wmissing-prototypes -Wnested-externs -Wold-style-definition -Wpointer-arith -Wsign-compare -Wstrict-prototypes -Wundef -Wwrite-strings -Wno-missing-field-initializers -D_GNU_SOURCE -fPIC -march=native -Wno-format-truncation -DALLOW_EXPERIMENTAL_API -MD -MQ 'drivers/a715181@@tmp_rte_pmd_virtio@sta/net_virtio_virtio_rxtx_packed_avx.c.o' -MF 'drivers/a715181@@tmp_rte_pmd_virtio@sta/net_virtio_virtio_rxtx_packed_avx.c.o.d' -o 'drivers/a715181@@tmp_rte_pmd_virtio@sta/net_virtio_virtio_rxtx_packed_avx.c.o' -c ../drivers/net/virtio/virtio_rxtx_packed_avx.c
../drivers/net/virtio/virtio_rxtx_packed_avx.c: In function ‘virtqueue_enqueue_batch_packed_vec’:
../drivers/net/virtio/virtio_rxtx_packed_avx.c:152:10: error: AVX512F vector return without AVX512F enabled changes the ABI [-Werror=psabi]
  __m512i new_descs = _mm512_set_epi64(
          ^~~~~~~~~
In file included from /usr/lib64/gcc/x86_64-suse-linux/7/include/immintrin.h:59:0,
                 from /usr/lib64/gcc/x86_64-suse-linux/7/include/x86intrin.h:48,
                 from ../lib/librte_eal/common/include/arch/x86/rte_vect.h:30,
                 from ../lib/librte_eal/common/include/arch/x86/rte_memcpy.h:17,
                 from ../lib/librte_mempool/rte_mempool.h:51,
                 from ../lib/librte_mbuf/rte_mbuf.h:38,
                 from ../lib/librte_net/rte_ip.h:24,
                 from ../lib/librte_net/rte_net.h:12,
                 from ../drivers/net/virtio/virtio_rxtx_packed_avx.c:11:
/usr/lib64/gcc/x86_64-suse-linux/7/include/avx512vlbwintrin.h:3642:1: error: inlining failed in call to always_inline ‘_mm256_cmpneq_epu16_mask’: target specific option mismatch
 _mm256_cmpneq_epu16_mask (__m256i __X, __m256i __Y)
 ^~~~~~~~~~~~~~~~~~~~~~~~
../drivers/net/virtio/virtio_rxtx_packed_avx.c:132:11: note: called from here
  uint16_t cmp = _mm256_cmpneq_epu16_mask(mbufs, mbuf_ref);
           ^~~
In file included from /usr/lib64/gcc/x86_64-suse-linux/7/include/immintrin.h:59:0,
                 from /usr/lib64/gcc/x86_64-suse-linux/7/include/x86intrin.h:48,
                 from ../lib/librte_eal/common/include/arch/x86/rte_vect.h:30,
                 from ../lib/librte_eal/common/include/arch/x86/rte_memcpy.h:17,
                 from ../lib/librte_mempool/rte_mempool.h:51,
                 from ../lib/librte_mbuf/rte_mbuf.h:38,
                 from ../lib/librte_net/rte_ip.h:24,
                 from ../lib/librte_net/rte_net.h:12,
                 from ../drivers/net/virtio/virtio_rxtx_packed_avx.c:11:
/usr/lib64/gcc/x86_64-suse-linux/7/include/avx512vlbwintrin.h:3642:1: error: inlining failed in call to always_inline ‘_mm256_cmpneq_epu16_mask’: target specific option mismatch
 _mm256_cmpneq_epu16_mask (__m256i __X, __m256i __Y)
 ^~~~~~~~~~~~~~~~~~~~~~~~
../drivers/net/virtio/virtio_rxtx_packed_avx.c:132:11: note: called from here
  uint16_t cmp = _mm256_cmpneq_epu16_mask(mbufs, mbuf_ref);
           ^~~
In file included from /usr/lib64/gcc/x86_64-suse-linux/7/include/immintrin.h:45:0,
                 from /usr/lib64/gcc/x86_64-suse-linux/7/include/x86intrin.h:48,
                 from ../lib/librte_eal/common/include/arch/x86/rte_vect.h:30,
                 from ../lib/librte_eal/common/include/arch/x86/rte_memcpy.h:17,
                 from ../lib/librte_mempool/rte_mempool.h:51,
                 from ../lib/librte_mbuf/rte_mbuf.h:38,
                 from ../lib/librte_net/rte_ip.h:24,
                 from ../lib/librte_net/rte_net.h:12,
                 from ../drivers/net/virtio/virtio_rxtx_packed_avx.c:11:
/usr/lib64/gcc/x86_64-suse-linux/7/include/avx512fintrin.h:79:1: error: inlining failed in call to always_inline ‘_mm512_set_epi64’: target specific option mismatch
 _mm512_set_epi64 (long long __A, long long __B, long long __C,
 ^~~~~~~~~~~~~~~~
../drivers/net/virtio/virtio_rxtx_packed_avx.c:152:10: note: called from here
  __m512i new_descs = _mm512_set_epi64(
          ^~~~~~~~~
In file included from /usr/lib64/gcc/x86_64-suse-linux/7/include/immintrin.h:45:0,
                 from /usr/lib64/gcc/x86_64-suse-linux/7/include/x86intrin.h:48,
                 from ../lib/librte_eal/common/include/arch/x86/rte_vect.h:30,
                 from ../lib/librte_eal/common/include/arch/x86/rte_memcpy.h:17,
                 from ../lib/librte_mempool/rte_mempool.h:51,
                 from ../lib/librte_mbuf/rte_mbuf.h:38,
                 from ../lib/librte_net/rte_ip.h:24,
                 from ../lib/librte_net/rte_net.h:12,
                 from ../drivers/net/virtio/virtio_rxtx_packed_avx.c:11:
/usr/lib64/gcc/x86_64-suse-linux/7/include/avx512fintrin.h:5831:1: error: inlining failed in call to always_inline ‘_mm512_storeu_si512’: target specific option mismatch
 _mm512_storeu_si512 (void *__P, __m512i __A)
 ^~~~~~~~~~~~~~~~~~~
../drivers/net/virtio/virtio_rxtx_packed_avx.c:172:2: note: called from here
  _mm512_storeu_si512((void *)&vq->vq_packed.ring.desc[idx], new_descs);
  ^~~~~~~~~~~~~~~~~~~~~~~~~~~~~~~~~~~~~~~~~~~~~~~~~~~~~~~~~~~~~~~~~~~~~
In file included from /usr/lib64/gcc/x86_64-suse-linux/7/include/immintrin.h:59:0,
                 from /usr/lib64/gcc/x86_64-suse-linux/7/include/x86intrin.h:48,
                 from ../lib/librte_eal/common/include/arch/x86/rte_vect.h:30,
                 from ../lib/librte_eal/common/include/arch/x86/rte_memcpy.h:17,
                 from ../lib/librte_mempool/rte_mempool.h:51,
                 from ../lib/librte_mbuf/rte_mbuf.h:38,
                 from ../lib/librte_net/rte_ip.h:24,
                 from ../lib/librte_net/rte_net.h:12,
                 from ../drivers/net/virtio/virtio_rxtx_packed_avx.c:11:
/usr/lib64/gcc/x86_64-suse-linux/7/include/avx512vlbwintrin.h:3642:1: error: inlining failed in call to always_inline ‘_mm256_cmpneq_epu16_mask’: target specific option mismatch
 _mm256_cmpneq_epu16_mask (__m256i __X, __m256i __Y)
 ^~~~~~~~~~~~~~~~~~~~~~~~
../drivers/net/virtio/virtio_rxtx_packed_avx.c:132:11: note: called from here
  uint16_t cmp = _mm256_cmpneq_epu16_mask(mbufs, mbuf_ref);
           ^~~
In file included from /usr/lib64/gcc/x86_64-suse-linux/7/include/immintrin.h:45:0,
                 from /usr/lib64/gcc/x86_64-suse-linux/7/include/x86intrin.h:48,
                 from ../lib/librte_eal/common/include/arch/x86/rte_vect.h:30,
                 from ../lib/librte_eal/common/include/arch/x86/rte_memcpy.h:17,
                 from ../lib/librte_mempool/rte_mempool.h:51,
                 from ../lib/librte_mbuf/rte_mbuf.h:38,
                 from ../lib/librte_net/rte_ip.h:24,
                 from ../lib/librte_net/rte_net.h:12,
                 from ../drivers/net/virtio/virtio_rxtx_packed_avx.c:11:
/usr/lib64/gcc/x86_64-suse-linux/7/include/avx512fintrin.h:79:1: error: inlining failed in call to always_inline ‘_mm512_set_epi64’: target specific option mismatch
 _mm512_set_epi64 (long long __A, long long __B, long long __C,
 ^~~~~~~~~~~~~~~~
../drivers/net/virtio/virtio_rxtx_packed_avx.c:152:10: note: called from here
  __m512i new_descs = _mm512_set_epi64(
          ^~~~~~~~~
In file included from /usr/lib64/gcc/x86_64-suse-linux/7/include/immintrin.h:45:0,
                 from /usr/lib64/gcc/x86_64-suse-linux/7/include/x86intrin.h:48,
                 from ../lib/librte_eal/common/include/arch/x86/rte_vect.h:30,
                 from ../lib/librte_eal/common/include/arch/x86/rte_memcpy.h:17,
                 from ../lib/librte_mempool/rte_mempool.h:51,
                 from ../lib/librte_mbuf/rte_mbuf.h:38,
                 from ../lib/librte_net/rte_ip.h:24,
                 from ../lib/librte_net/rte_net.h:12,
                 from ../drivers/net/virtio/virtio_rxtx_packed_avx.c:11:
/usr/lib64/gcc/x86_64-suse-linux/7/include/avx512fintrin.h:5831:1: error: inlining failed in call to always_inline ‘_mm512_storeu_si512’: target specific option mismatch
 _mm512_storeu_si512 (void *__P, __m512i __A)
 ^~~~~~~~~~~~~~~~~~~
../drivers/net/virtio/virtio_rxtx_packed_avx.c:172:2: note: called from here
  _mm512_storeu_si512((void *)&vq->vq_packed.ring.desc[idx], new_descs);
  ^~~~~~~~~~~~~~~~~~~~~~~~~~~~~~~~~~~~~~~~~~~~~~~~~~~~~~~~~~~~~~~~~~~~~
cc1: all warnings being treated as errors
[1388/2151] Compiling C object 'drivers/a715181@@tmp_rte_pmd_virtio@sta/net_virtio_virtio_user_vhost_kernel.c.o'.
[1389/2151] Compiling C object 'drivers/a715181@@tmp_rte_pmd_virtio@sta/net_virtio_virtqueue.c.o'.
[1390/2151] Compiling C object 'drivers/a715181@@tmp_rte_pmd_virtio@sta/net_virtio_virtio_user_ethdev.c.o'.
[1391/2151] Compiling C object 'drivers/a715181@@tmp_rte_pmd_virtio@sta/net_virtio_virtio_user_virtio_user_dev.c.o'.
[1392/2151] Compiling C object 'drivers/a715181@@tmp_rte_pmd_virtio@sta/net_virtio_virtio_user_vhost_user.c.o'.
[1393/2151] Compiling C object 'drivers/a715181@@tmp_rte_pmd_thunderx@sta/net_thunderx_nicvf_ethdev.c.o'.
[1394/2151] Compiling C object 'drivers/a715181@@tmp_rte_pmd_virtio@sta/net_virtio_virtio_rxtx.c.o'.
ninja: build stopped: subcommand failed



DPDK STV team

^ permalink raw reply	[flat|nested] only message in thread

only message in thread, other threads:[~2020-03-13 11:11 UTC | newest]

Thread overview: (only message) (download: mbox.gz / follow: Atom feed)
-- links below jump to the message on this page --
2020-03-13 11:11 [dpdk-test-report] |FAILURE| pw66643[v1, 1/7] net/virtio: add Rx free threshold setting sys_stv

automatic DPDK test reports

This inbox may be cloned and mirrored by anyone:

	git clone --mirror http://inbox.dpdk.org/test-report/0 test-report/git/0.git

	# If you have public-inbox 1.1+ installed, you may
	# initialize and index your mirror using the following commands:
	public-inbox-init -V2 test-report test-report/ http://inbox.dpdk.org/test-report \
		test-report@dpdk.org
	public-inbox-index test-report

Example config snippet for mirrors.
Newsgroup available over NNTP:
	nntp://inbox.dpdk.org/inbox.dpdk.test-report


AGPL code for this site: git clone https://public-inbox.org/public-inbox.git