automatic DPDK test reports
 help / color / mirror / Atom feed
* [dpdk-test-report] |FAILURE| pw66651[v3] log: add API to check if a logtype can log in a given level
@ 2020-03-13 15:57 sys_stv
  0 siblings, 0 replies; only message in thread
From: sys_stv @ 2020-03-13 15:57 UTC (permalink / raw)
  To: test-report

[-- Attachment #1: Type: text/plain, Size: 47830 bytes --]

Test-Label: Intel-compilation
Test-Status: FAILURE
http://dpdk.org/patch/66651

_Compilation issues_

Submitter: Ferruh Yigit <ferruh.yigit@intel.com>
Date: 2020-03-13 14:51:59
Reply_mail: 20200313145200.3257043-1-ferruh.yigit@intel.com
DPDK git baseline: Repo:dpdk, CommitID: 341a793eb193a104c571172e724a98b2552c55cf

Makefile build Summary: 23 Builds Done, 0 Successful, 23 Failures

Meson build Summary: 8 Builds Done, 8 Successful, 0 Failures

               +==============================================+===========+==========+
               |                   Makefile                   |   Meson   | Document |
+----------------+------+-------+------+------------+-----------+-----------+----------+
| os             | gcc  | clang | icc  | gcc+shared | gcc+debug | gcc/clang | pdf/html |
+----------------+------+-------+------+------------+-----------+-----------+----------+
| RHEL80-64      | FAIL |       |      |            |           |           |          |
| UB1804-64      | FAIL | FAIL  | FAIL |            |           | pass      | pass     |
| UB1604-32      | FAIL |       |      |            |           | pass      |          |
| CENTOS77-64    | FAIL | FAIL  | FAIL | FAIL       | FAIL      | pass      |          |
| UB1604-64      | FAIL | FAIL  |      |            |           |           |          |
| WIN10-64       |      |       |      |            |           | pass      |          |
| UB1910-64      | FAIL |       |      |            |           |           |          |
| FC31-64        | FAIL | FAIL  |      |            |           | pass      |          |
| CENTOS80-64    | FAIL |       |      |            |           |           |          |
| FreeBSD1201-64 | FAIL | FAIL  |      | FAIL       | FAIL      | pass      |          |
| RHEL77-64      | FAIL |       |      |            |           |           |          |
| SUSE15-64      | FAIL | FAIL  |      |            |           | pass      |          |
+----------------+------+-------+------+------------+-----------+-----------+----------+

Test environment and configuration as below:

** Makefile build **


OS: UB1804-64
	Kernel Version: 4.15.0-20-generic
	CPU info: Intel(R) Xeon(R) CPU E5-2699 v3 @ 2.30GHz
	GCC Version: gcc (Ubuntu 7.3.0-27ubuntu1~18.04) 7.3.0
	Clang Version: 6.0.0-1ubuntu2 (tags/RELEASE_600/final)
	x86_64-native-linuxapp-icc
	x86_64-native-linuxapp-clang
	x86_64-native-linuxapp-gcc


OS: UB1604-32
	Kernel Version: 4.4.0-131-generic
	CPU info: Intel(R) Xeon(R) CPU E5-2699 v3 @ 2.30GHz
	GCC Version: gcc (Ubuntu 5.4.0-6ubuntu1~16.04.11) 5.4.0 20160609
	Clang Version: 3.8.0-2ubuntu4 (tags/RELEASE_380/final)
	i686-native-linuxapp-gcc


OS: CENTOS77-64
	Kernel Version: 3.10.0-1062.9.1.el7.x86_64
	CPU info: Intel(R) Xeon(R) CPU E5-2699 v3 @ 2.30GHz
	GCC Version: gcc (GCC) 4.8.5 20150623 (Red Hat 4.8.5-39)
	Clang Version: 3.4.2 (tags/RELEASE_34/dot2-final)
	x86_64-native-linuxapp-clang
	x86_64-native-linuxapp-gcc+debug
	x86_64-native-linuxapp-gcc+shared
	x86_64-native-linuxapp-gcc
	x86_64-native-linuxapp-icc


OS: UB1910-64
	Kernel Version: 5.3.0-18-generic
	CPU info: Intel(R) Xeon(R) CPU E5-2699 v3 @ 2.30GHz
	GCC Version: gcc (Ubuntu 9.2.1-9ubuntu2) 9.2.1 20191008
	Clang Version: 9.0.0-2 (tags/RELEASE_900/final)
	x86_64-native-linuxapp-gcc


OS: CENTOS80-64
	Kernel Version: 4.18.0-80.11.2.el8_0.x86_64
	CPU info: Intel(R) Xeon(R) CPU E5-2699 v3 @ 2.30GHz
	GCC Version: gcc (GCC) 8.2.1 20180905 (Red Hat 8.2.1-3)
	Clang Version: 7.0.1 (tags/RELEASE_701/final)
	x86_64-native-linuxapp-gcc


OS: UB1604-64
	Kernel Version: 4.4.0-170-generic
	CPU info: Intel(R) Xeon(R) CPU E5-2699 v3 @ 2.30GHz
	GCC Version: gcc (Ubuntu 5.4.0-6ubuntu1~16.04.12) 5.4.0 20160609
	Clang Version: 3.8.0-2ubuntu4 (tags/RELEASE_380/final)
	x86_64-native-linuxapp-clang
	x86_64-native-linuxapp-gcc


OS: FC31-64
	Kernel Version: 5.3.15-300.fc31.x86_64
	CPU info: Intel(R) Xeon(R) CPU E5-2699 v4 @ 2.20GHz
	GCC Version: gcc (GCC) 9.2.1 20190827 (Red Hat 9.2.1-1)
	Clang Version: 9.0.0 (Fedora 9.0.0-1.fc31)
	x86_64-native-linuxapp-gcc
	x86_64-native-linuxapp-clang


OS: RHEL80-64
	Kernel Version: 4.18.0-80.el8.x86_64
	CPU info: Intel(R) Xeon(R) CPU E5-2699 v4 @ 2.20GHz
	GCC Version: gcc (GCC) 8.2.1 20180905 (Red Hat 8.2.1-3)
	Clang Version: 6.0.1 (tags/RELEASE_601/final)
	x86_64-native-linuxapp-gcc


OS: FreeBSD1201-64
	Kernel Version: 12.1-RELEASE
	CPU info: Intel(R) Xeon(R) CPU E5-2699 v4 @ 2.20GHz (2194.96-MHz K8-class CPU)
	GCC Version: gcc (FreeBSD Ports Collection) 9.2.0
	Clang Version: 8.0.1 (tags/RELEASE_801/final 366581) (based on LLVM 8.0.1)
	x86_64-native-bsdapp-clang
	x86_64-native-bsdapp-gcc
	x86_64-native-bsdapp-gcc+shared
	x86_64-native-bsdapp-gcc+debug


OS: RHEL77-64
	Kernel Version: 3.10.0-1062.9.1.el7.x86_64
	CPU info: Intel(R) Xeon(R) CPU E5-2699 v4 @ 2.20GHz
	GCC Version: gcc (GCC) 4.8.5 20150623 (Red Hat 4.8.5-39)
	Clang Version: 3.4.2 (tags/RELEASE_34/dot2-final)
	x86_64-native-linuxapp-gcc


OS: SUSE15-64
	Kernel Version: 4.12.14-lp150.11-default
	CPU info: Intel(R) Xeon(R) CPU E5-2699 v4 @ 2.20GHz
	GCC Version: gcc (SUSE Linux) 7.3.1 20180323 [gcc-7-branch revision 258812]
	Clang Version: 5.0.1 (tags/RELEASE_501/final 312548)
	x86_64-native-linuxapp-gcc
	x86_64-native-linuxapp-clang


** Meson build **


OS: UB1804-64
	Kernel Version: 4.15.0-20-generic
	CPU info: Intel(R) Xeon(R) CPU E5-2699 v4 @ 2.20GHz
	GCC Version: gcc (Ubuntu 7.3.0-27ubuntu1~18.04) 7.3.0
	Clang Version: 6.0.0-1ubuntu2 (tags/RELEASE_600/final)
	x86_64-native-linuxapp-doc
	./build-gcc-static
	./build-gcc-shared
	./build-clang-static
	./build-clang-shared
	./build-x86-default


OS: UB1604-32
	Kernel Version: 4.4.0-131-generic
	CPU info: Intel(R) Xeon(R) CPU E5-2699 v4 @ 2.20GHz
	GCC Version: gcc (Ubuntu 5.4.0-6ubuntu1~16.04.11) 5.4.0 20160609
	Clang Version: 3.8.0-2ubuntu4 (tags/RELEASE_380/final)
	./build-gcc-static
	./build-gcc-shared
	./build-clang-static
	./build-clang-shared
	./build-x86-default


OS: CENTOS77-64
	Kernel Version: 3.10.0-1062.12.1.el7.x86_64
	CPU info: Intel(R) Xeon(R) CPU E5-2699 v4 @ 2.20GHz
	GCC Version: gcc (GCC) 4.8.5 20150623 (Red Hat 4.8.5-39)
	Clang Version: 3.4.2 (tags/RELEASE_34/dot2-final)
	./build-gcc-static
	./build-gcc-shared
	./build-clang-static
	./build-clang-shared
	./build-x86-default


OS: WIN10-64
	Kernel Version: N/A
	CPU info: N/A
	GCC Version: N/A
	Clang Version: Clang 8.0.0
	x86_64-windows-clang


OS: FC31-64
	Kernel Version: 5.4.18-200.fc31.x86_64
	CPU info: Intel(R) Xeon(R) CPU E5-2699 v4 @ 2.20GHz
	GCC Version: gcc (GCC) 9.2.1 20190827 (Red Hat 9.2.1-1)
	Clang Version: 9.0.0 (Fedora 9.0.0-1.fc31)
	./build-gcc-static
	./build-gcc-shared
	./build-clang-static
	./build-clang-shared
	./build-x86-default


OS: FreeBSD1201-64
	Kernel Version: 12.1-RELEASE
	CPU info: Intel(R) Xeon(R) CPU E5-2699 v4 @ 2.20GHz (2194.97-MHz K8-class CPU)
	GCC Version: gcc (FreeBSD Ports Collection) 9.2.0
	Clang Version: 8.0.1 (tags/RELEASE_801/final 366581) (based on LLVM 8.0.1)
	./build-gcc-static
	./build-gcc-shared
	./build-clang-static
	./build-clang-shared
	./build-x86-default


OS: SUSE15-64
	Kernel Version: 4.12.14-lp150.12.82-default
	CPU info: Intel(R) Xeon(R) CPU E5-2699 v4 @ 2.20GHz
	GCC Version: gcc (SUSE Linux) 7.4.1 20190905 [gcc-7-branch revision 275407]
	Clang Version: 5.0.1 (tags/RELEASE_501/final 312548)
	./build-gcc-static
	./build-gcc-shared
	./build-clang-static
	./build-clang-shared
	./build-x86-default


*Make Build Failed #1:
OS: UB1604-64
Target: x86_64-native-linuxapp-clang
/root/UB1604-64_K4.4.0_Clang3.8.0/x86_64-native-linuxapp-clang/a34fcac57f764c46bc256cbf4e616e98/dpdk/drivers/net/ionic/ionic_osdep.h:48:1: warning: typedef requires a name [-Wmissing-declarations]
typedef uint8_t bool;
^~~~~~~~~~~~~~~~~~~~
  CC iavf_rxtx_vec_avx2.o
1 warning and 1 error generated.
/root/UB1604-64_K4.4.0_Clang3.8.0/x86_64-native-linuxapp-clang/a34fcac57f764c46bc256cbf4e616e98/dpdk/mk/internal/rte.compile-pre.mk:114: recipe for target 'ionic_mac_api.o' failed
make[6]: *** [ionic_mac_api.o] Error 1
/root/UB1604-64_K4.4.0_Clang3.8.0/x86_64-native-linuxapp-clang/a34fcac57f764c46bc256cbf4e616e98/dpdk/mk/rte.subdir.mk:35: recipe for target 'ionic' failed
make[5]: *** [ionic] Error 2
make[5]: *** Waiting for unfinished jobs....
  CC i40e_fdir.o
  CC ice_sched.o
  CC ice_switch.o
  CC ice_nvm.o
--
  PMDINFO ice_ethdev.o.pmd.c
  CC ice_ethdev.o.pmd.o
  LD ice_ethdev.o
  AR librte_pmd_ice.a
  INSTALL-LIB librte_pmd_ice.a
/root/UB1604-64_K4.4.0_Clang3.8.0/x86_64-native-linuxapp-clang/a34fcac57f764c46bc256cbf4e616e98/dpdk/mk/rte.subdir.mk:35: recipe for target 'net' failed
make[4]: *** [net] Error 2
/root/UB1604-64_K4.4.0_Clang3.8.0/x86_64-native-linuxapp-clang/a34fcac57f764c46bc256cbf4e616e98/dpdk/mk/rte.sdkbuild.mk:46: recipe for target 'drivers' failed
make[3]: *** [drivers] Error 2
/root/UB1604-64_K4.4.0_Clang3.8.0/x86_64-native-linuxapp-clang/a34fcac57f764c46bc256cbf4e616e98/dpdk/mk/rte.sdkroot.mk:98: recipe for target 'all' failed
make[2]: *** [all] Error 2
/root/UB1604-64_K4.4.0_Clang3.8.0/x86_64-native-linuxapp-clang/a34fcac57f764c46bc256cbf4e616e98/dpdk/mk/rte.sdkinstall.mk:60: recipe for target 'pre_install' failed
make[1]: *** [pre_install] Error 2
/root/UB1604-64_K4.4.0_Clang3.8.0/x86_64-native-linuxapp-clang/a34fcac57f764c46bc256cbf4e616e98/dpdk/mk/rte.sdkroot.mk:77: recipe for target 'install' failed
make: *** [install] Error 2


*Make Build Failed #2:
OS: UB1604-32
Target: i686-native-linuxapp-gcc
                 from /root/UB1604-32_K4.4.0_GCC5.4.0/i686-native-linuxapp-gcc/a34fcac57f764c46bc256cbf4e616e98/dpdk/drivers/net/ionic/ionic_mac_api.c:5:
/root/UB1604-32_K4.4.0_GCC5.4.0/i686-native-linuxapp-gcc/a34fcac57f764c46bc256cbf4e616e98/dpdk/drivers/net/ionic/ionic_osdep.h:48:1: warning: useless type name in empty declaration
 typedef uint8_t bool;
 ^
cc1: warning: unrecognized command line option ‘-Wno-address-of-packed-member’
/root/UB1604-32_K4.4.0_GCC5.4.0/i686-native-linuxapp-gcc/a34fcac57f764c46bc256cbf4e616e98/dpdk/mk/internal/rte.compile-pre.mk:114: recipe for target 'ionic_mac_api.o' failed
make[6]: *** [ionic_mac_api.o] Error 1
/root/UB1604-32_K4.4.0_GCC5.4.0/i686-native-linuxapp-gcc/a34fcac57f764c46bc256cbf4e616e98/dpdk/mk/rte.subdir.mk:35: recipe for target 'ionic' failed
make[5]: *** [ionic] Error 2
make[5]: *** Waiting for unfinished jobs....
  CC ice_common.o
  CC null_crypto_pmd.o
  CC scheduler_pmd_ops.o
  SYMLINK-FILE include/rte_pmd_ixgbe.h
--
  PMDINFO ixgbe_ethdev.o.pmd.c
  CC ixgbe_ethdev.o.pmd.o
  LD ixgbe_ethdev.o
  AR librte_pmd_ixgbe.a
  INSTALL-LIB librte_pmd_ixgbe.a
/root/UB1604-32_K4.4.0_GCC5.4.0/i686-native-linuxapp-gcc/a34fcac57f764c46bc256cbf4e616e98/dpdk/mk/rte.subdir.mk:35: recipe for target 'net' failed
make[4]: *** [net] Error 2
/root/UB1604-32_K4.4.0_GCC5.4.0/i686-native-linuxapp-gcc/a34fcac57f764c46bc256cbf4e616e98/dpdk/mk/rte.sdkbuild.mk:46: recipe for target 'drivers' failed
make[3]: *** [drivers] Error 2
/root/UB1604-32_K4.4.0_GCC5.4.0/i686-native-linuxapp-gcc/a34fcac57f764c46bc256cbf4e616e98/dpdk/mk/rte.sdkroot.mk:98: recipe for target 'all' failed
make[2]: *** [all] Error 2
/root/UB1604-32_K4.4.0_GCC5.4.0/i686-native-linuxapp-gcc/a34fcac57f764c46bc256cbf4e616e98/dpdk/mk/rte.sdkinstall.mk:60: recipe for target 'pre_install' failed
make[1]: *** [pre_install] Error 2
/root/UB1604-32_K4.4.0_GCC5.4.0/i686-native-linuxapp-gcc/a34fcac57f764c46bc256cbf4e616e98/dpdk/mk/rte.sdkroot.mk:77: recipe for target 'install' failed
make: *** [install] Error 2


*Make Build Failed #3:
OS: UB1910-64
Target: x86_64-native-linuxapp-gcc
                 from /root/UB1910-64_K5.3.0_GCC9.2.1/x86_64-native-linuxapp-gcc/a34fcac57f764c46bc256cbf4e616e98/dpdk/drivers/net/ionic/ionic_mac_api.h:8,
                 from /root/UB1910-64_K5.3.0_GCC9.2.1/x86_64-native-linuxapp-gcc/a34fcac57f764c46bc256cbf4e616e98/dpdk/drivers/net/ionic/ionic_mac_api.c:5:
/root/UB1910-64_K5.3.0_GCC9.2.1/x86_64-native-linuxapp-gcc/a34fcac57f764c46bc256cbf4e616e98/dpdk/drivers/net/ionic/ionic_osdep.h:48:1: warning: useless type name in empty declaration
   48 | typedef uint8_t bool;
      | ^~~~~~~
make[6]: *** [/root/UB1910-64_K5.3.0_GCC9.2.1/x86_64-native-linuxapp-gcc/a34fcac57f764c46bc256cbf4e616e98/dpdk/mk/internal/rte.compile-pre.mk:116: ionic_mac_api.o] Error 1
make[5]: *** [/root/UB1910-64_K5.3.0_GCC9.2.1/x86_64-native-linuxapp-gcc/a34fcac57f764c46bc256cbf4e616e98/dpdk/mk/rte.subdir.mk:37: ionic] Error 2
make[5]: *** Waiting for unfinished jobs....
  CC hns3_dcb.o
  CC ice_switch.o
  AR librte_pmd_enic.a
  INSTALL-LIB librte_pmd_enic.a
--
  PMDINFO i40e_ethdev.o.pmd.c
  CC i40e_ethdev.o.pmd.o
  LD i40e_ethdev.o
  AR librte_pmd_i40e.a
  INSTALL-LIB librte_pmd_i40e.a
make[4]: *** [/root/UB1910-64_K5.3.0_GCC9.2.1/x86_64-native-linuxapp-gcc/a34fcac57f764c46bc256cbf4e616e98/dpdk/mk/rte.subdir.mk:35: net] Error 2
make[3]: *** [/root/UB1910-64_K5.3.0_GCC9.2.1/x86_64-native-linuxapp-gcc/a34fcac57f764c46bc256cbf4e616e98/dpdk/mk/rte.sdkbuild.mk:46: drivers] Error 2
make[2]: *** [/root/UB1910-64_K5.3.0_GCC9.2.1/x86_64-native-linuxapp-gcc/a34fcac57f764c46bc256cbf4e616e98/dpdk/mk/rte.sdkroot.mk:99: all] Error 2
make[1]: *** [/root/UB1910-64_K5.3.0_GCC9.2.1/x86_64-native-linuxapp-gcc/a34fcac57f764c46bc256cbf4e616e98/dpdk/mk/rte.sdkinstall.mk:61: pre_install] Error 2
make: *** [/root/UB1910-64_K5.3.0_GCC9.2.1/x86_64-native-linuxapp-gcc/a34fcac57f764c46bc256cbf4e616e98/dpdk/mk/rte.sdkroot.mk:77: install] Error 2


*Make Build Failed #4:
OS: UB1804-64
Target: x86_64-native-linuxapp-icc
/root/UB1804-64_K4.15.0_ICC19.0.0/x86_64-native-linuxapp-icc/a34fcac57f764c46bc256cbf4e616e98/dpdk/drivers/net/ionic/ionic_osdep.h(48): error: invalid combination of type specifiers
  typedef uint8_t bool;
                  ^

compilation aborted for /root/UB1804-64_K4.15.0_ICC19.0.0/x86_64-native-linuxapp-icc/a34fcac57f764c46bc256cbf4e616e98/dpdk/drivers/net/ionic/ionic_mac_api.c (code 2)
/root/UB1804-64_K4.15.0_ICC19.0.0/x86_64-native-linuxapp-icc/a34fcac57f764c46bc256cbf4e616e98/dpdk/mk/internal/rte.compile-pre.mk:114: recipe for target 'ionic_mac_api.o' failed
make[6]: *** [ionic_mac_api.o] Error 2
/root/UB1804-64_K4.15.0_ICC19.0.0/x86_64-native-linuxapp-icc/a34fcac57f764c46bc256cbf4e616e98/dpdk/mk/rte.subdir.mk:35: recipe for target 'ionic' failed
make[5]: *** [ionic] Error 2
make[5]: *** Waiting for unfinished jobs....
  CC enic_rxtx_vec_avx2.o
  LD iavf_ethdev.o
  CC e1000_mbx.o
  CC iavf_vchnl.o
--
  PMDINFO ice_ethdev.o.pmd.c
  CC ice_ethdev.o.pmd.o
  LD ice_ethdev.o
  AR librte_pmd_ice.a
  INSTALL-LIB librte_pmd_ice.a
/root/UB1804-64_K4.15.0_ICC19.0.0/x86_64-native-linuxapp-icc/a34fcac57f764c46bc256cbf4e616e98/dpdk/mk/rte.subdir.mk:35: recipe for target 'net' failed
make[4]: *** [net] Error 2
/root/UB1804-64_K4.15.0_ICC19.0.0/x86_64-native-linuxapp-icc/a34fcac57f764c46bc256cbf4e616e98/dpdk/mk/rte.sdkbuild.mk:46: recipe for target 'drivers' failed
make[3]: *** [drivers] Error 2
/root/UB1804-64_K4.15.0_ICC19.0.0/x86_64-native-linuxapp-icc/a34fcac57f764c46bc256cbf4e616e98/dpdk/mk/rte.sdkroot.mk:98: recipe for target 'all' failed
make[2]: *** [all] Error 2
/root/UB1804-64_K4.15.0_ICC19.0.0/x86_64-native-linuxapp-icc/a34fcac57f764c46bc256cbf4e616e98/dpdk/mk/rte.sdkinstall.mk:60: recipe for target 'pre_install' failed
make[1]: *** [pre_install] Error 2
/root/UB1804-64_K4.15.0_ICC19.0.0/x86_64-native-linuxapp-icc/a34fcac57f764c46bc256cbf4e616e98/dpdk/mk/rte.sdkroot.mk:77: recipe for target 'install' failed
make: *** [install] Error 2


*Make Build Failed #5:
OS: UB1804-64
Target: x86_64-native-linuxapp-clang
In file included from /root/UB1804-64_K4.15.0_Clang6.0.0/x86_64-native-linuxapp-clang/a34fcac57f764c46bc256cbf4e616e98/dpdk/drivers/net/ionic/ionic_dev.h:8:
/root/UB1804-64_K4.15.0_Clang6.0.0/x86_64-native-linuxapp-clang/a34fcac57f764c46bc256cbf4e616e98/dpdk/drivers/net/ionic/ionic_osdep.h:48:1: warning: typedef requires a name [-Wmissing-declarations]
typedef uint8_t bool;
^~~~~~~~~~~~~~~~~~~~
1 warning and 1 error generated.
/root/UB1804-64_K4.15.0_Clang6.0.0/x86_64-native-linuxapp-clang/a34fcac57f764c46bc256cbf4e616e98/dpdk/mk/internal/rte.compile-pre.mk:114: recipe for target 'ionic_mac_api.o' failed
make[6]: *** [ionic_mac_api.o] Error 1
/root/UB1804-64_K4.15.0_Clang6.0.0/x86_64-native-linuxapp-clang/a34fcac57f764c46bc256cbf4e616e98/dpdk/mk/rte.subdir.mk:35: recipe for target 'ionic' failed
make[5]: *** [ionic] Error 2
make[5]: *** Waiting for unfinished jobs....
  CC hns3_fdir.o
  CC hinic_pmd_wq.o
  CC hinic_pmd_mbox.o
  CC i40e_ethdev.o
--
  PMDINFO ice_ethdev.o.pmd.c
  CC ice_ethdev.o.pmd.o
  LD ice_ethdev.o
  AR librte_pmd_ice.a
  INSTALL-LIB librte_pmd_ice.a
/root/UB1804-64_K4.15.0_Clang6.0.0/x86_64-native-linuxapp-clang/a34fcac57f764c46bc256cbf4e616e98/dpdk/mk/rte.subdir.mk:35: recipe for target 'net' failed
make[4]: *** [net] Error 2
/root/UB1804-64_K4.15.0_Clang6.0.0/x86_64-native-linuxapp-clang/a34fcac57f764c46bc256cbf4e616e98/dpdk/mk/rte.sdkbuild.mk:46: recipe for target 'drivers' failed
make[3]: *** [drivers] Error 2
/root/UB1804-64_K4.15.0_Clang6.0.0/x86_64-native-linuxapp-clang/a34fcac57f764c46bc256cbf4e616e98/dpdk/mk/rte.sdkroot.mk:98: recipe for target 'all' failed
make[2]: *** [all] Error 2
/root/UB1804-64_K4.15.0_Clang6.0.0/x86_64-native-linuxapp-clang/a34fcac57f764c46bc256cbf4e616e98/dpdk/mk/rte.sdkinstall.mk:60: recipe for target 'pre_install' failed
make[1]: *** [pre_install] Error 2
/root/UB1804-64_K4.15.0_Clang6.0.0/x86_64-native-linuxapp-clang/a34fcac57f764c46bc256cbf4e616e98/dpdk/mk/rte.sdkroot.mk:77: recipe for target 'install' failed
make: *** [install] Error 2


*Make Build Failed #6:
OS: CENTOS77-64
Target: x86_64-native-linuxapp-clang
typedef uint8_t bool;
^~~~~~~~~~~~~~~~~~~~
  CC lio_ethdev.o
  SYMLINK-FILE include/rte_pmd_ixgbe.h
1 warning and 1 error generated.
make[6]: *** [ionic_mac_api.o] Error 1
make[5]: *** [ionic] Error 2
make[5]: *** Waiting for unfinished jobs....
  CC ice_nvm.o
  CC ixgbe_common.o
  CC rte_eth_memif.o
  CC hn_ethdev.o
--
  LD ixgbe_ethdev.o
  AR librte_pmd_ice.a
  INSTALL-LIB librte_pmd_ice.a
  AR librte_pmd_ixgbe.a
  INSTALL-LIB librte_pmd_ixgbe.a
make[4]: *** [net] Error 2
make[3]: *** [drivers] Error 2
make[2]: *** [all] Error 2
make[1]: *** [pre_install] Error 2
make: *** [install] Error 2


*Make Build Failed #7:
OS: CENTOS77-64
Target: x86_64-native-linuxapp-gcc+debug
                 from /root/CENTOS77-64_K3.10.0_GCC4.8.5/x86_64-native-linuxapp-gcc+debug/a34fcac57f764c46bc256cbf4e616e98/dpdk/drivers/net/ionic/ionic_mac_api.c:5:
/root/CENTOS77-64_K3.10.0_GCC4.8.5/x86_64-native-linuxapp-gcc+debug/a34fcac57f764c46bc256cbf4e616e98/dpdk/drivers/net/ionic/ionic_osdep.h:48:1: warning: useless type name in empty declaration [enabled by default]
 typedef uint8_t bool;
 ^
cc1: warning: unrecognized command line option "-Wno-address-of-packed-member" [enabled by default]
make[6]: *** [ionic_mac_api.o] Error 1
make[5]: *** [ionic] Error 2
make[5]: *** Waiting for unfinished jobs....
  CC hns3_stats.o
  CC i40e_nvm.o
  CC hns3_regs.o
  CC ice_nvm.o
--
  PMDINFO ixgbe_ethdev.o.pmd.c
  CC ixgbe_ethdev.o.pmd.o
  LD ixgbe_ethdev.o
  AR librte_pmd_ixgbe.a
  INSTALL-LIB librte_pmd_ixgbe.a
make[4]: *** [net] Error 2
make[3]: *** [drivers] Error 2
make[2]: *** [all] Error 2
make[1]: *** [pre_install] Error 2
make: *** [install] Error 2


*Make Build Failed #8:
OS: CENTOS77-64
Target: x86_64-native-linuxapp-gcc+shared
                 from /root/CENTOS77-64_K3.10.0_GCC4.8.5/x86_64-native-linuxapp-gcc+shared/a34fcac57f764c46bc256cbf4e616e98/dpdk/drivers/net/ionic/ionic_mac_api.c:5:
/root/CENTOS77-64_K3.10.0_GCC4.8.5/x86_64-native-linuxapp-gcc+shared/a34fcac57f764c46bc256cbf4e616e98/dpdk/drivers/net/ionic/ionic_osdep.h:48:1: warning: useless type name in empty declaration [enabled by default]
 typedef uint8_t bool;
 ^
cc1: warning: unrecognized command line option "-Wno-address-of-packed-member" [enabled by default]
make[6]: *** [ionic_mac_api.o] Error 1
make[5]: *** [ionic] Error 2
make[5]: *** Waiting for unfinished jobs....
  CC e1000_phy.o
  CC e1000_vf.o
  CC lio_ethdev.o
  LD librte_pmd_enic.so.20.0.2
--
  PMDINFO ixgbe_ethdev.o.pmd.c
  CC ixgbe_ethdev.o.pmd.o
  LD ixgbe_ethdev.o
  LD librte_pmd_ixgbe.so.20.0.2
  INSTALL-LIB librte_pmd_ixgbe.so.20.0.2
make[4]: *** [net] Error 2
make[3]: *** [drivers] Error 2
make[2]: *** [all] Error 2
make[1]: *** [pre_install] Error 2
make: *** [install] Error 2


*Make Build Failed #9:
OS: CENTOS77-64
Target: x86_64-native-linuxapp-gcc
                 from /root/CENTOS77-64_K3.10.0_GCC4.8.5/x86_64-native-linuxapp-gcc/a34fcac57f764c46bc256cbf4e616e98/dpdk/drivers/net/ionic/ionic_mac_api.c:5:
/root/CENTOS77-64_K3.10.0_GCC4.8.5/x86_64-native-linuxapp-gcc/a34fcac57f764c46bc256cbf4e616e98/dpdk/drivers/net/ionic/ionic_osdep.h:48:1: warning: useless type name in empty declaration [enabled by default]
 typedef uint8_t bool;
 ^
cc1: warning: unrecognized command line option "-Wno-address-of-packed-member" [enabled by default]
make[6]: *** [ionic_mac_api.o] Error 1
make[5]: *** [ionic] Error 2
make[5]: *** Waiting for unfinished jobs....
  CC hns3_regs.o
  CC hns3_dcb.o
  CC hns3_mp.o
  CC ice_common.o
--
  PMDINFO ixgbe_ethdev.o.pmd.c
  CC ixgbe_ethdev.o.pmd.o
  LD ixgbe_ethdev.o
  AR librte_pmd_ixgbe.a
  INSTALL-LIB librte_pmd_ixgbe.a
make[4]: *** [net] Error 2
make[3]: *** [drivers] Error 2
make[2]: *** [all] Error 2
make[1]: *** [pre_install] Error 2
make: *** [install] Error 2


*Make Build Failed #10:
OS: CENTOS80-64
Target: x86_64-native-linuxapp-gcc
                 from /root/CENTOS80-64_K4.18.0_GCC8.2.1/x86_64-native-linuxapp-gcc/a34fcac57f764c46bc256cbf4e616e98/dpdk/drivers/net/ionic/ionic_mac_api.c:5:
/root/CENTOS80-64_K4.18.0_GCC8.2.1/x86_64-native-linuxapp-gcc/a34fcac57f764c46bc256cbf4e616e98/dpdk/drivers/net/ionic/ionic_osdep.h:48:1: warning: useless type name in empty declaration
 typedef uint8_t bool;
 ^~~~~~~
cc1: warning: unrecognized command line option ‘-Wno-address-of-packed-member’
make[6]: *** [/root/CENTOS80-64_K4.18.0_GCC8.2.1/x86_64-native-linuxapp-gcc/a34fcac57f764c46bc256cbf4e616e98/dpdk/mk/internal/rte.compile-pre.mk:116: ionic_mac_api.o] Error 1
make[5]: *** [/root/CENTOS80-64_K4.18.0_GCC8.2.1/x86_64-native-linuxapp-gcc/a34fcac57f764c46bc256cbf4e616e98/dpdk/mk/rte.subdir.mk:35: ionic] Error 2
make[5]: *** Waiting for unfinished jobs....
  CC fm10k_rxtx_vec.o
  CC igb_ethdev.o
  CC igb_rxtx.o
  CC hns3_flow.o
--
  PMDINFO ice_ethdev.o.pmd.c
  CC ice_ethdev.o.pmd.o
  LD ice_ethdev.o
  AR librte_pmd_ice.a
  INSTALL-LIB librte_pmd_ice.a
make[4]: *** [/root/CENTOS80-64_K4.18.0_GCC8.2.1/x86_64-native-linuxapp-gcc/a34fcac57f764c46bc256cbf4e616e98/dpdk/mk/rte.subdir.mk:35: net] Error 2
make[3]: *** [/root/CENTOS80-64_K4.18.0_GCC8.2.1/x86_64-native-linuxapp-gcc/a34fcac57f764c46bc256cbf4e616e98/dpdk/mk/rte.sdkbuild.mk:46: drivers] Error 2
make[2]: *** [/root/CENTOS80-64_K4.18.0_GCC8.2.1/x86_64-native-linuxapp-gcc/a34fcac57f764c46bc256cbf4e616e98/dpdk/mk/rte.sdkroot.mk:99: all] Error 2
make[1]: *** [/root/CENTOS80-64_K4.18.0_GCC8.2.1/x86_64-native-linuxapp-gcc/a34fcac57f764c46bc256cbf4e616e98/dpdk/mk/rte.sdkinstall.mk:61: pre_install] Error 2
make: *** [/root/CENTOS80-64_K4.18.0_GCC8.2.1/x86_64-native-linuxapp-gcc/a34fcac57f764c46bc256cbf4e616e98/dpdk/mk/rte.sdkroot.mk:77: install] Error 2


*Make Build Failed #11:
OS: CENTOS77-64
Target: x86_64-native-linuxapp-icc
  typedef uint8_t bool;
                  ^

  CC igb_pf.o
compilation aborted for /root/CENTOS77-64_K3.10.0_ICC19.0.0/x86_64-native-linuxapp-icc/a34fcac57f764c46bc256cbf4e616e98/dpdk/drivers/net/ionic/ionic_mac_api.c (code 2)
make[6]: *** [ionic_mac_api.o] Error 2
make[5]: *** [ionic] Error 2
make[5]: *** Waiting for unfinished jobs....
  CC i40e_rxtx_vec_sse.o
  PMDINFO i40e_ethdev.o.pmd.c
  CC i40e_ethdev.o.pmd.o
  CC ice_sched.o
--
  LD ixgbe_ethdev.o
  AR librte_pmd_ixgbe.a
  INSTALL-LIB librte_pmd_ixgbe.a
  AR librte_pmd_ice.a
  INSTALL-LIB librte_pmd_ice.a
make[4]: *** [net] Error 2
make[3]: *** [drivers] Error 2
make[2]: *** [all] Error 2
make[1]: *** [pre_install] Error 2
make: *** [install] Error 2


*Make Build Failed #12:
OS: SUSE15-64
Target: x86_64-native-linuxapp-gcc
                 from /root/SUSE15-64_K4.12.14_GCC7.3.1/x86_64-native-linuxapp-gcc/a34fcac57f764c46bc256cbf4e616e98/dpdk/drivers/net/ionic/ionic_mac_api.c:5:
/root/SUSE15-64_K4.12.14_GCC7.3.1/x86_64-native-linuxapp-gcc/a34fcac57f764c46bc256cbf4e616e98/dpdk/drivers/net/ionic/ionic_osdep.h:48:1: warning: useless type name in empty declaration
 typedef uint8_t bool;
 ^~~~~~~
cc1: warning: unrecognized command line option ‘-Wno-address-of-packed-member’
make[6]: *** [/root/SUSE15-64_K4.12.14_GCC7.3.1/x86_64-native-linuxapp-gcc/a34fcac57f764c46bc256cbf4e616e98/dpdk/mk/internal/rte.compile-pre.mk:116: ionic_mac_api.o] Error 1
  PMDINFO i40e_ethdev_vf.o.pmd.c
  CC i40e_ethdev_vf.o.pmd.o
  LD i40e_ethdev_vf.o
  SYMLINK-FILE include/rte_pmd_ixgbe.h
make[5]: *** [/root/SUSE15-64_K4.12.14_GCC7.3.1/x86_64-native-linuxapp-gcc/a34fcac57f764c46bc256cbf4e616e98/dpdk/mk/rte.subdir.mk:35: ionic] Error 2
make[5]: *** Waiting for unfinished jobs....
== Build drivers/net/netvsc
  CC ice_switch.o
  CC rte_eth_memif.o
  CC memif_socket.o
--
  PMDINFO ixgbe_ethdev.o.pmd.c
  CC ixgbe_ethdev.o.pmd.o
  LD ixgbe_ethdev.o
  AR librte_pmd_ixgbe.a
  INSTALL-LIB librte_pmd_ixgbe.a
make[4]: *** [/root/SUSE15-64_K4.12.14_GCC7.3.1/x86_64-native-linuxapp-gcc/a34fcac57f764c46bc256cbf4e616e98/dpdk/mk/rte.subdir.mk:35: net] Error 2
make[3]: *** [/root/SUSE15-64_K4.12.14_GCC7.3.1/x86_64-native-linuxapp-gcc/a34fcac57f764c46bc256cbf4e616e98/dpdk/mk/rte.sdkbuild.mk:46: drivers] Error 2
make[2]: *** [/root/SUSE15-64_K4.12.14_GCC7.3.1/x86_64-native-linuxapp-gcc/a34fcac57f764c46bc256cbf4e616e98/dpdk/mk/rte.sdkroot.mk:99: all] Error 2
make[1]: *** [/root/SUSE15-64_K4.12.14_GCC7.3.1/x86_64-native-linuxapp-gcc/a34fcac57f764c46bc256cbf4e616e98/dpdk/mk/rte.sdkinstall.mk:61: pre_install] Error 2
make: *** [/root/SUSE15-64_K4.12.14_GCC7.3.1/x86_64-native-linuxapp-gcc/a34fcac57f764c46bc256cbf4e616e98/dpdk/mk/rte.sdkroot.mk:77: install] Error 2


*Make Build Failed #13:
OS: FC31-64
Target: x86_64-native-linuxapp-gcc
                 from /root/FC31-64_K5.3.14_GCC9.2.1/x86_64-native-linuxapp-gcc/a34fcac57f764c46bc256cbf4e616e98/dpdk/drivers/net/ionic/ionic_mac_api.h:8,
                 from /root/FC31-64_K5.3.14_GCC9.2.1/x86_64-native-linuxapp-gcc/a34fcac57f764c46bc256cbf4e616e98/dpdk/drivers/net/ionic/ionic_mac_api.c:5:
/root/FC31-64_K5.3.14_GCC9.2.1/x86_64-native-linuxapp-gcc/a34fcac57f764c46bc256cbf4e616e98/dpdk/drivers/net/ionic/ionic_osdep.h:48:1: warning: useless type name in empty declaration
   48 | typedef uint8_t bool;
      | ^~~~~~~
make[6]: *** [/root/FC31-64_K5.3.14_GCC9.2.1/x86_64-native-linuxapp-gcc/a34fcac57f764c46bc256cbf4e616e98/dpdk/mk/internal/rte.compile-pre.mk:114: ionic_mac_api.o] Error 1
make[5]: *** [/root/FC31-64_K5.3.14_GCC9.2.1/x86_64-native-linuxapp-gcc/a34fcac57f764c46bc256cbf4e616e98/dpdk/mk/rte.subdir.mk:37: ionic] Error 2
make[5]: *** Waiting for unfinished jobs....
  CC hinic_pmd_eqs.o
  CC enic_fm_flow.o
  PMDINFO em_ethdev.o.pmd.c
  CC em_ethdev.o.pmd.o
--
  INSTALL-LIB librte_pmd_hns3.a
  AR librte_pmd_ice.a
  INSTALL-LIB librte_pmd_ice.a
  AR librte_pmd_i40e.a
  INSTALL-LIB librte_pmd_i40e.a
make[4]: *** [/root/FC31-64_K5.3.14_GCC9.2.1/x86_64-native-linuxapp-gcc/a34fcac57f764c46bc256cbf4e616e98/dpdk/mk/rte.subdir.mk:35: net] Error 2
make[3]: *** [/root/FC31-64_K5.3.14_GCC9.2.1/x86_64-native-linuxapp-gcc/a34fcac57f764c46bc256cbf4e616e98/dpdk/mk/rte.sdkbuild.mk:46: drivers] Error 2
make[2]: *** [/root/FC31-64_K5.3.14_GCC9.2.1/x86_64-native-linuxapp-gcc/a34fcac57f764c46bc256cbf4e616e98/dpdk/mk/rte.sdkroot.mk:99: all] Error 2
make[1]: *** [/root/FC31-64_K5.3.14_GCC9.2.1/x86_64-native-linuxapp-gcc/a34fcac57f764c46bc256cbf4e616e98/dpdk/mk/rte.sdkinstall.mk:61: pre_install] Error 2
make: *** [/root/FC31-64_K5.3.14_GCC9.2.1/x86_64-native-linuxapp-gcc/a34fcac57f764c46bc256cbf4e616e98/dpdk/mk/rte.sdkroot.mk:77: install] Error 2


*Make Build Failed #14:
OS: RHEL77-64
Target: x86_64-native-linuxapp-gcc
/root/RHEL77-64_K3.10.0_GCC4.8.5/x86_64-native-linuxapp-gcc/a34fcac57f764c46bc256cbf4e616e98/dpdk/drivers/net/ionic/ionic_osdep.h:48:1: warning: useless type name in empty declaration [enabled by default]
 typedef uint8_t bool;
 ^
cc1: warning: unrecognized command line option "-Wno-address-of-packed-member" [enabled by default]
== Build drivers/net/liquidio
make[6]: *** [ionic_mac_api.o] Error 1
make[5]: *** [ionic] Error 2
make[5]: *** Waiting for unfinished jobs....
  CC ice_common.o
  CC igb_rxtx.o
  SYMLINK-FILE include/rte_pmd_ixgbe.h
  CC ixgbe_common.o
--
  AR librte_pmd_i40e.a
  INSTALL-LIB librte_pmd_i40e.a
  AR librte_pmd_ice.a
  INSTALL-LIB librte_pmd_ice.a
  PMDINFO caam_jr.o.pmd.c
make[4]: *** [net] Error 2
make[4]: *** Waiting for unfinished jobs....
  CC caam_jr.o.pmd.o
  LD caam_jr.o
  AR librte_pmd_dpaa_sec.a
  INSTALL-LIB librte_pmd_dpaa_sec.a
--
  LD nitrox_device.o
  AR librte_pmd_virtio_crypto.a
  INSTALL-LIB librte_pmd_virtio_crypto.a
  AR librte_pmd_nitrox.a
  INSTALL-LIB librte_pmd_nitrox.a
make[3]: *** [drivers] Error 2
make[2]: *** [all] Error 2
make[1]: *** [pre_install] Error 2
make: *** [install] Error 2


*Make Build Failed #15:
OS: RHEL80-64
Target: x86_64-native-linuxapp-gcc
                 from /root/RHEL80-64_K3.10.0_GCC8.2.1/x86_64-native-linuxapp-gcc/a34fcac57f764c46bc256cbf4e616e98/dpdk/drivers/net/ionic/ionic_mac_api.c:5:
/root/RHEL80-64_K3.10.0_GCC8.2.1/x86_64-native-linuxapp-gcc/a34fcac57f764c46bc256cbf4e616e98/dpdk/drivers/net/ionic/ionic_osdep.h:48:1: warning: useless type name in empty declaration
 typedef uint8_t bool;
 ^~~~~~~
cc1: warning: unrecognized command line option ‘-Wno-address-of-packed-member’
make[6]: *** [/root/RHEL80-64_K3.10.0_GCC8.2.1/x86_64-native-linuxapp-gcc/a34fcac57f764c46bc256cbf4e616e98/dpdk/mk/internal/rte.compile-pre.mk:114: ionic_mac_api.o] Error 1
make[5]: *** [/root/RHEL80-64_K3.10.0_GCC8.2.1/x86_64-native-linuxapp-gcc/a34fcac57f764c46bc256cbf4e616e98/dpdk/mk/rte.subdir.mk:37: ionic] Error 2
make[5]: *** Waiting for unfinished jobs....
  PMDINFO hinic_pmd_ethdev.o.pmd.c
  CC hinic_pmd_ethdev.o.pmd.o
  CC em_ethdev.o
  LD hinic_pmd_ethdev.o
--
  PMDINFO i40e_ethdev.o.pmd.c
  CC i40e_ethdev.o.pmd.o
  LD i40e_ethdev.o
  AR librte_pmd_i40e.a
  INSTALL-LIB librte_pmd_i40e.a
make[4]: *** [/root/RHEL80-64_K3.10.0_GCC8.2.1/x86_64-native-linuxapp-gcc/a34fcac57f764c46bc256cbf4e616e98/dpdk/mk/rte.subdir.mk:35: net] Error 2
make[3]: *** [/root/RHEL80-64_K3.10.0_GCC8.2.1/x86_64-native-linuxapp-gcc/a34fcac57f764c46bc256cbf4e616e98/dpdk/mk/rte.sdkbuild.mk:46: drivers] Error 2
make[2]: *** [/root/RHEL80-64_K3.10.0_GCC8.2.1/x86_64-native-linuxapp-gcc/a34fcac57f764c46bc256cbf4e616e98/dpdk/mk/rte.sdkroot.mk:99: all] Error 2
make[1]: *** [/root/RHEL80-64_K3.10.0_GCC8.2.1/x86_64-native-linuxapp-gcc/a34fcac57f764c46bc256cbf4e616e98/dpdk/mk/rte.sdkinstall.mk:61: pre_install] Error 2
make: *** [/root/RHEL80-64_K3.10.0_GCC8.2.1/x86_64-native-linuxapp-gcc/a34fcac57f764c46bc256cbf4e616e98/dpdk/mk/rte.sdkroot.mk:77: install] Error 2


*Make Build Failed #16:
OS: SUSE15-64
Target: x86_64-native-linuxapp-clang
In file included from /root/SUSE15-64_K4.12.14_Clang5.0.1/x86_64-native-linuxapp-clang/a34fcac57f764c46bc256cbf4e616e98/dpdk/drivers/net/ionic/ionic_dev.h:8:
/root/SUSE15-64_K4.12.14_Clang5.0.1/x86_64-native-linuxapp-clang/a34fcac57f764c46bc256cbf4e616e98/dpdk/drivers/net/ionic/ionic_osdep.h:48:1: warning: typedef requires a name [-Wmissing-declarations]
typedef uint8_t bool;
^~~~~~~~~~~~~~~~~~~~
1 warning and 1 error generated.
make[6]: *** [/root/SUSE15-64_K4.12.14_Clang5.0.1/x86_64-native-linuxapp-clang/a34fcac57f764c46bc256cbf4e616e98/dpdk/mk/internal/rte.compile-pre.mk:116: ionic_mac_api.o] Error 1
make[5]: *** [/root/SUSE15-64_K4.12.14_Clang5.0.1/x86_64-native-linuxapp-clang/a34fcac57f764c46bc256cbf4e616e98/dpdk/mk/rte.subdir.mk:37: ionic] Error 2
make[5]: *** Waiting for unfinished jobs....
  CC ice_nvm.o
  CC i40e_nvm.o
  CC hns3_intr.o
  CC i40e_dcb.o
--
  CC ice_generic_flow.o
  AR librte_pmd_i40e.a
  INSTALL-LIB librte_pmd_i40e.a
  AR librte_pmd_ice.a
  INSTALL-LIB librte_pmd_ice.a
make[4]: *** [/root/SUSE15-64_K4.12.14_Clang5.0.1/x86_64-native-linuxapp-clang/a34fcac57f764c46bc256cbf4e616e98/dpdk/mk/rte.subdir.mk:35: net] Error 2
make[3]: *** [/root/SUSE15-64_K4.12.14_Clang5.0.1/x86_64-native-linuxapp-clang/a34fcac57f764c46bc256cbf4e616e98/dpdk/mk/rte.sdkbuild.mk:46: drivers] Error 2
make[2]: *** [/root/SUSE15-64_K4.12.14_Clang5.0.1/x86_64-native-linuxapp-clang/a34fcac57f764c46bc256cbf4e616e98/dpdk/mk/rte.sdkroot.mk:99: all] Error 2
make[1]: *** [/root/SUSE15-64_K4.12.14_Clang5.0.1/x86_64-native-linuxapp-clang/a34fcac57f764c46bc256cbf4e616e98/dpdk/mk/rte.sdkinstall.mk:61: pre_install] Error 2
make: *** [/root/SUSE15-64_K4.12.14_Clang5.0.1/x86_64-native-linuxapp-clang/a34fcac57f764c46bc256cbf4e616e98/dpdk/mk/rte.sdkroot.mk:77: install] Error 2


*Make Build Failed #17:
OS: FC31-64
Target: x86_64-native-linuxapp-clang
In file included from /root/FC31-64_K5.3.14_Clang9.0.0/x86_64-native-linuxapp-clang/a34fcac57f764c46bc256cbf4e616e98/dpdk/drivers/net/ionic/ionic_dev.h:8:
/root/FC31-64_K5.3.14_Clang9.0.0/x86_64-native-linuxapp-clang/a34fcac57f764c46bc256cbf4e616e98/dpdk/drivers/net/ionic/ionic_osdep.h:48:1: warning: typedef requires a name [-Wmissing-declarations]
typedef uint8_t bool;
^~~~~~~~~~~~~~~~~~~~
1 warning and 1 error generated.
make[6]: *** [/root/FC31-64_K5.3.14_Clang9.0.0/x86_64-native-linuxapp-clang/a34fcac57f764c46bc256cbf4e616e98/dpdk/mk/internal/rte.compile-pre.mk:116: ionic_mac_api.o] Error 1
make[5]: *** [/root/FC31-64_K5.3.14_Clang9.0.0/x86_64-native-linuxapp-clang/a34fcac57f764c46bc256cbf4e616e98/dpdk/mk/rte.subdir.mk:37: ionic] Error 2
make[5]: *** Waiting for unfinished jobs....
  CC lio_rxtx.o
  CC ice_sched.o
  AR librte_pmd_iavf.a
  INSTALL-LIB librte_pmd_iavf.a
--
  LD hinic_pmd_ethdev.o
  AR librte_pmd_hinic.a
  INSTALL-LIB librte_pmd_hinic.a
  AR librte_pmd_i40e.a
  INSTALL-LIB librte_pmd_i40e.a
make[4]: *** [/root/FC31-64_K5.3.14_Clang9.0.0/x86_64-native-linuxapp-clang/a34fcac57f764c46bc256cbf4e616e98/dpdk/mk/rte.subdir.mk:35: net] Error 2
make[3]: *** [/root/FC31-64_K5.3.14_Clang9.0.0/x86_64-native-linuxapp-clang/a34fcac57f764c46bc256cbf4e616e98/dpdk/mk/rte.sdkbuild.mk:46: drivers] Error 2
make[2]: *** [/root/FC31-64_K5.3.14_Clang9.0.0/x86_64-native-linuxapp-clang/a34fcac57f764c46bc256cbf4e616e98/dpdk/mk/rte.sdkroot.mk:99: all] Error 2
make[1]: *** [/root/FC31-64_K5.3.14_Clang9.0.0/x86_64-native-linuxapp-clang/a34fcac57f764c46bc256cbf4e616e98/dpdk/mk/rte.sdkinstall.mk:61: pre_install] Error 2
make: *** [/root/FC31-64_K5.3.14_Clang9.0.0/x86_64-native-linuxapp-clang/a34fcac57f764c46bc256cbf4e616e98/dpdk/mk/rte.sdkroot.mk:77: install] Error 2


*Make Build Failed #18:
OS: UB1604-64
Target: x86_64-native-linuxapp-gcc
                 from /root/UB1604-64_K4.4.0_GCC5.4.0/x86_64-native-linuxapp-gcc/a34fcac57f764c46bc256cbf4e616e98/dpdk/drivers/net/ionic/ionic_mac_api.c:5:
/root/UB1604-64_K4.4.0_GCC5.4.0/x86_64-native-linuxapp-gcc/a34fcac57f764c46bc256cbf4e616e98/dpdk/drivers/net/ionic/ionic_osdep.h:48:1: warning: useless type name in empty declaration
 typedef uint8_t bool;
 ^
cc1: warning: unrecognized command line option ‘-Wno-address-of-packed-member’
/root/UB1604-64_K4.4.0_GCC5.4.0/x86_64-native-linuxapp-gcc/a34fcac57f764c46bc256cbf4e616e98/dpdk/mk/internal/rte.compile-pre.mk:114: recipe for target 'ionic_mac_api.o' failed
make[6]: *** [ionic_mac_api.o] Error 1
/root/UB1604-64_K4.4.0_GCC5.4.0/x86_64-native-linuxapp-gcc/a34fcac57f764c46bc256cbf4e616e98/dpdk/mk/rte.subdir.mk:35: recipe for target 'ionic' failed
make[5]: *** [ionic] Error 2
make[5]: *** Waiting for unfinished jobs....
  CC iavf_rxtx.o
  CC enic_rxtx_vec_avx2.o
  SYMLINK-FILE include/rte_pmd_ixgbe.h
  CC ixgbe_common.o
--
  AR librte_pmd_ice.a
  LD ixgbe_ethdev.o
  INSTALL-LIB librte_pmd_ice.a
  AR librte_pmd_ixgbe.a
  INSTALL-LIB librte_pmd_ixgbe.a
/root/UB1604-64_K4.4.0_GCC5.4.0/x86_64-native-linuxapp-gcc/a34fcac57f764c46bc256cbf4e616e98/dpdk/mk/rte.subdir.mk:35: recipe for target 'net' failed
make[4]: *** [net] Error 2
/root/UB1604-64_K4.4.0_GCC5.4.0/x86_64-native-linuxapp-gcc/a34fcac57f764c46bc256cbf4e616e98/dpdk/mk/rte.sdkbuild.mk:46: recipe for target 'drivers' failed
make[3]: *** [drivers] Error 2
/root/UB1604-64_K4.4.0_GCC5.4.0/x86_64-native-linuxapp-gcc/a34fcac57f764c46bc256cbf4e616e98/dpdk/mk/rte.sdkroot.mk:98: recipe for target 'all' failed
make[2]: *** [all] Error 2
/root/UB1604-64_K4.4.0_GCC5.4.0/x86_64-native-linuxapp-gcc/a34fcac57f764c46bc256cbf4e616e98/dpdk/mk/rte.sdkinstall.mk:60: recipe for target 'pre_install' failed
make[1]: *** [pre_install] Error 2
/root/UB1604-64_K4.4.0_GCC5.4.0/x86_64-native-linuxapp-gcc/a34fcac57f764c46bc256cbf4e616e98/dpdk/mk/rte.sdkroot.mk:77: recipe for target 'install' failed
make: *** [install] Error 2


*Make Build Failed #19:
OS: UB1804-64
Target: x86_64-native-linuxapp-gcc
                 from /root/UB1804-64_K4.15.0_GCC7.3.0/x86_64-native-linuxapp-gcc/a34fcac57f764c46bc256cbf4e616e98/dpdk/drivers/net/ionic/ionic_mac_api.c:5:
/root/UB1804-64_K4.15.0_GCC7.3.0/x86_64-native-linuxapp-gcc/a34fcac57f764c46bc256cbf4e616e98/dpdk/drivers/net/ionic/ionic_osdep.h:48:1: warning: useless type name in empty declaration
 typedef uint8_t bool;
 ^~~~~~~
cc1: warning: unrecognized command line option ‘-Wno-address-of-packed-member’
/root/UB1804-64_K4.15.0_GCC7.3.0/x86_64-native-linuxapp-gcc/a34fcac57f764c46bc256cbf4e616e98/dpdk/mk/internal/rte.compile-pre.mk:114: recipe for target 'ionic_mac_api.o' failed
make[6]: *** [ionic_mac_api.o] Error 1
make[6]: *** Waiting for unfinished jobs....
  CC ice_flex_pipe.o
  CC ice_flow.o
== Build drivers/net/liquidio
== Build drivers/net/memif
--
                 from /root/UB1804-64_K4.15.0_GCC7.3.0/x86_64-native-linuxapp-gcc/a34fcac57f764c46bc256cbf4e616e98/dpdk/drivers/net/ionic/ionic_rx_filter.c:9:
/root/UB1804-64_K4.15.0_GCC7.3.0/x86_64-native-linuxapp-gcc/a34fcac57f764c46bc256cbf4e616e98/dpdk/drivers/net/ionic/ionic_osdep.h:48:1: warning: useless type name in empty declaration
 typedef uint8_t bool;
 ^~~~~~~
cc1: warning: unrecognized command line option ‘-Wno-address-of-packed-member’
/root/UB1804-64_K4.15.0_GCC7.3.0/x86_64-native-linuxapp-gcc/a34fcac57f764c46bc256cbf4e616e98/dpdk/mk/internal/rte.compile-pre.mk:114: recipe for target 'ionic_rx_filter.o' failed
make[6]: *** [ionic_rx_filter.o] Error 1
/root/UB1804-64_K4.15.0_GCC7.3.0/x86_64-native-linuxapp-gcc/a34fcac57f764c46bc256cbf4e616e98/dpdk/mk/rte.subdir.mk:35: recipe for target 'ionic' failed
make[5]: *** [ionic] Error 2
make[5]: *** Waiting for unfinished jobs....
  CC ixgbe_82598.o
  CC lio_ethdev.o
  CC rte_eth_memif.o
  AR librte_pmd_hns3.a
--
  PMDINFO ixgbe_ethdev.o.pmd.c
  CC ixgbe_ethdev.o.pmd.o
  LD ixgbe_ethdev.o
  AR librte_pmd_ixgbe.a
  INSTALL-LIB librte_pmd_ixgbe.a
/root/UB1804-64_K4.15.0_GCC7.3.0/x86_64-native-linuxapp-gcc/a34fcac57f764c46bc256cbf4e616e98/dpdk/mk/rte.subdir.mk:35: recipe for target 'net' failed
make[4]: *** [net] Error 2
/root/UB1804-64_K4.15.0_GCC7.3.0/x86_64-native-linuxapp-gcc/a34fcac57f764c46bc256cbf4e616e98/dpdk/mk/rte.sdkbuild.mk:46: recipe for target 'drivers' failed
make[3]: *** [drivers] Error 2
/root/UB1804-64_K4.15.0_GCC7.3.0/x86_64-native-linuxapp-gcc/a34fcac57f764c46bc256cbf4e616e98/dpdk/mk/rte.sdkroot.mk:98: recipe for target 'all' failed
make[2]: *** [all] Error 2
/root/UB1804-64_K4.15.0_GCC7.3.0/x86_64-native-linuxapp-gcc/a34fcac57f764c46bc256cbf4e616e98/dpdk/mk/rte.sdkinstall.mk:60: recipe for target 'pre_install' failed
make[1]: *** [pre_install] Error 2
/root/UB1804-64_K4.15.0_GCC7.3.0/x86_64-native-linuxapp-gcc/a34fcac57f764c46bc256cbf4e616e98/dpdk/mk/rte.sdkroot.mk:77: recipe for target 'install' failed
make: *** [install] Error 2


*Make Build Failed #20:
OS: FreeBSD1201-64
Target: x86_64-native-bsdapp-clang
In file included from /root/FreeBSD1201-64_K12.1_Clang8.0.1/x86_64-native-bsdapp-clang/a34fcac57f764c46bc256cbf4e616e98/dpdk/drivers/net/ionic/ionic_dev.h:8:
/root/FreeBSD1201-64_K12.1_Clang8.0.1/x86_64-native-bsdapp-clang/a34fcac57f764c46bc256cbf4e616e98/dpdk/drivers/net/ionic/ionic_osdep.h:48:1: warning: typedef requires a name [-Wmissing-declarations]
typedef uint8_t bool;
^~~~~~~~~~~~~~~~~~~~
1 warning and 1 error generated.
gmake[6]: *** [/root/FreeBSD1201-64_K12.1_Clang8.0.1/x86_64-native-bsdapp-clang/a34fcac57f764c46bc256cbf4e616e98/dpdk/mk/internal/rte.compile-pre.mk:116: ionic_mac_api.o] Error 1
  CC ice_common.o
gmake[5]: *** [/root/FreeBSD1201-64_K12.1_Clang8.0.1/x86_64-native-bsdapp-clang/a34fcac57f764c46bc256cbf4e616e98/dpdk/mk/rte.subdir.mk:37: ionic] Error 2
gmake[5]: *** Waiting for unfinished jobs....
  CC fm10k_rxtx_vec.o
  CC t4vf_hw.o
  CC e1000_logs.o
  CC i40e_lan_hmc.o
--
  INSTALL-LIB librte_pmd_e1000.a
  AR librte_pmd_i40e.a
  INSTALL-LIB librte_pmd_i40e.a
  AR librte_pmd_ice.a
  INSTALL-LIB librte_pmd_ice.a
gmake[4]: *** [/root/FreeBSD1201-64_K12.1_Clang8.0.1/x86_64-native-bsdapp-clang/a34fcac57f764c46bc256cbf4e616e98/dpdk/mk/rte.subdir.mk:35: net] Error 2
gmake[3]: *** [/root/FreeBSD1201-64_K12.1_Clang8.0.1/x86_64-native-bsdapp-clang/a34fcac57f764c46bc256cbf4e616e98/dpdk/mk/rte.sdkbuild.mk:46: drivers] Error 2
gmake[2]: *** [/root/FreeBSD1201-64_K12.1_Clang8.0.1/x86_64-native-bsdapp-clang/a34fcac57f764c46bc256cbf4e616e98/dpdk/mk/rte.sdkroot.mk:99: all] Error 2
gmake[1]: *** [/root/FreeBSD1201-64_K12.1_Clang8.0.1/x86_64-native-bsdapp-clang/a34fcac57f764c46bc256cbf4e616e98/dpdk/mk/rte.sdkinstall.mk:61: pre_install] Error 2
gmake: *** [/root/FreeBSD1201-64_K12.1_Clang8.0.1/x86_64-native-bsdapp-clang/a34fcac57f764c46bc256cbf4e616e98/dpdk/mk/rte.sdkroot.mk:77: install] Error 2


*Make Build Failed #21:
OS: FreeBSD1201-64
Target: x86_64-native-bsdapp-gcc
                 from /root/FreeBSD1201-64_K12.1_GCC9.2.0/x86_64-native-bsdapp-gcc/a34fcac57f764c46bc256cbf4e616e98/dpdk/drivers/net/ionic/ionic_mac_api.h:8,
                 from /root/FreeBSD1201-64_K12.1_GCC9.2.0/x86_64-native-bsdapp-gcc/a34fcac57f764c46bc256cbf4e616e98/dpdk/drivers/net/ionic/ionic_mac_api.c:5:
/root/FreeBSD1201-64_K12.1_GCC9.2.0/x86_64-native-bsdapp-gcc/a34fcac57f764c46bc256cbf4e616e98/dpdk/drivers/net/ionic/ionic_osdep.h:48:1: warning: useless type name in empty declaration
   48 | typedef uint8_t bool;
      | ^~~~~~~
gmake[6]: *** [/root/FreeBSD1201-64_K12.1_GCC9.2.0/x86_64-native-bsdapp-gcc/a34fcac57f764c46bc256cbf4e616e98/dpdk/mk/internal/rte.compile-pre.mk:116: ionic_mac_api.o] Error 1
gmake[5]: *** [/root/FreeBSD1201-64_K12.1_GCC9.2.0/x86_64-native-bsdapp-gcc/a34fcac57f764c46bc256cbf4e616e98/dpdk/mk/rte.subdir.mk:35: ionic] Error 2
gmake[5]: *** Waiting for unfinished jobs....
  CC i40e_hmc.o
  CC e1000_osdep.o
  CC iavf_rxtx_vec_sse.o
  CC base/vnic_rq.o
--
  PMDINFO ixgbe_ethdev.o.pmd.c
  CC ixgbe_ethdev.o.pmd.o
  LD ixgbe_ethdev.o
  AR librte_pmd_ixgbe.a
  INSTALL-LIB librte_pmd_ixgbe.a
gmake[4]: *** [/root/FreeBSD1201-64_K12.1_GCC9.2.0/x86_64-native-bsdapp-gcc/a34fcac57f764c46bc256cbf4e616e98/dpdk/mk/rte.subdir.mk:35: net] Error 2
gmake[3]: *** [/root/FreeBSD1201-64_K12.1_GCC9.2.0/x86_64-native-bsdapp-gcc/a34fcac57f764c46bc256cbf4e616e98/dpdk/mk/rte.sdkbuild.mk:46: drivers] Error 2
gmake[2]: *** [/root/FreeBSD1201-64_K12.1_GCC9.2.0/x86_64-native-bsdapp-gcc/a34fcac57f764c46bc256cbf4e616e98/dpdk/mk/rte.sdkroot.mk:99: all] Error 2
gmake[1]: *** [/root/FreeBSD1201-64_K12.1_GCC9.2.0/x86_64-native-bsdapp-gcc/a34fcac57f764c46bc256cbf4e616e98/dpdk/mk/rte.sdkinstall.mk:61: pre_install] Error 2
gmake: *** [/root/FreeBSD1201-64_K12.1_GCC9.2.0/x86_64-native-bsdapp-gcc/a34fcac57f764c46bc256cbf4e616e98/dpdk/mk/rte.sdkroot.mk:77: install] Error 2


*Make Build Failed #22:
OS: FreeBSD1201-64
Target: x86_64-native-bsdapp-gcc+shared
                 from /root/FreeBSD1201-64_K12.1_GCC7.3.0/x86_64-native-bsdapp-gcc+shared/a34fcac57f764c46bc256cbf4e616e98/dpdk/drivers/net/ionic/ionic_mac_api.h:8,
                 from /root/FreeBSD1201-64_K12.1_GCC7.3.0/x86_64-native-bsdapp-gcc+shared/a34fcac57f764c46bc256cbf4e616e98/dpdk/drivers/net/ionic/ionic_mac_api.c:5:
/root/FreeBSD1201-64_K12.1_GCC7.3.0/x86_64-native-bsdapp-gcc+shared/a34fcac57f764c46bc256cbf4e616e98/dpdk/drivers/net/ionic/ionic_osdep.h:48:1: warning: useless type name in empty declaration
   48 | typedef uint8_t bool;
      | ^~~~~~~
gmake[6]: *** [/root/FreeBSD1201-64_K12.1_GCC7.3.0/x86_64-native-bsdapp-gcc+shared/a34fcac57f764c46bc256cbf4e616e98/dpdk/mk/internal/rte.compile-pre.mk:116: ionic_mac_api.o] Error 1
gmake[5]: *** [/root/FreeBSD1201-64_K12.1_GCC7.3.0/x86_64-native-bsdapp-gcc+shared/a34fcac57f764c46bc256cbf4e616e98/dpdk/mk/rte.subdir.mk:35: ionic] Error 2
gmake[5]: *** Waiting for unfinished jobs....
  CC base/vnic_wq.o
  CC igb_pf.o
  CC iavf_rxtx_vec_sse.o
  CC igb_flow.o
--
  PMDINFO ixgbe_ethdev.o.pmd.c
  CC ixgbe_ethdev.o.pmd.o
  LD ixgbe_ethdev.o
  LD librte_pmd_ixgbe.so.20.0.2
  INSTALL-LIB librte_pmd_ixgbe.so.20.0.2
gmake[4]: *** [/root/FreeBSD1201-64_K12.1_GCC7.3.0/x86_64-native-bsdapp-gcc+shared/a34fcac57f764c46bc256cbf4e616e98/dpdk/mk/rte.subdir.mk:35: net] Error 2
gmake[3]: *** [/root/FreeBSD1201-64_K12.1_GCC7.3.0/x86_64-native-bsdapp-gcc+shared/a34fcac57f764c46bc256cbf4e616e98/dpdk/mk/rte.sdkbuild.mk:46: drivers] Error 2
gmake[2]: *** [/root/FreeBSD1201-64_K12.1_GCC7.3.0/x86_64-native-bsdapp-gcc+shared/a34fcac57f764c46bc256cbf4e616e98/dpdk/mk/rte.sdkroot.mk:99: all] Error 2
gmake[1]: *** [/root/FreeBSD1201-64_K12.1_GCC7.3.0/x86_64-native-bsdapp-gcc+shared/a34fcac57f764c46bc256cbf4e616e98/dpdk/mk/rte.sdkinstall.mk:61: pre_install] Error 2
gmake: *** [/root/FreeBSD1201-64_K12.1_GCC7.3.0/x86_64-native-bsdapp-gcc+shared/a34fcac57f764c46bc256cbf4e616e98/dpdk/mk/rte.sdkroot.mk:77: install] Error 2


*Make Build Failed #23:
OS: FreeBSD1201-64
Target: x86_64-native-bsdapp-gcc+debug
                 from /root/FreeBSD1201-64_K12.1_GCC7.3.0/x86_64-native-bsdapp-gcc+debug/a34fcac57f764c46bc256cbf4e616e98/dpdk/drivers/net/ionic/ionic_mac_api.c:5:
/root/FreeBSD1201-64_K12.1_GCC7.3.0/x86_64-native-bsdapp-gcc+debug/a34fcac57f764c46bc256cbf4e616e98/dpdk/drivers/net/ionic/ionic_osdep.h:48:1: warning: useless type name in empty declaration
   48 | typedef uint8_t bool;
      | ^~~~~~~
  PMDINFO iavf_ethdev.o.pmd.c
gmake[6]: *** [/root/FreeBSD1201-64_K12.1_GCC7.3.0/x86_64-native-bsdapp-gcc+debug/a34fcac57f764c46bc256cbf4e616e98/dpdk/mk/internal/rte.compile-pre.mk:116: ionic_mac_api.o] Error 1
  CC iavf_ethdev.o.pmd.o
  CC failsafe_rxtx.o
gmake[5]: *** [/root/FreeBSD1201-64_K12.1_GCC7.3.0/x86_64-native-bsdapp-gcc+debug/a34fcac57f764c46bc256cbf4e616e98/dpdk/mk/rte.subdir.mk:37: ionic] Error 2
gmake[5]: *** Waiting for unfinished jobs....
  SYMLINK-FILE include/rte_pmd_ice.h
  CC iavf_vchnl.o
  CC l2t.o
  LD iavf_ethdev.o
--
  CC i40e_rxtx_vec_avx2.o
  AR librte_pmd_ice.a
  INSTALL-LIB librte_pmd_ice.a
  AR librte_pmd_i40e.a
  INSTALL-LIB librte_pmd_i40e.a
gmake[4]: *** [/root/FreeBSD1201-64_K12.1_GCC7.3.0/x86_64-native-bsdapp-gcc+debug/a34fcac57f764c46bc256cbf4e616e98/dpdk/mk/rte.subdir.mk:35: net] Error 2
gmake[3]: *** [/root/FreeBSD1201-64_K12.1_GCC7.3.0/x86_64-native-bsdapp-gcc+debug/a34fcac57f764c46bc256cbf4e616e98/dpdk/mk/rte.sdkbuild.mk:46: drivers] Error 2
gmake[2]: *** [/root/FreeBSD1201-64_K12.1_GCC7.3.0/x86_64-native-bsdapp-gcc+debug/a34fcac57f764c46bc256cbf4e616e98/dpdk/mk/rte.sdkroot.mk:99: all] Error 2
gmake[1]: *** [/root/FreeBSD1201-64_K12.1_GCC7.3.0/x86_64-native-bsdapp-gcc+debug/a34fcac57f764c46bc256cbf4e616e98/dpdk/mk/rte.sdkinstall.mk:61: pre_install] Error 2
gmake: *** [/root/FreeBSD1201-64_K12.1_GCC7.3.0/x86_64-native-bsdapp-gcc+debug/a34fcac57f764c46bc256cbf4e616e98/dpdk/mk/rte.sdkroot.mk:77: install] Error 2

DPDK STV team

^ permalink raw reply	[flat|nested] only message in thread

only message in thread, other threads:[~2020-03-13 15:57 UTC | newest]

Thread overview: (only message) (download: mbox.gz / follow: Atom feed)
-- links below jump to the message on this page --
2020-03-13 15:57 [dpdk-test-report] |FAILURE| pw66651[v3] log: add API to check if a logtype can log in a given level sys_stv

automatic DPDK test reports

This inbox may be cloned and mirrored by anyone:

	git clone --mirror http://inbox.dpdk.org/test-report/0 test-report/git/0.git

	# If you have public-inbox 1.1+ installed, you may
	# initialize and index your mirror using the following commands:
	public-inbox-init -V2 test-report test-report/ http://inbox.dpdk.org/test-report \
		test-report@dpdk.org
	public-inbox-index test-report

Example config snippet for mirrors.
Newsgroup available over NNTP:
	nntp://inbox.dpdk.org/inbox.dpdk.test-report


AGPL code for this site: git clone https://public-inbox.org/public-inbox.git