automatic DPDK test reports
 help / color / Atom feed
* [dpdk-test-report]  |FAILURE| pw67143[v2, 28/32] ethdev: add tracepoints
@ 2020-03-26  1:42 sys_stv
  0 siblings, 0 replies; only message in thread
From: sys_stv @ 2020-03-26  1:42 UTC (permalink / raw)
  To: test-report

[-- Attachment #1: Type: text/plain, Size: 51197 bytes --]

Test-Label: Intel-compilation
Test-Status: FAILURE
http://dpdk.org/patch/67143

_Compilation issues_

Submitter: Jerin Jacob Kollanukkaran <jerinj@marvell.com>
Date: 2020-03-25 21:15:58
Reply_mail: 20200325211603.240288-29-jerinj@marvell.com
DPDK git baseline: Repo:dpdk, CommitID: bcf789da7335b80e792ba926b5a95a12fa2e1e9a

Makefile build Summary: 23 Builds Done, 23 Successful, 0 Failures

Meson build Summary: 8 Builds Done, 2 Successful, 6 Failures

               +==============================================+===========+==========+
               |                   Makefile                   |   Meson   | Document |
+----------------+------+-------+------+------------+-----------+-----------+----------+
| os             | gcc  | clang | icc  | gcc+shared | gcc+debug | gcc/clang | pdf/html |
+----------------+------+-------+------+------------+-----------+-----------+----------+
| RHEL80-64      | pass |       |      |            |           |           |          |
| UB1804-64      | pass | pass  | pass |            |           | FAIL      | pass     |
| UB1604-32      | pass |       |      |            |           | FAIL      |          |
| CENTOS77-64    | pass | pass  | pass | pass       | pass      | FAIL      |          |
| UB1604-64      | pass | pass  |      |            |           |           |          |
| WIN10-64       |      |       |      |            |           | pass      |          |
| UB1910-64      | pass |       |      |            |           |           |          |
| FC31-64        | pass | pass  |      |            |           | FAIL      |          |
| CENTOS80-64    | pass |       |      |            |           |           |          |
| FreeBSD1201-64 | pass | pass  |      | pass       | pass      | FAIL      |          |
| RHEL77-64      | pass |       |      |            |           |           |          |
| SUSE15-64      | pass | pass  |      |            |           | FAIL      |          |
+----------------+------+-------+------+------------+-----------+-----------+----------+

Test environment and configuration as below:

** Makefile build **


OS: UB1804-64
	Kernel Version: 4.15.0-20-generic
	CPU info: Intel(R) Xeon(R) CPU E5-2699 v3 @ 2.30GHz
	GCC Version: gcc (Ubuntu 7.3.0-16ubuntu3) 7.3.0
	Clang Version: 6.0.0-1ubuntu2 (tags/RELEASE_600/final)
	x86_64-native-linuxapp-clang
	x86_64-native-linuxapp-icc
	x86_64-native-linuxapp-gcc


OS: UB1604-32
	Kernel Version: 4.4.0-131-generic
	CPU info: Intel(R) Xeon(R) Platinum 8180 CPU @ 2.50GHz
	GCC Version: gcc (Ubuntu 5.4.0-6ubuntu1~16.04.11) 5.4.0 20160609
	Clang Version: 3.8.0-2ubuntu4 (tags/RELEASE_380/final)
	i686-native-linuxapp-gcc


OS: CENTOS77-64
	Kernel Version: 3.10.0-1062.9.1.el7.x86_64
	CPU info: Intel(R) Xeon(R) CPU E5-2699 v3 @ 2.30GHz
	GCC Version: gcc (GCC) 4.8.5 20150623 (Red Hat 4.8.5-39)
	Clang Version: 3.4.2 (tags/RELEASE_34/dot2-final)
	x86_64-native-linuxapp-clang
	x86_64-native-linuxapp-gcc+shared
	x86_64-native-linuxapp-gcc
	x86_64-native-linuxapp-gcc+debug
	x86_64-native-linuxapp-icc


OS: UB1604-64
	Kernel Version: 4.4.0-174-generic
	CPU info: Intel(R) Xeon(R) CPU E5-2699 v3 @ 2.30GHz
	GCC Version: gcc (Ubuntu 5.4.0-6ubuntu1~16.04.12) 5.4.0 20160609
	Clang Version: 3.8.0-2ubuntu4 (tags/RELEASE_380/final)
	x86_64-native-linuxapp-clang
	x86_64-native-linuxapp-gcc


OS: CENTOS80-64
	Kernel Version: 4.18.0-80.11.2.el8_0.x86_64
	CPU info: Intel(R) Xeon(R) CPU E5-2699 v3 @ 2.30GHz
	GCC Version: gcc (GCC) 8.2.1 20180905 (Red Hat 8.2.1-3)
	Clang Version: 7.0.1 (tags/RELEASE_701/final)
	x86_64-native-linuxapp-gcc


OS: UB1910-64
	Kernel Version: 5.3.0-18-generic
	CPU info: Intel(R) Xeon(R) Platinum 8180 CPU @ 2.50GHz
	GCC Version: gcc (Ubuntu 9.2.1-9ubuntu2) 9.2.1 20191008
	Clang Version: 9.0.0-2 (tags/RELEASE_900/final)
	x86_64-native-linuxapp-gcc


OS: FC31-64
	Kernel Version: 5.3.15-300.fc31.x86_64
	CPU info: Intel(R) Xeon(R) CPU E5-2699 v4 @ 2.20GHz
	GCC Version: gcc (GCC) 9.2.1 20190827 (Red Hat 9.2.1-1)
	Clang Version: 9.0.0 (Fedora 9.0.0-1.fc31)
	x86_64-native-linuxapp-gcc
	x86_64-native-linuxapp-clang


OS: RHEL80-64
	Kernel Version: 4.18.0-80.el8.x86_64
	CPU info: Intel(R) Xeon(R) CPU E5-2699 v4 @ 2.20GHz
	GCC Version: gcc (GCC) 8.2.1 20180905 (Red Hat 8.2.1-3)
	Clang Version: 6.0.1 (tags/RELEASE_601/final)
	x86_64-native-linuxapp-gcc


OS: FreeBSD1201-64
	Kernel Version: 12.1-RELEASE
	CPU info: Intel(R) Xeon(R) CPU E5-2699 v3 @ 2.30GHz (2294.73-MHz K8-class CPU)
	GCC Version: gcc (FreeBSD Ports Collection) 9.2.0
	Clang Version: 8.0.1 (tags/RELEASE_801/final 366581) (based on LLVM 8.0.1)
	x86_64-native-bsdapp-gcc+shared
	x86_64-native-bsdapp-gcc
	x86_64-native-bsdapp-gcc+debug
	x86_64-native-bsdapp-clang


OS: RHEL77-64
	Kernel Version: 3.10.0-1062.9.1.el7.x86_64
	CPU info: Intel(R) Xeon(R) CPU E5-2699 v4 @ 2.20GHz
	GCC Version: gcc (GCC) 4.8.5 20150623 (Red Hat 4.8.5-39)
	Clang Version: 3.4.2 (tags/RELEASE_34/dot2-final)
	x86_64-native-linuxapp-gcc


OS: SUSE15-64
	Kernel Version: 4.12.14-lp150.11-default
	CPU info: Intel(R) Xeon(R) CPU E5-2699 v4 @ 2.20GHz
	GCC Version: gcc (SUSE Linux) 7.3.1 20180323 [gcc-7-branch revision 258812]
	Clang Version: 5.0.1 (tags/RELEASE_501/final 312548)
	x86_64-native-linuxapp-clang
	x86_64-native-linuxapp-gcc


** Meson build **


OS: UB1804-64
	Kernel Version: 4.15.0-20-generic
	CPU info: Intel(R) Xeon(R) CPU E5-2699 v4 @ 2.20GHz
	GCC Version: gcc (Ubuntu 7.3.0-27ubuntu1~18.04) 7.3.0
	Clang Version: 6.0.0-1ubuntu2 (tags/RELEASE_600/final)
	x86_64-native-linuxapp-doc
	./build-gcc-static
	./build-gcc-shared
	./build-clang-static
	./build-clang-shared
	./build-x86-default


OS: UB1604-32
	Kernel Version: 4.4.0-131-generic
	CPU info: Intel(R) Xeon(R) CPU E5-2699 v4 @ 2.20GHz
	GCC Version: gcc (Ubuntu 5.4.0-6ubuntu1~16.04.11) 5.4.0 20160609
	Clang Version: 3.8.0-2ubuntu4 (tags/RELEASE_380/final)
	./build-gcc-static
	./build-gcc-shared
	./build-clang-static
	./build-clang-shared
	./build-x86-default


OS: CENTOS77-64
	Kernel Version: 3.10.0-1062.12.1.el7.x86_64
	CPU info: Intel(R) Xeon(R) CPU E5-2699 v4 @ 2.20GHz
	GCC Version: gcc (GCC) 4.8.5 20150623 (Red Hat 4.8.5-39)
	Clang Version: 3.4.2 (tags/RELEASE_34/dot2-final)
	./build-gcc-static
	./build-gcc-shared
	./build-clang-static
	./build-clang-shared
	./build-x86-default


OS: WIN10-64
	Kernel Version: N/A
	CPU info: N/A
	GCC Version: N/A
	Clang Version: Clang 8.0.0
	x86_64-windows-clang


OS: FC31-64
	Kernel Version: 5.4.18-200.fc31.x86_64
	CPU info: Intel(R) Xeon(R) CPU E5-2699 v4 @ 2.20GHz
	GCC Version: gcc (GCC) 9.2.1 20190827 (Red Hat 9.2.1-1)
	Clang Version: 9.0.0 (Fedora 9.0.0-1.fc31)
	./build-gcc-static
	./build-gcc-shared
	./build-clang-static
	./build-clang-shared
	./build-x86-default


OS: FreeBSD1201-64
	Kernel Version: 12.1-RELEASE
	CPU info: Intel(R) Xeon(R) CPU E5-2699 v4 @ 2.20GHz (2194.98-MHz K8-class CPU)
	GCC Version: gcc (FreeBSD Ports Collection) 9.2.0
	Clang Version: 8.0.1 (tags/RELEASE_801/final 366581) (based on LLVM 8.0.1)
	./build-gcc-static
	./build-gcc-shared
	./build-clang-static
	./build-clang-shared
	./build-x86-default


OS: SUSE15-64
	Kernel Version: 4.12.14-lp150.12.82-default
	CPU info: Intel(R) Xeon(R) CPU E5-2699 v4 @ 2.20GHz
	GCC Version: gcc (SUSE Linux) 7.4.1 20190905 [gcc-7-branch revision 275407]
	Clang Version: 5.0.1 (tags/RELEASE_501/final 312548)
	./build-gcc-static
	./build-gcc-shared
	./build-clang-static
	./build-clang-shared
	./build-x86-default


*Meson Build Failed #1:
OS: UB1604-32
Target:./build-gcc-static
[178/1984] Compiling C object 'lib/76b5a35@@rte_distributor@sta/librte_distributor_rte_distributor_single.c.o'.
[179/1984] Linking static target lib/librte_distributor.a.
[180/1984] Compiling C object 'lib/76b5a35@@rte_eventdev@sta/librte_eventdev_rte_event_ring.c.o'.
[181/1984] Generating eal.exp_chk with a meson_exe.py custom command.
[182/1984] Linking target lib/librte_eal.so.20.0.2.
FAILED: lib/librte_eal.so.20.0.2 
clang  -o lib/librte_eal.so.20.0.2 'lib/76b5a35@@rte_eal@sta/librte_eal_common_eal_common_bus.c.o' 'lib/76b5a35@@rte_eal@sta/librte_eal_common_eal_common_cpuflags.c.o' 'lib/76b5a35@@rte_eal@sta/librte_eal_common_eal_common_class.c.o' 'lib/76b5a35@@rte_eal@sta/librte_eal_common_eal_common_devargs.c.o' 'lib/76b5a35@@rte_eal@sta/librte_eal_common_eal_common_dev.c.o' 'lib/76b5a35@@rte_eal@sta/librte_eal_common_eal_common_errno.c.o' 'lib/76b5a35@@rte_eal@sta/librte_eal_common_eal_common_fbarray.c.o' 'lib/76b5a35@@rte_eal@sta/librte_eal_common_eal_common_hexdump.c.o' 'lib/76b5a35@@rte_eal@sta/librte_eal_common_eal_common_hypervisor.c.o' 'lib/76b5a35@@rte_eal@sta/librte_eal_common_eal_common_launch.c.o' 'lib/76b5a35@@rte_eal@sta/librte_eal_common_eal_common_lcore.c.o' 'lib/76b5a35@@rte_eal@sta/librte_eal_common_eal_common_log.c.o' 'lib/76b5a35@@rte_eal@sta/librte_eal_common_eal_common_mcfg.c.o' 'lib/76b5a35@@rte_eal@sta/librte_eal_common_eal_common_memalloc.c.o' 'lib/76b5a35@@rte_eal@sta/librte_eal_common_eal_common_memory.c.o' 'lib/76b5a35@@rte_eal@sta/librte_eal_common_eal_common_memzone.c.o' 'lib/76b5a35@@rte_eal@sta/librte_eal_common_eal_common_options.c.o' 'lib/76b5a35@@rte_eal@sta/librte_eal_common_eal_common_proc.c.o' 'lib/76b5a35@@rte_eal@sta/librte_eal_common_eal_common_string_fns.c.o' 'lib/76b5a35@@rte_eal@sta/librte_eal_common_eal_common_tailqs.c.o' 'lib/76b5a35@@rte_eal@sta/librte_eal_common_eal_common_thread.c.o' 'lib/76b5a35@@rte_eal@sta/librte_eal_common_eal_common_timer.c.o' 'lib/76b5a35@@rte_eal@sta/librte_eal_common_eal_common_trace.c.o' 'lib/76b5a35@@rte_eal@sta/librte_eal_common_eal_common_trace_ctf.c.o' 'lib/76b5a35@@rte_eal@sta/librte_eal_common_eal_common_trace_points.c.o' 'lib/76b5a35@@rte_eal@sta/librte_eal_common_eal_common_trace_utils.c.o' 'lib/76b5a35@@rte_eal@sta/librte_eal_common_eal_common_uuid.c.o' 'lib/76b5a35@@rte_eal@sta/librte_eal_common_hotplug_mp.c.o' 'lib/76b5a35@@rte_eal@sta/librte_eal_common_malloc_elem.c.o' 'lib/76b5a35@@rte_eal@sta/librte_eal_common_malloc_heap.c.o' 'lib/76b5a35@@rte_eal@sta/librte_eal_common_malloc_mp.c.o' 'lib/76b5a35@@rte_eal@sta/librte_eal_common_rte_keepalive.c.o' 'lib/76b5a35@@rte_eal@sta/librte_eal_common_rte_malloc.c.o' 'lib/76b5a35@@rte_eal@sta/librte_eal_common_rte_option.c.o' 'lib/76b5a35@@rte_eal@sta/librte_eal_common_rte_random.c.o' 'lib/76b5a35@@rte_eal@sta/librte_eal_common_rte_reciprocal.c.o' 'lib/76b5a35@@rte_eal@sta/librte_eal_common_rte_service.c.o' 'lib/76b5a35@@rte_eal@sta/librte_eal_common_arch_x86_rte_spinlock.c.o' 'lib/76b5a35@@rte_eal@sta/librte_eal_common_arch_x86_rte_cpuflags.c.o' 'lib/76b5a35@@rte_eal@sta/librte_eal_common_arch_x86_rte_cycles.c.o' 'lib/76b5a35@@rte_eal@sta/librte_eal_common_arch_x86_rte_hypervisor.c.o' 'lib/76b5a35@@rte_eal@sta/librte_eal_linux_eal_eal_alarm.c.o' 'lib/76b5a35@@rte_eal@sta/librte_eal_linux_eal_eal_cpuflags.c.o' 'lib/76b5a35@@rte_eal@sta/librte_eal_linux_eal_eal_debug.c.o' 'lib/76b5a35@@rte_eal@sta/librte_eal_linux_eal_eal_hugepage_info.c.o' 'lib/76b5a35@@rte_eal@sta/librte_eal_linux_eal_eal_interrupts.c.o' 'lib/76b5a35@@rte_eal@sta/librte_eal_linux_eal_eal_memalloc.c.o' 'lib/76b5a35@@rte_eal@sta/librte_eal_linux_eal_eal_lcore.c.o' 'lib/76b5a35@@rte_eal@sta/librte_eal_linux_eal_eal_log.c.o' 'lib/76b5a35@@rte_eal@sta/librte_eal_linux_eal_eal_thread.c.o' 'lib/76b5a35@@rte_eal@sta/librte_eal_linux_eal_eal_timer.c.o' 'lib/76b5a35@@rte_eal@sta/librte_eal_linux_eal_eal_vfio.c.o' 'lib/76b5a35@@rte_eal@sta/librte_eal_linux_eal_eal_vfio_mp_sync.c.o' 'lib/76b5a35@@rte_eal@sta/librte_eal_linux_eal_eal.c.o' 'lib/76b5a35@@rte_eal@sta/librte_eal_linux_eal_eal_memory.c.o' 'lib/76b5a35@@rte_eal@sta/librte_eal_linux_eal_eal_dev.c.o' -Wl,--no-undefined -Wl,--as-needed -shared -fPIC -Wl,--start-group -Wl,-soname,librte_eal.so.20.0 -Wl,--no-as-needed -pthread -lm -ldl -lnuma lib/librte_kvargs.so.20.0.2 -Wl,--end-group -Wl,--version-script=/root/UB1604-32_K4.4.0_GCC5.4.0/i686-native-linuxapp-gcc/ea1ff453ea3a4b0f9c4d55201462e9d6/dpdk/lib/librte_eal/rte_eal_version.map '-Wl,-rpath,$ORIGIN/' -Wl,-rpath-link,/root/UB1604-32_K4.4.0_GCC5.4.0/i686-native-linuxapp-gcc/ea1ff453ea3a4b0f9c4d55201462e9d6/dpdk/build-clang-static/lib 
lib/76b5a35@@rte_eal@sta/librte_eal_common_eal_common_memzone.c.o: In function `rte_trace_lib_eal_memzone_reserve':
/root/UB1604-32_K4.4.0_GCC5.4.0/i686-native-linuxapp-gcc/ea1ff453ea3a4b0f9c4d55201462e9d6/dpdk/build-clang-static/../lib/librte_eal/common/include/rte_trace_eal.h:171: undefined reference to `__atomic_load_8'
lib/76b5a35@@rte_eal@sta/librte_eal_common_eal_common_memzone.c.o: In function `rte_trace_lib_eal_memzone_free':
/root/UB1604-32_K4.4.0_GCC5.4.0/i686-native-linuxapp-gcc/ea1ff453ea3a4b0f9c4d55201462e9d6/dpdk/build-clang-static/../lib/librte_eal/common/include/rte_trace_eal.h:188: undefined reference to `__atomic_load_8'
--
lib/76b5a35@@rte_eal@sta/librte_eal_common_rte_malloc.c.o: In function `rte_trace_lib_eal_mem_free':
/root/UB1604-32_K4.4.0_GCC5.4.0/i686-native-linuxapp-gcc/ea1ff453ea3a4b0f9c4d55201462e9d6/dpdk/build-clang-static/../lib/librte_eal/common/include/rte_trace_eal.h:164: undefined reference to `__atomic_load_8'
lib/76b5a35@@rte_eal@sta/librte_eal_common_rte_malloc.c.o: In function `rte_trace_lib_eal_mem_malloc':
/root/UB1604-32_K4.4.0_GCC5.4.0/i686-native-linuxapp-gcc/ea1ff453ea3a4b0f9c4d55201462e9d6/dpdk/build-clang-static/../lib/librte_eal/common/include/rte_trace_eal.h:147: undefined reference to `__atomic_load_8'
lib/76b5a35@@rte_eal@sta/librte_eal_common_rte_malloc.c.o:/root/UB1604-32_K4.4.0_GCC5.4.0/i686-native-linuxapp-gcc/ea1ff453ea3a4b0f9c4d55201462e9d6/dpdk/build-clang-static/../lib/librte_eal/common/include/rte_trace_eal.h:138: more undefined references to `__atomic_load_8' follow
clang: error: linker command failed with exit code 1 (use -v to see invocation)
[183/1984] Compiling C object 'lib/76b5a35@@rte_hash@sta/librte_hash_rte_cuckoo_hash.c.o'.
[184/1984] Generating compressdev.exp_chk with a meson_exe.py custom command.
[185/1984] Generating cryptodev.exp_chk with a meson_exe.py custom command.
[186/1984] Compiling C object 'lib/76b5a35@@rte_eventdev@sta/librte_eventdev_eventdev_trace_points.c.o'.
[187/1984] Generating ethdev.exp_chk with a meson_exe.py custom command.
[188/1984] Generating distributor.exp_chk with a meson_exe.py custom command.
[189/1984] Compiling C object 'lib/76b5a35@@rte_efd@sta/librte_efd_rte_efd.c.o'.
[190/1984] Compiling C object 'lib/76b5a35@@rte_eventdev@sta/librte_eventdev_rte_eventdev.c.o'.
[191/1984] Compiling C object 'lib/76b5a35@@rte_eventdev@sta/librte_eventdev_rte_event_eth_rx_adapter.c.o'.
ninja: build stopped: subcommand failed.
meson  --werror -Dexamples=all --buildtype=debugoptimized --default-library=shared /root/UB1604-32_K4.4.0_GCC5.4.0/i686-native-linuxapp-gcc/ea1ff453ea3a4b0f9c4d55201462e9d6/dpdk/devtools/.. ./build-clang-shared
The Meson build system
Version: 0.50.1
Source dir: /root/UB1604-32_K4.4.0_GCC5.4.0/i686-native-linuxapp-gcc/ea1ff453ea3a4b0f9c4d55201462e9d6/dpdk
Build dir: /root/UB1604-32_K4.4.0_GCC5.4.0/i686-native-linuxapp-gcc/ea1ff453ea3a4b0f9c4d55201462e9d6/dpdk/build-clang-shared
--
[183/2012] Linking static target lib/librte_distributor.a.
[184/2012] Compiling C object 'lib/76b5a35@@rte_eventdev@sta/librte_eventdev_eventdev_trace_points.c.o'.
[185/2012] Generating hash.exp_chk with a meson_exe.py custom command.
[186/2012] Generating eal.exp_chk with a meson_exe.py custom command.
[187/2012] Linking target lib/librte_eal.so.20.0.2.
FAILED: lib/librte_eal.so.20.0.2 
clang  -o lib/librte_eal.so.20.0.2 'lib/76b5a35@@rte_eal@sta/librte_eal_common_eal_common_bus.c.o' 'lib/76b5a35@@rte_eal@sta/librte_eal_common_eal_common_cpuflags.c.o' 'lib/76b5a35@@rte_eal@sta/librte_eal_common_eal_common_class.c.o' 'lib/76b5a35@@rte_eal@sta/librte_eal_common_eal_common_devargs.c.o' 'lib/76b5a35@@rte_eal@sta/librte_eal_common_eal_common_dev.c.o' 'lib/76b5a35@@rte_eal@sta/librte_eal_common_eal_common_errno.c.o' 'lib/76b5a35@@rte_eal@sta/librte_eal_common_eal_common_fbarray.c.o' 'lib/76b5a35@@rte_eal@sta/librte_eal_common_eal_common_hexdump.c.o' 'lib/76b5a35@@rte_eal@sta/librte_eal_common_eal_common_hypervisor.c.o' 'lib/76b5a35@@rte_eal@sta/librte_eal_common_eal_common_launch.c.o' 'lib/76b5a35@@rte_eal@sta/librte_eal_common_eal_common_lcore.c.o' 'lib/76b5a35@@rte_eal@sta/librte_eal_common_eal_common_log.c.o' 'lib/76b5a35@@rte_eal@sta/librte_eal_common_eal_common_mcfg.c.o' 'lib/76b5a35@@rte_eal@sta/librte_eal_common_eal_common_memalloc.c.o' 'lib/76b5a35@@rte_eal@sta/librte_eal_common_eal_common_memory.c.o' 'lib/76b5a35@@rte_eal@sta/librte_eal_common_eal_common_memzone.c.o' 'lib/76b5a35@@rte_eal@sta/librte_eal_common_eal_common_options.c.o' 'lib/76b5a35@@rte_eal@sta/librte_eal_common_eal_common_proc.c.o' 'lib/76b5a35@@rte_eal@sta/librte_eal_common_eal_common_string_fns.c.o' 'lib/76b5a35@@rte_eal@sta/librte_eal_common_eal_common_tailqs.c.o' 'lib/76b5a35@@rte_eal@sta/librte_eal_common_eal_common_thread.c.o' 'lib/76b5a35@@rte_eal@sta/librte_eal_common_eal_common_timer.c.o' 'lib/76b5a35@@rte_eal@sta/librte_eal_common_eal_common_trace.c.o' 'lib/76b5a35@@rte_eal@sta/librte_eal_common_eal_common_trace_ctf.c.o' 'lib/76b5a35@@rte_eal@sta/librte_eal_common_eal_common_trace_points.c.o' 'lib/76b5a35@@rte_eal@sta/librte_eal_common_eal_common_trace_utils.c.o' 'lib/76b5a35@@rte_eal@sta/librte_eal_common_eal_common_uuid.c.o' 'lib/76b5a35@@rte_eal@sta/librte_eal_common_hotplug_mp.c.o' 'lib/76b5a35@@rte_eal@sta/librte_eal_common_malloc_elem.c.o' 'lib/76b5a35@@rte_eal@sta/librte_eal_common_malloc_heap.c.o' 'lib/76b5a35@@rte_eal@sta/librte_eal_common_malloc_mp.c.o' 'lib/76b5a35@@rte_eal@sta/librte_eal_common_rte_keepalive.c.o' 'lib/76b5a35@@rte_eal@sta/librte_eal_common_rte_malloc.c.o' 'lib/76b5a35@@rte_eal@sta/librte_eal_common_rte_option.c.o' 'lib/76b5a35@@rte_eal@sta/librte_eal_common_rte_random.c.o' 'lib/76b5a35@@rte_eal@sta/librte_eal_common_rte_reciprocal.c.o' 'lib/76b5a35@@rte_eal@sta/librte_eal_common_rte_service.c.o' 'lib/76b5a35@@rte_eal@sta/librte_eal_common_arch_x86_rte_spinlock.c.o' 'lib/76b5a35@@rte_eal@sta/librte_eal_common_arch_x86_rte_cpuflags.c.o' 'lib/76b5a35@@rte_eal@sta/librte_eal_common_arch_x86_rte_cycles.c.o' 'lib/76b5a35@@rte_eal@sta/librte_eal_common_arch_x86_rte_hypervisor.c.o' 'lib/76b5a35@@rte_eal@sta/librte_eal_linux_eal_eal_alarm.c.o' 'lib/76b5a35@@rte_eal@sta/librte_eal_linux_eal_eal_cpuflags.c.o' 'lib/76b5a35@@rte_eal@sta/librte_eal_linux_eal_eal_debug.c.o' 'lib/76b5a35@@rte_eal@sta/librte_eal_linux_eal_eal_hugepage_info.c.o' 'lib/76b5a35@@rte_eal@sta/librte_eal_linux_eal_eal_interrupts.c.o' 'lib/76b5a35@@rte_eal@sta/librte_eal_linux_eal_eal_memalloc.c.o' 'lib/76b5a35@@rte_eal@sta/librte_eal_linux_eal_eal_lcore.c.o' 'lib/76b5a35@@rte_eal@sta/librte_eal_linux_eal_eal_log.c.o' 'lib/76b5a35@@rte_eal@sta/librte_eal_linux_eal_eal_thread.c.o' 'lib/76b5a35@@rte_eal@sta/librte_eal_linux_eal_eal_timer.c.o' 'lib/76b5a35@@rte_eal@sta/librte_eal_linux_eal_eal_vfio.c.o' 'lib/76b5a35@@rte_eal@sta/librte_eal_linux_eal_eal_vfio_mp_sync.c.o' 'lib/76b5a35@@rte_eal@sta/librte_eal_linux_eal_eal.c.o' 'lib/76b5a35@@rte_eal@sta/librte_eal_linux_eal_eal_memory.c.o' 'lib/76b5a35@@rte_eal@sta/librte_eal_linux_eal_eal_dev.c.o' -Wl,--no-undefined -Wl,--as-needed -shared -fPIC -Wl,--start-group -Wl,-soname,librte_eal.so.20.0 -Wl,--no-as-needed -pthread -lm -ldl -lnuma lib/librte_kvargs.so.20.0.2 -Wl,--end-group -Wl,--version-script=/root/UB1604-32_K4.4.0_GCC5.4.0/i686-native-linuxapp-gcc/ea1ff453ea3a4b0f9c4d55201462e9d6/dpdk/lib/librte_eal/rte_eal_version.map '-Wl,-rpath,$ORIGIN/' -Wl,-rpath-link,/root/UB1604-32_K4.4.0_GCC5.4.0/i686-native-linuxapp-gcc/ea1ff453ea3a4b0f9c4d55201462e9d6/dpdk/build-clang-shared/lib 
lib/76b5a35@@rte_eal@sta/librte_eal_common_eal_common_memzone.c.o: In function `rte_trace_lib_eal_memzone_reserve':
/root/UB1604-32_K4.4.0_GCC5.4.0/i686-native-linuxapp-gcc/ea1ff453ea3a4b0f9c4d55201462e9d6/dpdk/build-clang-shared/../lib/librte_eal/common/include/rte_trace_eal.h:171: undefined reference to `__atomic_load_8'
lib/76b5a35@@rte_eal@sta/librte_eal_common_eal_common_memzone.c.o: In function `rte_trace_lib_eal_memzone_free':
/root/UB1604-32_K4.4.0_GCC5.4.0/i686-native-linuxapp-gcc/ea1ff453ea3a4b0f9c4d55201462e9d6/dpdk/build-clang-shared/../lib/librte_eal/common/include/rte_trace_eal.h:188: undefined reference to `__atomic_load_8'
--
lib/76b5a35@@rte_eal@sta/librte_eal_common_rte_malloc.c.o: In function `rte_trace_lib_eal_mem_free':
/root/UB1604-32_K4.4.0_GCC5.4.0/i686-native-linuxapp-gcc/ea1ff453ea3a4b0f9c4d55201462e9d6/dpdk/build-clang-shared/../lib/librte_eal/common/include/rte_trace_eal.h:164: undefined reference to `__atomic_load_8'
lib/76b5a35@@rte_eal@sta/librte_eal_common_rte_malloc.c.o: In function `rte_trace_lib_eal_mem_malloc':
/root/UB1604-32_K4.4.0_GCC5.4.0/i686-native-linuxapp-gcc/ea1ff453ea3a4b0f9c4d55201462e9d6/dpdk/build-clang-shared/../lib/librte_eal/common/include/rte_trace_eal.h:147: undefined reference to `__atomic_load_8'
lib/76b5a35@@rte_eal@sta/librte_eal_common_rte_malloc.c.o:/root/UB1604-32_K4.4.0_GCC5.4.0/i686-native-linuxapp-gcc/ea1ff453ea3a4b0f9c4d55201462e9d6/dpdk/build-clang-shared/../lib/librte_eal/common/include/rte_trace_eal.h:138: more undefined references to `__atomic_load_8' follow
clang: error: linker command failed with exit code 1 (use -v to see invocation)
[188/2012] Generating cryptodev.exp_chk with a meson_exe.py custom command.
[189/2012] Generating distributor.exp_chk with a meson_exe.py custom command.
[190/2012] Generating compressdev.exp_chk with a meson_exe.py custom command.
[191/2012] Compiling C object 'lib/76b5a35@@rte_efd@sta/librte_efd_rte_efd.c.o'.
[192/2012] Compiling C object 'lib/76b5a35@@rte_eventdev@sta/librte_eventdev_rte_eventdev.c.o'.
[193/2012] Compiling C object 'lib/76b5a35@@rte_eventdev@sta/librte_eventdev_rte_event_eth_tx_adapter.c.o'.
[194/2012] Compiling C object 'lib/76b5a35@@rte_eventdev@sta/librte_eventdev_rte_event_crypto_adapter.c.o'.
[195/2012] Compiling C object 'lib/76b5a35@@rte_eventdev@sta/librte_eventdev_rte_event_timer_adapter.c.o'.
[196/2012] Compiling C object 'lib/76b5a35@@rte_eventdev@sta/librte_eventdev_rte_event_eth_rx_adapter.c.o'.
ninja: build stopped: subcommand failed.
meson  --werror -Dexamples=all --buildtype=debugoptimized -Dlibdir=lib -Dmachine=nehalem --default-library=shared /root/UB1604-32_K4.4.0_GCC5.4.0/i686-native-linuxapp-gcc/ea1ff453ea3a4b0f9c4d55201462e9d6/dpdk/devtools/.. ./build-x86-default
The Meson build system
Version: 0.50.1
Source dir: /root/UB1604-32_K4.4.0_GCC5.4.0/i686-native-linuxapp-gcc/ea1ff453ea3a4b0f9c4d55201462e9d6/dpdk
Build dir: /root/UB1604-32_K4.4.0_GCC5.4.0/i686-native-linuxapp-gcc/ea1ff453ea3a4b0f9c4d55201462e9d6/dpdk/build-x86-default
--
[547/2016] Compiling C object 'drivers/a715181@@tmp_rte_bus_pci@sta/bus_pci_pci_params.c.o'.
[548/2016] Generating symbol file 'drivers/a715181@@rte_bus_dpaa@sha/librte_bus_dpaa.so.20.0.2.symbols'.
[549/2016] Generating rte_bus_fslmc.exp_chk with a meson_exe.py custom command.
[550/2016] Linking target drivers/librte_bus_fslmc.so.20.0.2.
[551/2016] Compiling C object 'drivers/net/ice/6ab06a9@@ice_avx2_lib@sta/ice_rxtx_vec_avx2.c.o'.
FAILED: drivers/net/ice/6ab06a9@@ice_avx2_lib@sta/ice_rxtx_vec_avx2.c.o 
cc -Idrivers/net/ice/6ab06a9@@ice_avx2_lib@sta -Idrivers/net/ice -I../drivers/net/ice -Idrivers/net/ice/base -I../drivers/net/ice/base -Ilib/librte_ethdev -I../lib/librte_ethdev -I. -I../ -Iconfig -I../config -Ilib/librte_eal/common/include -I../lib/librte_eal/common/include -I../lib/librte_eal/linux/eal/include -Ilib/librte_eal/common -I../lib/librte_eal/common -Ilib/librte_eal/common/include/arch/x86 -I../lib/librte_eal/common/include/arch/x86 -Ilib/librte_eal -I../lib/librte_eal -Ilib/librte_kvargs -I../lib/librte_kvargs -Ilib/librte_net -I../lib/librte_net -Ilib/librte_mbuf -I../lib/librte_mbuf -Ilib/librte_mempool -I../lib/librte_mempool -Ilib/librte_ring -I../lib/librte_ring -Ilib/librte_meter -I../lib/librte_meter -Ilib/librte_hash -I../lib/librte_hash -fdiagnostics-color=always -pipe -D_FILE_OFFSET_BITS=64 -Wall -Winvalid-pch -Werror -O2 -g -include rte_config.h -Wextra -Wcast-qual -Wdeprecated -Wformat-nonliteral -Wformat-security -Wmissing-declarations -Wmissing-prototypes -Wnested-externs -Wold-style-definition -Wpointer-arith -Wsign-compare -Wstrict-prototypes -Wundef -Wwrite-strings -Wno-missing-field-initializers -Wno-pointer-to-int-cast -D_GNU_SOURCE -fPIC -march=nehalem -mavx2 -MD -MQ 'drivers/net/ice/6ab06a9@@ice_avx2_lib@sta/ice_rxtx_vec_avx2.c.o' -MF 'drivers/net/ice/6ab06a9@@ice_avx2_lib@sta/ice_rxtx_vec_avx2.c.o.d' -o 'drivers/net/ice/6ab06a9@@ice_avx2_lib@sta/ice_rxtx_vec_avx2.c.o' -c ../drivers/net/ice/ice_rxtx_vec_avx2.c
In file included from ../lib/librte_eal/common/include/rte_trace.h:577:0,
                 from ../lib/librte_mempool/rte_trace_mempool_fp.h:18,
                 from ../lib/librte_mempool/rte_mempool.h:54,
                 from ../lib/librte_mbuf/rte_mbuf.h:38,
--
[556/2016] Generating symbol file 'drivers/a715181@@rte_bus_fslmc@sha/librte_bus_fslmc.so.20.0.2.symbols'.
[557/2016] Compiling C object 'drivers/a715181@@tmp_rte_bus_pci@sta/bus_pci_linux_pci.c.o'.
[558/2016] Compiling C object 'drivers/a715181@@tmp_rte_pmd_ice@sta/net_ice_ice_rxtx.c.o'.
[559/2016] Compiling C object 'drivers/a715181@@tmp_rte_pmd_octeontx2@sta/net_octeontx2_otx2_rx.c.o'.
[560/2016] Compiling C object 'lib/76b5a35@@rte_pipeline@sta/librte_pipeline_rte_table_action.c.o'.
ninja: build stopped: subcommand failed.
DESTDIR=/root/UB1604-32_K4.4.0_GCC5.4.0/i686-native-linuxapp-gcc/ea1ff453ea3a4b0f9c4d55201462e9d6/dpdk/build-x86-default/install ninja -C /root/UB1604-32_K4.4.0_GCC5.4.0/i686-native-linuxapp-gcc/ea1ff453ea3a4b0f9c4d55201462e9d6/dpdk/build-x86-default install >/dev/null
find: ‘/root/UB1604-32_K4.4.0_GCC5.4.0/i686-native-linuxapp-gcc/ea1ff453ea3a4b0f9c4d55201462e9d6/dpdk/build-x86-default/install’: No such file or directory
dirname: missing operand
Try 'dirname --help' for more information.


*Meson Build Failed #2:
OS: CENTOS77-64
Target:./build-gcc-static
[995/2255] Generating rte_pmd_hns3_def with a custom command.
[996/2255] Compiling C object 'drivers/a715181@@tmp_rte_pmd_hns3@sta/net_hns3_hns3_dcb.c.o'.
[997/2255] Compiling C object 'drivers/a715181@@tmp_rte_pmd_hns3@sta/net_hns3_hns3_rss.c.o'.
[998/2255] Compiling C object 'drivers/a715181@@tmp_rte_pmd_hns3@sta/net_hns3_hns3_mp.c.o'.
[999/2255] Compiling C object 'drivers/net/iavf/cd88e11@@iavf_avx2_lib@sta/iavf_rxtx_vec_avx2.c.o'.
FAILED: drivers/net/iavf/cd88e11@@iavf_avx2_lib@sta/iavf_rxtx_vec_avx2.c.o 
clang -Idrivers/net/iavf/cd88e11@@iavf_avx2_lib@sta -Idrivers/net/iavf -I../drivers/net/iavf -Idrivers/net/iavf/../../common/iavf -I../drivers/net/iavf/../../common/iavf -Ilib/librte_ethdev -I../lib/librte_ethdev -I. -I../ -Iconfig -I../config -Ilib/librte_eal/common/include -I../lib/librte_eal/common/include -I../lib/librte_eal/linux/eal/include -Ilib/librte_eal/common -I../lib/librte_eal/common -Ilib/librte_eal/common/include/arch/x86 -I../lib/librte_eal/common/include/arch/x86 -Ilib/librte_eal -I../lib/librte_eal -Ilib/librte_kvargs -I../lib/librte_kvargs -Ilib/librte_net -I../lib/librte_net -Ilib/librte_mbuf -I../lib/librte_mbuf -Ilib/librte_mempool -I../lib/librte_mempool -Ilib/librte_ring -I../lib/librte_ring -Ilib/librte_meter -I../lib/librte_meter -Ilib/librte_hash -I../lib/librte_hash -Xclang -fcolor-diagnostics -pipe -D_FILE_OFFSET_BITS=64 -Wall -Winvalid-pch -Werror -O2 -g -include rte_config.h -Wextra -Wcast-qual -Wdeprecated -Wformat-nonliteral -Wformat-security -Wmissing-declarations -Wmissing-prototypes -Wnested-externs -Wold-style-definition -Wpointer-arith -Wsign-compare -Wstrict-prototypes -Wundef -Wwrite-strings -Wno-missing-field-initializers -D_GNU_SOURCE -fPIC -march=native -msse4 -Wno-strict-aliasing -DCC_AVX2_SUPPORT -mavx2 -MD -MQ 'drivers/net/iavf/cd88e11@@iavf_avx2_lib@sta/iavf_rxtx_vec_avx2.c.o' -MF 'drivers/net/iavf/cd88e11@@iavf_avx2_lib@sta/iavf_rxtx_vec_avx2.c.o.d' -o 'drivers/net/iavf/cd88e11@@iavf_avx2_lib@sta/iavf_rxtx_vec_avx2.c.o' -c ../drivers/net/iavf/iavf_rxtx_vec_avx2.c
In file included from ../drivers/net/iavf/iavf_rxtx_vec_avx2.c:5:
In file included from ../drivers/net/iavf/iavf_rxtx_vec_common.h:8:
In file included from ../lib/librte_ethdev/rte_ethdev_driver.h:18:
In file included from ../lib/librte_ethdev/rte_ethdev.h:159:
--
[1004/2255] Compiling C object 'drivers/a715181@@tmp_rte_pmd_iavf@sta/net_iavf_iavf_ethdev.c.o'.
[1005/2255] Compiling C object 'drivers/a715181@@tmp_rte_pmd_iavf@sta/net_iavf_iavf_rxtx.c.o'.
[1006/2255] Compiling C object 'drivers/a715181@@tmp_rte_pmd_iavf@sta/net_iavf_iavf_vchnl.c.o'.
[1007/2255] Compiling C object 'drivers/a715181@@tmp_rte_pmd_iavf@sta/net_iavf_iavf_rxtx_vec_sse.c.o'.
[1008/2255] Compiling C object 'lib/76b5a35@@rte_pipeline@sta/librte_pipeline_rte_table_action.c.o'.
ninja: build stopped: subcommand failed.
meson  --werror -Dexamples=all --buildtype=debugoptimized --default-library=shared /root/CENTOS77-64_K3.10.0_GCC4.8.5/x86_64-native-linuxapp-gcc/ea1ff453ea3a4b0f9c4d55201462e9d6/dpdk/devtools/.. ./build-clang-shared
The Meson build system
Version: 0.53.1
Source dir: /root/CENTOS77-64_K3.10.0_GCC4.8.5/x86_64-native-linuxapp-gcc/ea1ff453ea3a4b0f9c4d55201462e9d6/dpdk
Build dir: /root/CENTOS77-64_K3.10.0_GCC4.8.5/x86_64-native-linuxapp-gcc/ea1ff453ea3a4b0f9c4d55201462e9d6/dpdk/build-clang-shared
--
[1017/2283] Compiling C object 'drivers/a715181@@tmp_rte_pmd_hns3@sta/net_hns3_hns3_flow.c.o'.
[1018/2283] Compiling C object 'drivers/a715181@@tmp_rte_pmd_hns3@sta/net_hns3_hns3_mbx.c.o'.
[1019/2283] Generating rte_pmd_hns3_def with a custom command.
[1020/2283] Compiling C object 'drivers/a715181@@tmp_rte_pmd_hns3@sta/net_hns3_hns3_mp.c.o'.
[1021/2283] Compiling C object 'drivers/net/iavf/cd88e11@@iavf_avx2_lib@sta/iavf_rxtx_vec_avx2.c.o'.
FAILED: drivers/net/iavf/cd88e11@@iavf_avx2_lib@sta/iavf_rxtx_vec_avx2.c.o 
clang -Idrivers/net/iavf/cd88e11@@iavf_avx2_lib@sta -Idrivers/net/iavf -I../drivers/net/iavf -Idrivers/net/iavf/../../common/iavf -I../drivers/net/iavf/../../common/iavf -Ilib/librte_ethdev -I../lib/librte_ethdev -I. -I../ -Iconfig -I../config -Ilib/librte_eal/common/include -I../lib/librte_eal/common/include -I../lib/librte_eal/linux/eal/include -Ilib/librte_eal/common -I../lib/librte_eal/common -Ilib/librte_eal/common/include/arch/x86 -I../lib/librte_eal/common/include/arch/x86 -Ilib/librte_eal -I../lib/librte_eal -Ilib/librte_kvargs -I../lib/librte_kvargs -Ilib/librte_net -I../lib/librte_net -Ilib/librte_mbuf -I../lib/librte_mbuf -Ilib/librte_mempool -I../lib/librte_mempool -Ilib/librte_ring -I../lib/librte_ring -Ilib/librte_meter -I../lib/librte_meter -Ilib/librte_hash -I../lib/librte_hash -Xclang -fcolor-diagnostics -pipe -D_FILE_OFFSET_BITS=64 -Wall -Winvalid-pch -Werror -O2 -g -include rte_config.h -Wextra -Wcast-qual -Wdeprecated -Wformat-nonliteral -Wformat-security -Wmissing-declarations -Wmissing-prototypes -Wnested-externs -Wold-style-definition -Wpointer-arith -Wsign-compare -Wstrict-prototypes -Wundef -Wwrite-strings -Wno-missing-field-initializers -D_GNU_SOURCE -fPIC -march=native -msse4 -Wno-strict-aliasing -DCC_AVX2_SUPPORT -mavx2 -MD -MQ 'drivers/net/iavf/cd88e11@@iavf_avx2_lib@sta/iavf_rxtx_vec_avx2.c.o' -MF 'drivers/net/iavf/cd88e11@@iavf_avx2_lib@sta/iavf_rxtx_vec_avx2.c.o.d' -o 'drivers/net/iavf/cd88e11@@iavf_avx2_lib@sta/iavf_rxtx_vec_avx2.c.o' -c ../drivers/net/iavf/iavf_rxtx_vec_avx2.c
In file included from ../drivers/net/iavf/iavf_rxtx_vec_avx2.c:5:
In file included from ../drivers/net/iavf/iavf_rxtx_vec_common.h:8:
In file included from ../lib/librte_ethdev/rte_ethdev_driver.h:18:
In file included from ../lib/librte_ethdev/rte_ethdev.h:159:
--
[1026/2283] Compiling C object 'drivers/a715181@@tmp_rte_pmd_iavf@sta/net_iavf_iavf_ethdev.c.o'.
[1027/2283] Compiling C object 'drivers/a715181@@tmp_rte_pmd_hns3@sta/net_hns3_hns3_rxtx.c.o'.
[1028/2283] Compiling C object 'drivers/a715181@@tmp_rte_pmd_iavf@sta/net_iavf_iavf_vchnl.c.o'.
[1029/2283] Compiling C object 'drivers/a715181@@tmp_rte_pmd_iavf@sta/net_iavf_iavf_rxtx_vec_sse.c.o'.
[1030/2283] Compiling C object 'lib/76b5a35@@rte_pipeline@sta/librte_pipeline_rte_table_action.c.o'.
ninja: build stopped: subcommand failed.
meson  --werror -Dexamples=all --buildtype=debugoptimized -Dlibdir=lib -Dmachine=corei7 --default-library=shared /root/CENTOS77-64_K3.10.0_GCC4.8.5/x86_64-native-linuxapp-gcc/ea1ff453ea3a4b0f9c4d55201462e9d6/dpdk/devtools/.. ./build-x86-default
The Meson build system
Version: 0.53.1
Source dir: /root/CENTOS77-64_K3.10.0_GCC4.8.5/x86_64-native-linuxapp-gcc/ea1ff453ea3a4b0f9c4d55201462e9d6/dpdk
Build dir: /root/CENTOS77-64_K3.10.0_GCC4.8.5/x86_64-native-linuxapp-gcc/ea1ff453ea3a4b0f9c4d55201462e9d6/dpdk/build-x86-default
--
[1014/2283] Compiling C object 'drivers/a715181@@tmp_rte_pmd_hns3@sta/net_hns3_hns3_mbx.c.o'.
[1015/2283] Compiling C object 'drivers/a715181@@tmp_rte_pmd_i40e@sta/net_i40e_i40e_rxtx.c.o'.
[1016/2283] Compiling C object 'drivers/a715181@@tmp_rte_pmd_hns3@sta/net_hns3_hns3_regs.c.o'.
[1017/2283] Generating rte_pmd_hns3_def with a custom command.
[1018/2283] Compiling C object 'drivers/net/iavf/cd88e11@@iavf_avx2_lib@sta/iavf_rxtx_vec_avx2.c.o'.
FAILED: drivers/net/iavf/cd88e11@@iavf_avx2_lib@sta/iavf_rxtx_vec_avx2.c.o 
cc -Idrivers/net/iavf/cd88e11@@iavf_avx2_lib@sta -Idrivers/net/iavf -I../drivers/net/iavf -Idrivers/net/iavf/../../common/iavf -I../drivers/net/iavf/../../common/iavf -Ilib/librte_ethdev -I../lib/librte_ethdev -I. -I../ -Iconfig -I../config -Ilib/librte_eal/common/include -I../lib/librte_eal/common/include -I../lib/librte_eal/linux/eal/include -Ilib/librte_eal/common -I../lib/librte_eal/common -Ilib/librte_eal/common/include/arch/x86 -I../lib/librte_eal/common/include/arch/x86 -Ilib/librte_eal -I../lib/librte_eal -Ilib/librte_kvargs -I../lib/librte_kvargs -Ilib/librte_net -I../lib/librte_net -Ilib/librte_mbuf -I../lib/librte_mbuf -Ilib/librte_mempool -I../lib/librte_mempool -Ilib/librte_ring -I../lib/librte_ring -Ilib/librte_meter -I../lib/librte_meter -Ilib/librte_hash -I../lib/librte_hash -pipe -D_FILE_OFFSET_BITS=64 -Wall -Winvalid-pch -Werror -O2 -g -include rte_config.h -Wextra -Wcast-qual -Wdeprecated -Wformat-nonliteral -Wformat-security -Wmissing-declarations -Wmissing-prototypes -Wnested-externs -Wold-style-definition -Wpointer-arith -Wsign-compare -Wstrict-prototypes -Wundef -Wwrite-strings -Wno-missing-field-initializers -D_GNU_SOURCE -fPIC -march=corei7 -Wno-strict-aliasing -DCC_AVX2_SUPPORT -mavx2 -MD -MQ 'drivers/net/iavf/cd88e11@@iavf_avx2_lib@sta/iavf_rxtx_vec_avx2.c.o' -MF 'drivers/net/iavf/cd88e11@@iavf_avx2_lib@sta/iavf_rxtx_vec_avx2.c.o.d' -o 'drivers/net/iavf/cd88e11@@iavf_avx2_lib@sta/iavf_rxtx_vec_avx2.c.o' -c ../drivers/net/iavf/iavf_rxtx_vec_avx2.c
In file included from ../lib/librte_eal/common/include/rte_trace.h:577:0,
                 from ../lib/librte_mempool/rte_trace_mempool_fp.h:18,
                 from ../lib/librte_mempool/rte_mempool.h:54,
                 from ../lib/librte_mbuf/rte_mbuf.h:38,
--
[1023/2283] Compiling C object 'drivers/a715181@@tmp_rte_pmd_hns3@sta/net_hns3_hns3_stats.c.o'.
[1024/2283] Compiling C object 'drivers/a715181@@tmp_rte_pmd_i40e@sta/net_i40e_i40e_rxtx_vec_sse.c.o'.
[1025/2283] Compiling C object 'drivers/a715181@@tmp_rte_pmd_hns3@sta/net_hns3_hns3_rxtx.c.o'.
[1026/2283] Compiling C object 'drivers/a715181@@tmp_rte_pmd_ccp@sta/crypto_ccp_ccp_crypto.c.o'.
[1027/2283] Compiling C object 'lib/76b5a35@@rte_pipeline@sta/librte_pipeline_rte_table_action.c.o'.
ninja: build stopped: subcommand failed.
DESTDIR=/root/CENTOS77-64_K3.10.0_GCC4.8.5/x86_64-native-linuxapp-gcc/ea1ff453ea3a4b0f9c4d55201462e9d6/dpdk/build-x86-default/install ninja -C /root/CENTOS77-64_K3.10.0_GCC4.8.5/x86_64-native-linuxapp-gcc/ea1ff453ea3a4b0f9c4d55201462e9d6/dpdk/build-x86-default install >/dev/null
find: ‘/root/CENTOS77-64_K3.10.0_GCC4.8.5/x86_64-native-linuxapp-gcc/ea1ff453ea3a4b0f9c4d55201462e9d6/dpdk/build-x86-default/install’: No such file or directory
dirname: missing operand
Try 'dirname --help' for more information.


*Meson Build Failed #3:
OS: FC31-64
Target:./build-gcc-static
[1040/2292] Compiling C object 'drivers/a715181@@tmp_rte_pmd_iavf@sta/net_iavf_iavf_ethdev.c.o'.
[1041/2292] Compiling C object 'drivers/a715181@@tmp_rte_pmd_iavf@sta/net_iavf_iavf_rxtx.c.o'.
[1042/2292] Generating rte_pmd_hns3.exp_chk with a meson_exe.py custom command.
[1043/2292] Linking target drivers/librte_pmd_hns3.so.20.0.2.
[1044/2292] Compiling C object 'drivers/net/iavf/cd88e11@@iavf_avx2_lib@sta/iavf_rxtx_vec_avx2.c.o'.
FAILED: drivers/net/iavf/cd88e11@@iavf_avx2_lib@sta/iavf_rxtx_vec_avx2.c.o 
cc -Idrivers/net/iavf/cd88e11@@iavf_avx2_lib@sta -Idrivers/net/iavf -I../drivers/net/iavf -Idrivers/net/iavf/../../common/iavf -I../drivers/net/iavf/../../common/iavf -Ilib/librte_ethdev -I../lib/librte_ethdev -I. -I../ -Iconfig -I../config -Ilib/librte_eal/common/include -I../lib/librte_eal/common/include -I../lib/librte_eal/linux/eal/include -Ilib/librte_eal/common -I../lib/librte_eal/common -Ilib/librte_eal/common/include/arch/x86 -I../lib/librte_eal/common/include/arch/x86 -Ilib/librte_eal -I../lib/librte_eal -Ilib/librte_kvargs -I../lib/librte_kvargs -Ilib/librte_net -I../lib/librte_net -Ilib/librte_mbuf -I../lib/librte_mbuf -Ilib/librte_mempool -I../lib/librte_mempool -Ilib/librte_ring -I../lib/librte_ring -Ilib/librte_meter -I../lib/librte_meter -Ilib/librte_hash -I../lib/librte_hash -fdiagnostics-color=always -pipe -D_FILE_OFFSET_BITS=64 -Wall -Winvalid-pch -Werror -O2 -g -include rte_config.h -Wextra -Wcast-qual -Wdeprecated -Wformat-nonliteral -Wformat-security -Wmissing-declarations -Wmissing-prototypes -Wnested-externs -Wold-style-definition -Wpointer-arith -Wsign-compare -Wstrict-prototypes -Wundef -Wwrite-strings -Wno-address-of-packed-member -Wno-packed-not-aligned -Wno-missing-field-initializers -D_GNU_SOURCE -fPIC -march=nehalem -Wno-format-truncation -Wno-strict-aliasing -DCC_AVX2_SUPPORT -mavx2 -MD -MQ 'drivers/net/iavf/cd88e11@@iavf_avx2_lib@sta/iavf_rxtx_vec_avx2.c.o' -MF 'drivers/net/iavf/cd88e11@@iavf_avx2_lib@sta/iavf_rxtx_vec_avx2.c.o.d' -o 'drivers/net/iavf/cd88e11@@iavf_avx2_lib@sta/iavf_rxtx_vec_avx2.c.o' -c ../drivers/net/iavf/iavf_rxtx_vec_avx2.c
In file included from ../lib/librte_eal/common/include/rte_trace.h:577,
                 from ../lib/librte_mempool/rte_trace_mempool_fp.h:18,
                 from ../lib/librte_mempool/rte_mempool.h:54,
                 from ../lib/librte_mbuf/rte_mbuf.h:38,
--
[1050/2292] Compiling C object 'drivers/net/ice/base/39545a2@@ice_base@sta/ice_controlq.c.o'.
[1051/2292] Compiling C object 'drivers/net/ice/base/39545a2@@ice_base@sta/ice_flow.c.o'.
[1052/2292] Compiling C object 'drivers/net/ice/base/39545a2@@ice_base@sta/ice_flex_pipe.c.o'.
[1053/2292] Compiling C object 'drivers/net/ice/base/39545a2@@ice_base@sta/ice_switch.c.o'.
[1054/2292] Compiling C object 'drivers/net/ice/6ab06a9@@ice_avx2_lib@sta/ice_rxtx_vec_avx2.c.o'.
FAILED: drivers/net/ice/6ab06a9@@ice_avx2_lib@sta/ice_rxtx_vec_avx2.c.o 
cc -Idrivers/net/ice/6ab06a9@@ice_avx2_lib@sta -Idrivers/net/ice -I../drivers/net/ice -Idrivers/net/ice/base -I../drivers/net/ice/base -Ilib/librte_ethdev -I../lib/librte_ethdev -I. -I../ -Iconfig -I../config -Ilib/librte_eal/common/include -I../lib/librte_eal/common/include -I../lib/librte_eal/linux/eal/include -Ilib/librte_eal/common -I../lib/librte_eal/common -Ilib/librte_eal/common/include/arch/x86 -I../lib/librte_eal/common/include/arch/x86 -Ilib/librte_eal -I../lib/librte_eal -Ilib/librte_kvargs -I../lib/librte_kvargs -Ilib/librte_net -I../lib/librte_net -Ilib/librte_mbuf -I../lib/librte_mbuf -Ilib/librte_mempool -I../lib/librte_mempool -Ilib/librte_ring -I../lib/librte_ring -Ilib/librte_meter -I../lib/librte_meter -Ilib/librte_hash -I../lib/librte_hash -fdiagnostics-color=always -pipe -D_FILE_OFFSET_BITS=64 -Wall -Winvalid-pch -Werror -O2 -g -include rte_config.h -Wextra -Wcast-qual -Wdeprecated -Wformat-nonliteral -Wformat-security -Wmissing-declarations -Wmissing-prototypes -Wnested-externs -Wold-style-definition -Wpointer-arith -Wsign-compare -Wstrict-prototypes -Wundef -Wwrite-strings -Wno-address-of-packed-member -Wno-packed-not-aligned -Wno-missing-field-initializers -D_GNU_SOURCE -fPIC -march=nehalem -Wno-format-truncation -mavx2 -MD -MQ 'drivers/net/ice/6ab06a9@@ice_avx2_lib@sta/ice_rxtx_vec_avx2.c.o' -MF 'drivers/net/ice/6ab06a9@@ice_avx2_lib@sta/ice_rxtx_vec_avx2.c.o.d' -o 'drivers/net/ice/6ab06a9@@ice_avx2_lib@sta/ice_rxtx_vec_avx2.c.o' -c ../drivers/net/ice/ice_rxtx_vec_avx2.c
In file included from ../lib/librte_eal/common/include/rte_trace.h:577,
                 from ../lib/librte_mempool/rte_trace_mempool_fp.h:18,
                 from ../lib/librte_mempool/rte_mempool.h:54,
                 from ../lib/librte_mbuf/rte_mbuf.h:38,
--
../lib/librte_eal/common/include/rte_trace.h:531:6: note: declared here
  531 | void __rte_trace_mem_per_thread_alloc(void);
      |      ^~~~~~~~~~~~~~~~~~~~~~~~~~~~~~~~
cc1: all warnings being treated as errors
[1055/2292] Compiling C object 'lib/76b5a35@@rte_pipeline@sta/librte_pipeline_rte_table_action.c.o'.
ninja: build stopped: subcommand failed.
DESTDIR=/root/FC31-64_K5.3.14_GCC9.2.1/x86_64-native-linuxapp-gcc/ea1ff453ea3a4b0f9c4d55201462e9d6/dpdk/build-x86-default/install ninja -C /root/FC31-64_K5.3.14_GCC9.2.1/x86_64-native-linuxapp-gcc/ea1ff453ea3a4b0f9c4d55201462e9d6/dpdk/build-x86-default install >/dev/null
find: ‘/root/FC31-64_K5.3.14_GCC9.2.1/x86_64-native-linuxapp-gcc/ea1ff453ea3a4b0f9c4d55201462e9d6/dpdk/build-x86-default/install’: No such file or directory
dirname: missing operand
Try 'dirname --help' for more information.


*Meson Build Failed #4:
OS: UB1804-64
Target:./build-gcc-static
[1035/2205] Compiling C object 'drivers/a715181@@rte_pmd_hns3@sta/meson-generated_.._rte_pmd_hns3.pmd.c.o'.
[1036/2205] Compiling C object 'drivers/a715181@@rte_pmd_hns3@sha/meson-generated_.._rte_pmd_hns3.pmd.c.o'.
[1037/2205] Linking static target drivers/librte_pmd_hinic.a.
[1038/2205] Linking static target drivers/librte_pmd_hns3.a.
[1039/2205] Compiling C object 'drivers/net/iavf/cd88e11@@iavf_avx2_lib@sta/iavf_rxtx_vec_avx2.c.o'.
FAILED: drivers/net/iavf/cd88e11@@iavf_avx2_lib@sta/iavf_rxtx_vec_avx2.c.o 
cc -Idrivers/net/iavf/cd88e11@@iavf_avx2_lib@sta -Idrivers/net/iavf -I../drivers/net/iavf -Idrivers/net/iavf/../../common/iavf -I../drivers/net/iavf/../../common/iavf -Ilib/librte_ethdev -I../lib/librte_ethdev -I. -I../ -Iconfig -I../config -Ilib/librte_eal/common/include -I../lib/librte_eal/common/include -I../lib/librte_eal/linux/eal/include -Ilib/librte_eal/common -I../lib/librte_eal/common -Ilib/librte_eal/common/include/arch/x86 -I../lib/librte_eal/common/include/arch/x86 -Ilib/librte_eal -I../lib/librte_eal -Ilib/librte_kvargs -I../lib/librte_kvargs -Ilib/librte_net -I../lib/librte_net -Ilib/librte_mbuf -I../lib/librte_mbuf -Ilib/librte_mempool -I../lib/librte_mempool -Ilib/librte_ring -I../lib/librte_ring -Ilib/librte_meter -I../lib/librte_meter -Ilib/librte_hash -I../lib/librte_hash -fdiagnostics-color=always -pipe -D_FILE_OFFSET_BITS=64 -Wall -Winvalid-pch -Werror -O2 -g -include rte_config.h -Wextra -Wcast-qual -Wdeprecated -Wformat-nonliteral -Wformat-security -Wmissing-declarations -Wmissing-prototypes -Wnested-externs -Wold-style-definition -Wpointer-arith -Wsign-compare -Wstrict-prototypes -Wundef -Wwrite-strings -Wno-missing-field-initializers -D_GNU_SOURCE -fPIC -march=nehalem -mno-avx512f -Wno-format-truncation -Wno-strict-aliasing -DCC_AVX2_SUPPORT -mavx2 -MD -MQ 'drivers/net/iavf/cd88e11@@iavf_avx2_lib@sta/iavf_rxtx_vec_avx2.c.o' -MF 'drivers/net/iavf/cd88e11@@iavf_avx2_lib@sta/iavf_rxtx_vec_avx2.c.o.d' -o 'drivers/net/iavf/cd88e11@@iavf_avx2_lib@sta/iavf_rxtx_vec_avx2.c.o' -c ../drivers/net/iavf/iavf_rxtx_vec_avx2.c
In file included from ../lib/librte_eal/common/include/rte_trace.h:577:0,
                 from ../lib/librte_mempool/rte_trace_mempool_fp.h:18,
                 from ../lib/librte_mempool/rte_mempool.h:54,
                 from ../lib/librte_mbuf/rte_mbuf.h:38,
--
[1044/2205] Compiling C object 'drivers/net/ice/base/39545a2@@ice_base@sta/ice_flex_pipe.c.o'.
[1045/2205] Compiling C object 'drivers/net/ice/base/39545a2@@ice_base@sta/ice_sched.c.o'.
[1046/2205] Compiling C object 'drivers/net/ice/base/39545a2@@ice_base@sta/ice_common.c.o'.
[1047/2205] Compiling C object 'drivers/net/ice/base/39545a2@@ice_base@sta/ice_switch.c.o'.
[1048/2205] Compiling C object 'lib/76b5a35@@rte_pipeline@sta/librte_pipeline_rte_table_action.c.o'.
ninja: build stopped: subcommand failed.
DESTDIR=/root/UB1804-64_K4.15.0_GCC7.3.0/x86_64-native-linuxapp-gcc/ea1ff453ea3a4b0f9c4d55201462e9d6/dpdk/build-x86-default/install ninja -C /root/UB1804-64_K4.15.0_GCC7.3.0/x86_64-native-linuxapp-gcc/ea1ff453ea3a4b0f9c4d55201462e9d6/dpdk/build-x86-default install >/dev/null
find: ‘/root/UB1804-64_K4.15.0_GCC7.3.0/x86_64-native-linuxapp-gcc/ea1ff453ea3a4b0f9c4d55201462e9d6/dpdk/build-x86-default/install’: No such file or directory
dirname: missing operand
Try 'dirname --help' for more information.


*Meson Build Failed #5:
OS: FreeBSD1201-64
Target:./build-gcc-static
FAILED: lib/76b5a35@@rte_eal@sta/librte_eal_freebsd_eal_eal_interrupts.c.o 
gcc -Ilib/76b5a35@@rte_eal@sta -Ilib -I../lib -I. -I../ -Iconfig -I../config -Ilib/librte_eal/common/include -I../lib/librte_eal/common/include -I../lib/librte_eal/freebsd/eal/include -Ilib/librte_eal/common -I../lib/librte_eal/common -Ilib/librte_eal/common/include/arch/x86 -I../lib/librte_eal/common/include/arch/x86 -Ilib/librte_eal -I../lib/librte_eal -Ilib/librte_kvargs -I../lib/librte_kvargs -fdiagnostics-color=always -pipe -D_FILE_OFFSET_BITS=64 -Wall -Winvalid-pch -Werror -O2 -g -include rte_config.h -Wextra -Wcast-qual -Wdeprecated -Wformat-nonliteral -Wformat-security -Wmissing-declarations -Wmissing-prototypes -Wnested-externs -Wold-style-definition -Wpointer-arith -Wsign-compare -Wstrict-prototypes -Wundef -Wwrite-strings -Wno-address-of-packed-member -Wno-packed-not-aligned -Wno-missing-field-initializers -D_GNU_SOURCE -D__BSD_VISIBLE -fPIC -march=native -Wno-format-truncation -DRTE_LIBEAL_USE_GETENTROPY -DHAVE_GETOPT_H -DHAVE_GETOPT -DHAVE_GETOPT_LONG -DALLOW_EXPERIMENTAL_API -MD -MQ 'lib/76b5a35@@rte_eal@sta/librte_eal_freebsd_eal_eal_interrupts.c.o' -MF 'lib/76b5a35@@rte_eal@sta/librte_eal_freebsd_eal_eal_interrupts.c.o.d' -o 'lib/76b5a35@@rte_eal@sta/librte_eal_freebsd_eal_eal_interrupts.c.o' -c ../lib/librte_eal/freebsd/eal/eal_interrupts.c
../lib/librte_eal/freebsd/eal/eal_interrupts.c: In function 'rte_intr_callback_register':
../lib/librte_eal/freebsd/eal/eal_interrupts.c:89:6: error: 'ret' may be used uninitialized in this function [-Werror=maybe-uninitialized]
   89 |  int ret, add_event = 0;
      |      ^~~
cc1: all warnings being treated as errors
[59/1651] Compiling C object 'lib/76b5a35@@rte_eal@sta/librte_eal_common_malloc_heap.c.o'.
[60/1651] Compiling C object 'lib/76b5a35@@rte_ring@sta/librte_ring_rte_ring.c.o'.
[61/1651] Compiling C object 'lib/76b5a35@@rte_eal@sta/librte_eal_freebsd_eal_eal_memory.c.o'.
[62/1651] Compiling C object 'lib/76b5a35@@rte_eal@sta/librte_eal_common_rte_malloc.c.o'.
[63/1651] Compiling C object 'lib/76b5a35@@rte_eal@sta/librte_eal_freebsd_eal_eal.c.o'.
[64/1651] Compiling C object 'lib/76b5a35@@rte_eal@sta/librte_eal_common_eal_common_options.c.o'.
[65/1651] Compiling C object 'lib/76b5a35@@rte_mempool@sta/librte_mempool_rte_mempool_ops_default.c.o'.
[66/1651] Compiling C object 'lib/76b5a35@@rte_mempool@sta/librte_mempool_rte_mempool_ops.c.o'.
[67/1651] Compiling C object 'lib/76b5a35@@rte_mempool@sta/librte_mempool_rte_mempool.c.o'.
ninja: build stopped: subcommand failed




*Meson Build Failed #6:
OS: SUSE15-64
Target:./build-gcc-static
[1037/2195] Compiling C object 'drivers/a715181@@rte_pmd_hns3@sha/meson-generated_.._rte_pmd_hns3.pmd.c.o'.
[1038/2195] Compiling C object 'drivers/a715181@@tmp_rte_pmd_iavf@sta/net_iavf_iavf_ethdev.c.o'.
[1039/2195] Linking target drivers/librte_pmd_hns3.so.20.0.2.
[1040/2195] Compiling C object 'drivers/a715181@@tmp_rte_pmd_iavf@sta/net_iavf_iavf_rxtx.c.o'.
[1041/2195] Compiling C object 'drivers/net/iavf/cd88e11@@iavf_avx2_lib@sta/iavf_rxtx_vec_avx2.c.o'.
FAILED: drivers/net/iavf/cd88e11@@iavf_avx2_lib@sta/iavf_rxtx_vec_avx2.c.o 
cc -Idrivers/net/iavf/cd88e11@@iavf_avx2_lib@sta -Idrivers/net/iavf -I../drivers/net/iavf -Idrivers/net/iavf/../../common/iavf -I../drivers/net/iavf/../../common/iavf -Ilib/librte_ethdev -I../lib/librte_ethdev -I. -I../ -Iconfig -I../config -Ilib/librte_eal/common/include -I../lib/librte_eal/common/include -I../lib/librte_eal/linux/eal/include -Ilib/librte_eal/common -I../lib/librte_eal/common -Ilib/librte_eal/common/include/arch/x86 -I../lib/librte_eal/common/include/arch/x86 -Ilib/librte_eal -I../lib/librte_eal -Ilib/librte_kvargs -I../lib/librte_kvargs -Ilib/librte_net -I../lib/librte_net -Ilib/librte_mbuf -I../lib/librte_mbuf -Ilib/librte_mempool -I../lib/librte_mempool -Ilib/librte_ring -I../lib/librte_ring -Ilib/librte_meter -I../lib/librte_meter -Ilib/librte_hash -I../lib/librte_hash -fdiagnostics-color=always -pipe -D_FILE_OFFSET_BITS=64 -Wall -Winvalid-pch -Werror -O2 -g -include rte_config.h -Wextra -Wcast-qual -Wdeprecated -Wformat-nonliteral -Wformat-security -Wmissing-declarations -Wmissing-prototypes -Wnested-externs -Wold-style-definition -Wpointer-arith -Wsign-compare -Wstrict-prototypes -Wundef -Wwrite-strings -Wno-missing-field-initializers -D_GNU_SOURCE -fPIC -march=nehalem -Wno-format-truncation -Wno-strict-aliasing -DCC_AVX2_SUPPORT -mavx2 -MD -MQ 'drivers/net/iavf/cd88e11@@iavf_avx2_lib@sta/iavf_rxtx_vec_avx2.c.o' -MF 'drivers/net/iavf/cd88e11@@iavf_avx2_lib@sta/iavf_rxtx_vec_avx2.c.o.d' -o 'drivers/net/iavf/cd88e11@@iavf_avx2_lib@sta/iavf_rxtx_vec_avx2.c.o' -c ../drivers/net/iavf/iavf_rxtx_vec_avx2.c
In file included from ../lib/librte_eal/common/include/rte_trace.h:577:0,
                 from ../lib/librte_mempool/rte_trace_mempool_fp.h:18,
                 from ../lib/librte_mempool/rte_mempool.h:54,
                 from ../lib/librte_mbuf/rte_mbuf.h:38,
--
[1046/2195] Compiling C object 'drivers/net/ice/base/39545a2@@ice_base@sta/ice_controlq.c.o'.
[1047/2195] Compiling C object 'drivers/net/ice/base/39545a2@@ice_base@sta/ice_common.c.o'.
[1048/2195] Compiling C object 'drivers/net/ice/base/39545a2@@ice_base@sta/ice_flow.c.o'.
[1049/2195] Compiling C object 'app/test/3062f5d@@dpdk-test@exe/test_memcpy_perf.c.o'.
[1050/2195] Compiling C object 'lib/76b5a35@@rte_pipeline@sta/librte_pipeline_rte_table_action.c.o'.
ninja: build stopped: subcommand failed.
DESTDIR=/root/SUSE15-64_K4.12.14_GCC7.3.1/x86_64-native-linuxapp-gcc/ea1ff453ea3a4b0f9c4d55201462e9d6/dpdk/build-x86-default/install ninja -C /root/SUSE15-64_K4.12.14_GCC7.3.1/x86_64-native-linuxapp-gcc/ea1ff453ea3a4b0f9c4d55201462e9d6/dpdk/build-x86-default install >/dev/null
find: ‘/root/SUSE15-64_K4.12.14_GCC7.3.1/x86_64-native-linuxapp-gcc/ea1ff453ea3a4b0f9c4d55201462e9d6/dpdk/build-x86-default/install’: No such file or directory
dirname: missing operand
Try 'dirname --help' for more information.

DPDK STV team

^ permalink raw reply	[flat|nested] only message in thread

only message in thread, back to index

Thread overview: (only message) (download: mbox.gz / follow: Atom feed)
-- links below jump to the message on this page --
2020-03-26  1:42 [dpdk-test-report] |FAILURE| pw67143[v2, 28/32] ethdev: add tracepoints sys_stv

automatic DPDK test reports

Archives are clonable:
	git clone --mirror http://inbox.dpdk.org/test-report/0 test-report/git/0.git

	# If you have public-inbox 1.1+ installed, you may
	# initialize and index your mirror using the following commands:
	public-inbox-init -V2 test-report test-report/ http://inbox.dpdk.org/test-report \
		test-report@dpdk.org
	public-inbox-index test-report


Newsgroup available over NNTP:
	nntp://inbox.dpdk.org/inbox.dpdk.test-report


AGPL code for this site: git clone https://public-inbox.org/ public-inbox