automatic DPDK test reports
 help / color / mirror / Atom feed
* [dpdk-test-report] |FAILURE| pw70836net/octeontx2: fix dmac filtering
@ 2020-06-03 18:17 sys_stv
  0 siblings, 0 replies; only message in thread
From: sys_stv @ 2020-06-03 18:17 UTC (permalink / raw)
  To: test-report

[-- Attachment #1: Type: text/plain, Size: 12384 bytes --]

Test-Label: Intel-compilation
Test-Status: FAILURE
http://dpdk.org/patch/70836

_Compilation issues_

Submitter: Harman Kalra <hkalra@marvell.com>
Date: 2020-06-03 14:52:13
Reply_mail: 1591195933-16362-1-git-send-email-hkalra@marvell.com
DPDK git baseline: Repo:dpdk-next-net-mrvl, CommitID: 4eca8d0fa6a4e92011957dcd83c1149fdcf01431

Makefile build Summary: 23 Builds Done, 20 Successful, 3 Failures

Meson build Summary: 9 Builds Done, 9 Successful, 0 Failures

               +==============================================+===========+==========+
               |                   Makefile                   |   Meson   | Document |
+----------------+------+-------+------+------------+-----------+-----------+----------+
| os             | gcc  | clang | icc  | gcc+shared | gcc+debug | gcc/clang | pdf/html |
+----------------+------+-------+------+------------+-----------+-----------+----------+
| RHEL80-64      | pass |       |      |            |           |           |          |
| UB2004-64      | pass | pass  | FAIL |            |           | pass      |          |
| UB1804-64      | pass | pass  | FAIL |            |           | pass      | pass     |
| FC32-64        | pass | pass  |      |            |           |           |          |
| CENTOS77-64    | pass |       |      |            |           |           |          |
| WIN10-64       |      |       |      |            |           | pass      |          |
| CENTOS80-64    | pass | pass  | FAIL | pass       | pass      | pass      |          |
| FC31-64        |      |       |      |            |           | pass      |          |
| UB1804-32      | pass |       |      |            |           | pass      |          |
| FreeBSD1201-64 | pass | pass  |      | pass       | pass      | pass      |          |
| RHEL77-64      | pass |       |      |            |           |           |          |
| SUSE15-64      | pass | pass  |      |            |           | pass      |          |
+----------------+------+-------+------+------------+-----------+-----------+----------+

Test environment and configuration as below:

** Makefile build **


OS: UB2004-64
	Kernel Version: 5.4.0-26-generic
	CPU info: Intel(R) Xeon(R) Platinum 8180 CPU @ 2.50GHz
	GCC Version: gcc (Ubuntu 9.3.0-10ubuntu2) 9.3.0
	Clang Version: 10.0.0-4ubuntu1
	x86_64-native-linuxapp-clang
	x86_64-native-linuxapp-gcc
	x86_64-native-linuxapp-icc


OS: UB1804-64
	Kernel Version: 4.15.0-20-generic
	CPU info: Intel(R) Xeon(R) CPU E5-2699 v3 @ 2.30GHz
	GCC Version: gcc (Ubuntu 7.3.0-16ubuntu3) 7.3.0
	Clang Version: 6.0.0-1ubuntu2 (tags/RELEASE_600/final)
	x86_64-native-linuxapp-clang
	x86_64-native-linuxapp-gcc
	x86_64-native-linuxapp-icc


OS: FC32-64
	Kernel Version: 5.6.0-0.rc7.git0.2.fc32.x86_64
	CPU info: Intel(R) Xeon(R) CPU E5-2699 v4 @ 2.20GHz
	GCC Version: gcc (GCC) 10.0.1 20200311 (Red Hat 10.0.1-0.9)
	Clang Version: 10.0.0 (Fedora 10.0.0-0.3.rc4.fc32)
	x86_64-native-linuxapp-clang
	x86_64-native-linuxapp-gcc


OS: CENTOS77-64
	Kernel Version: 3.10.0-1062.9.1.el7.x86_64
	CPU info: Intel(R) Xeon(R) Platinum 8280M CPU @ 2.70GHz
	GCC Version: gcc (GCC) 4.8.5 20150623 (Red Hat 4.8.5-39)
	Clang Version: 3.4.2 (tags/RELEASE_34/dot2-final)
	x86_64-native-linuxapp-gcc


OS: CENTOS80-64
	Kernel Version: 4.18.0-80.11.2.el8_0.x86_64
	CPU info: Intel(R) Xeon(R) CPU E5-2699 v3 @ 2.30GHz
	GCC Version: gcc (GCC) 8.2.1 20180905 (Red Hat 8.2.1-3)
	Clang Version: 7.0.1 (tags/RELEASE_701/final)
	x86_64-native-linuxapp-clang
	x86_64-native-linuxapp-gcc
	x86_64-native-linuxapp-gcc+debug
	x86_64-native-linuxapp-gcc+shared
	x86_64-native-linuxapp-icc


OS: UB1804-32
	Kernel Version: 4.15.0-20-generic
	CPU info: Intel(R) Xeon(R) Platinum 8180 CPU @ 2.50GHz
	GCC Version: gcc (Ubuntu 7.5.0-3ubuntu1~18.04) 7.5.0
	Clang Version: 6.0.0-1ubuntu2 (tags/RELEASE_600/final)
	i686-native-linuxapp-gcc


OS: RHEL80-64
	Kernel Version: 4.18.0-80.el8.x86_64
	CPU info: Intel(R) Xeon(R) Platinum 8280M CPU @ 2.70GHz
	GCC Version: gcc (GCC) 8.2.1 20180905 (Red Hat 8.2.1-3)
	Clang Version: 6.0.1 (tags/RELEASE_601/final)
	x86_64-native-linuxapp-gcc


OS: FreeBSD1201-64
	Kernel Version: 12.1-RELEASE
	CPU info: Intel(R) Xeon(R) CPU E5-2699 v3 @ 2.30GHz (2294.74-MHz K8-class CPU)
	GCC Version: gcc (FreeBSD Ports Collection) 9.2.0
	Clang Version: 8.0.1 (tags/RELEASE_801/final 366581) (based on LLVM 8.0.1)
	x86_64-native-bsdapp-clang
	x86_64-native-bsdapp-gcc+debug
	x86_64-native-bsdapp-gcc+shared
	x86_64-native-bsdapp-gcc


OS: RHEL77-64
	Kernel Version: 3.10.0-1062.9.1.el7.x86_64
	CPU info: Intel(R) Xeon(R) CPU E5-2699 v3 @ 2.30GHz
	GCC Version: gcc (GCC) 4.8.5 20150623 (Red Hat 4.8.5-39)
	Clang Version: 3.4.2 (tags/RELEASE_34/dot2-final)
	x86_64-native-linuxapp-gcc


OS: SUSE15-64
	Kernel Version: 4.12.14-lp150.11-default
	CPU info: Intel(R) Xeon(R) CPU E5-2699 v4 @ 2.20GHz
	GCC Version: gcc (SUSE Linux) 7.3.1 20180323 [gcc-7-branch revision 258812]
	Clang Version: 5.0.1 (tags/RELEASE_501/final 312548)
	x86_64-native-linuxapp-clang
	x86_64-native-linuxapp-gcc


** Meson build **


OS: UB2004-64
	Kernel Version: 5.4.0-26-generic
	CPU info: Intel(R) Xeon(R) CPU E5-2699 v4 @ 2.20GHz
	GCC Version: gcc (Ubuntu 9.3.0-10ubuntu2) 9.3.0
	Clang Version: 10.0.0-4ubuntu1
	./build-gcc-static
	./build-gcc-shared
	./build-clang-static
	./build-clang-shared
	./build-x86-default


OS: UB1804-64
	Kernel Version: 4.15.0-20-generic
	CPU info: Intel(R) Xeon(R) Platinum 8180 CPU @ 2.50GHz
	GCC Version: gcc (Ubuntu 7.3.0-16ubuntu3) 7.3.0
	Clang Version: 6.0.0-1ubuntu2 (tags/RELEASE_600/final)
	x86_64-native-linuxapp-doc
	./build-gcc-static
	./build-gcc-shared
	./build-clang-static
	./build-clang-shared
	./build-x86-default


OS: WIN10-64
	Kernel Version: N/A
	CPU info: N/A
	GCC Version: N/A
	Clang Version: Clang 8.0.0
	x86_64-windows-clang


OS: CENTOS80-64
	Kernel Version: 4.18.0-147.8.1.el8_1.x86_64
	CPU info: Intel(R) Xeon(R) CPU E5-2699 v4 @ 2.20GHz
	GCC Version: gcc (GCC) 8.3.1 20190507 (Red Hat 8.3.1-4)
	Clang Version: 8.0.1 (Red Hat 8.0.1-1.module_el8.1.0+215+a01033fb)
	./build-gcc-static
	./build-gcc-shared
	./build-clang-static
	./build-clang-shared
	./build-x86-default


OS: FC31-64
	Kernel Version: 5.4.18-200.fc31.x86_64
	CPU info: Intel(R) Xeon(R) Platinum 8180 CPU @ 2.50GHz
	GCC Version: gcc (GCC) 9.2.1 20190827 (Red Hat 9.2.1-1)
	Clang Version: 9.0.0 (Fedora 9.0.0-1.fc31)
	./build-gcc-static
	./build-gcc-shared
	./build-clang-static
	./build-clang-shared
	./build-x86-default


OS: UB1804-32
	Kernel Version: 4.15.0-20-generic
	CPU info: Intel(R) Xeon(R) CPU E5-2699 v4 @ 2.20GHz
	GCC Version: gcc (Ubuntu 7.5.0-3ubuntu1~18.04) 7.5.0
	Clang Version: 6.0.0-1ubuntu2 (tags/RELEASE_600/final)
	./build-gcc-static
	./build-gcc-shared
	./build-clang-static
	./build-clang-shared
	./build-x86-default


OS: FreeBSD1201-64
	Kernel Version: 12.1-RELEASE
	CPU info: Intel(R) Xeon(R) CPU E5-2699 v4 @ 2.20GHz (2194.97-MHz K8-class CPU)
	GCC Version: gcc (FreeBSD Ports Collection) 9.2.0
	Clang Version: 8.0.1 (tags/RELEASE_801/final 366581) (based on LLVM 8.0.1)
	./build-gcc-static
	./build-gcc-shared
	./build-clang-static
	./build-clang-shared
	./build-x86-default


OS: SUSE15-64
	Kernel Version: 4.12.14-lp150.12.82-default
	CPU info: Intel(R) Xeon(R) CPU E5-2699 v4 @ 2.20GHz
	GCC Version: gcc (SUSE Linux) 7.4.1 20190905 [gcc-7-branch revision 275407]
	Clang Version: 5.0.1 (tags/RELEASE_501/final 312548)
	./build-gcc-static
	./build-gcc-shared
	./build-clang-static
	./build-clang-shared
	./build-x86-default


*Make Build Failed #1:
OS: CENTOS80-64
Target: x86_64-native-linuxapp-icc
make[6]: Warning: File 'portal/dpaa2_hw_dpio.c' has modification time 42490 s in the future
  CC mc/dpdmai.o
  CC base/qbman/qman.o
make[6]: *** [/root/CENTOS80-64_K4.18.0_ICC19.0.0/x86_64-native-linuxapp-icc/4a04a1ab60164ac2b5bc9f54fbef5118/dpdk/mk/internal/rte.compile-pre.mk:114: qbman/qbman_portal.o] Error 1
make[6]: *** Waiting for unfinished jobs....
  CC vmbus_bufring.o
  CC vmbus_common_uio.o
  CC base/qbman/qman_driver.o
  CC base/qbman/dpaa_alloc.o
  CC base/qbman/dpaa_sys.o
make[5]: *** [/root/CENTOS80-64_K4.18.0_ICC19.0.0/x86_64-native-linuxapp-icc/4a04a1ab60164ac2b5bc9f54fbef5118/dpdk/mk/rte.subdir.mk:35: fslmc] Error 2
make[5]: *** Waiting for unfinished jobs....
  AR librte_bus_vmbus.a
  INSTALL-LIB librte_bus_vmbus.a
  AR librte_bus_dpaa.a
  INSTALL-LIB librte_bus_dpaa.a
make[6]: warning:  Clock skew detected.  Your build may be incomplete.
make[4]: *** [/root/CENTOS80-64_K4.18.0_ICC19.0.0/x86_64-native-linuxapp-icc/4a04a1ab60164ac2b5bc9f54fbef5118/dpdk/mk/rte.subdir.mk:37: bus] Error 2
make[3]: *** [/root/CENTOS80-64_K4.18.0_ICC19.0.0/x86_64-native-linuxapp-icc/4a04a1ab60164ac2b5bc9f54fbef5118/dpdk/mk/rte.sdkbuild.mk:51: drivers] Error 2
make[2]: *** [/root/CENTOS80-64_K4.18.0_ICC19.0.0/x86_64-native-linuxapp-icc/4a04a1ab60164ac2b5bc9f54fbef5118/dpdk/mk/rte.sdkroot.mk:99: all] Error 2
make[1]: *** [/root/CENTOS80-64_K4.18.0_ICC19.0.0/x86_64-native-linuxapp-icc/4a04a1ab60164ac2b5bc9f54fbef5118/dpdk/mk/rte.sdkinstall.mk:61: pre_install] Error 2
make: *** [/root/CENTOS80-64_K4.18.0_ICC19.0.0/x86_64-native-linuxapp-icc/4a04a1ab60164ac2b5bc9f54fbef5118/dpdk/mk/rte.sdkroot.mk:77: install] Error 2


*Make Build Failed #2:
OS: UB1804-64
Target: x86_64-native-linuxapp-icc
  AR librte_bus_vmbus.a
  INSTALL-LIB librte_bus_vmbus.a
  CC base/qbman/dpaa_alloc.o
/root/UB1804-64_K4.15.0_ICC19.0.0/x86_64-native-linuxapp-icc/4a04a1ab60164ac2b5bc9f54fbef5118/dpdk/mk/internal/rte.compile-pre.mk:114: recipe for target 'qbman/qbman_portal.o' failed
make[6]: *** [qbman/qbman_portal.o] Error 1
make[6]: *** Waiting for unfinished jobs....
  CC base/qbman/dpaa_sys.o
  PMDINFO portal/dpaa2_hw_dpio.o.pmd.c
  CC portal/dpaa2_hw_dpio.o.pmd.o
  LD portal/dpaa2_hw_dpio.o
/root/UB1804-64_K4.15.0_ICC19.0.0/x86_64-native-linuxapp-icc/4a04a1ab60164ac2b5bc9f54fbef5118/dpdk/mk/rte.subdir.mk:35: recipe for target 'fslmc' failed
make[5]: *** [fslmc] Error 2
make[5]: *** Waiting for unfinished jobs....
  AR librte_bus_dpaa.a
  INSTALL-LIB librte_bus_dpaa.a
/root/UB1804-64_K4.15.0_ICC19.0.0/x86_64-native-linuxapp-icc/4a04a1ab60164ac2b5bc9f54fbef5118/dpdk/mk/rte.subdir.mk:35: recipe for target 'bus' failed
make[4]: *** [bus] Error 2
/root/UB1804-64_K4.15.0_ICC19.0.0/x86_64-native-linuxapp-icc/4a04a1ab60164ac2b5bc9f54fbef5118/dpdk/mk/rte.sdkbuild.mk:51: recipe for target 'drivers' failed
make[3]: *** [drivers] Error 2
/root/UB1804-64_K4.15.0_ICC19.0.0/x86_64-native-linuxapp-icc/4a04a1ab60164ac2b5bc9f54fbef5118/dpdk/mk/rte.sdkroot.mk:98: recipe for target 'all' failed
make[2]: *** [all] Error 2
/root/UB1804-64_K4.15.0_ICC19.0.0/x86_64-native-linuxapp-icc/4a04a1ab60164ac2b5bc9f54fbef5118/dpdk/mk/rte.sdkinstall.mk:60: recipe for target 'pre_install' failed
make[1]: *** [pre_install] Error 2
/root/UB1804-64_K4.15.0_ICC19.0.0/x86_64-native-linuxapp-icc/4a04a1ab60164ac2b5bc9f54fbef5118/dpdk/mk/rte.sdkroot.mk:77: recipe for target 'install' failed
make: *** [install] Error 2


*Make Build Failed #3:
OS: UB2004-64
Target: x86_64-native-linuxapp-icc
  CC base/qbman/qman_driver.o
  CC mc/dpci.o
  CC base/qbman/dpaa_alloc.o
make[6]: *** [/root/UB2004-64_K5.4.0_ICC19.0.0/x86_64-native-linuxapp-icc/4a04a1ab60164ac2b5bc9f54fbef5118/dpdk/mk/internal/rte.compile-pre.mk:116: qbman/qbman_portal.o] Error 1
make[6]: *** Waiting for unfinished jobs....
  CC base/qbman/dpaa_sys.o
make[5]: *** [/root/UB2004-64_K5.4.0_ICC19.0.0/x86_64-native-linuxapp-icc/4a04a1ab60164ac2b5bc9f54fbef5118/dpdk/mk/rte.subdir.mk:35: fslmc] Error 2
make[5]: *** Waiting for unfinished jobs....
  AR librte_bus_dpaa.a
  INSTALL-LIB librte_bus_dpaa.a
make[4]: *** [/root/UB2004-64_K5.4.0_ICC19.0.0/x86_64-native-linuxapp-icc/4a04a1ab60164ac2b5bc9f54fbef5118/dpdk/mk/rte.subdir.mk:37: bus] Error 2
make[3]: *** [/root/UB2004-64_K5.4.0_ICC19.0.0/x86_64-native-linuxapp-icc/4a04a1ab60164ac2b5bc9f54fbef5118/dpdk/mk/rte.sdkbuild.mk:51: drivers] Error 2
make[2]: *** [/root/UB2004-64_K5.4.0_ICC19.0.0/x86_64-native-linuxapp-icc/4a04a1ab60164ac2b5bc9f54fbef5118/dpdk/mk/rte.sdkroot.mk:99: all] Error 2
make[1]: *** [/root/UB2004-64_K5.4.0_ICC19.0.0/x86_64-native-linuxapp-icc/4a04a1ab60164ac2b5bc9f54fbef5118/dpdk/mk/rte.sdkinstall.mk:61: pre_install] Error 2
make: *** [/root/UB2004-64_K5.4.0_ICC19.0.0/x86_64-native-linuxapp-icc/4a04a1ab60164ac2b5bc9f54fbef5118/dpdk/mk/rte.sdkroot.mk:77: install] Error 2

DPDK STV team

^ permalink raw reply	[flat|nested] only message in thread

only message in thread, other threads:[~2020-06-03 18:17 UTC | newest]

Thread overview: (only message) (download: mbox.gz / follow: Atom feed)
-- links below jump to the message on this page --
2020-06-03 18:17 [dpdk-test-report] |FAILURE| pw70836net/octeontx2: fix dmac filtering sys_stv

automatic DPDK test reports

This inbox may be cloned and mirrored by anyone:

	git clone --mirror http://inbox.dpdk.org/test-report/0 test-report/git/0.git

	# If you have public-inbox 1.1+ installed, you may
	# initialize and index your mirror using the following commands:
	public-inbox-init -V2 test-report test-report/ http://inbox.dpdk.org/test-report \
		test-report@dpdk.org
	public-inbox-index test-report

Example config snippet for mirrors.
Newsgroup available over NNTP:
	nntp://inbox.dpdk.org/inbox.dpdk.test-report


AGPL code for this site: git clone https://public-inbox.org/public-inbox.git