automatic DPDK test reports
 help / color / Atom feed
* [dpdk-test-report] |FAILURE| pw(72372) [4/4] net/qede: add support for get register operation
@ 2020-06-29 13:02 sys_stv
  0 siblings, 0 replies; only message in thread
From: sys_stv @ 2020-06-29 13:02 UTC (permalink / raw)
  To: test-report

[-- Attachment #1: Type: text/plain, Size: 47857 bytes --]


Test-Label: Intel-compilation
Test-Status: FAILURE
http://dpdk.org/patch/72372

_Compilation issues_

Submitter: Rasesh Mody <rmody@marvell.com>
Date: 2020-06-28 05:58:50
Reply_mail: 20200628055850.5275-5-rmody@marvell.com

DPDK git baseline: Repo:dpdk-next-net-mrvl, CommitID: 0d4ee8c0e04a1bd1b37553c08727c00bc1a00095


Meson build Summary: 8 Builds Done, 2 Successful, 6 Failures, 0 Blocked

Makefile build Summary: 20 Builds Done, 20 Successful, 0 Failures, 0 Blocked

                +==============================================+===========+==========+
                |                   Makefile                   |   Meson   | Document |
+----------------+------+-------+------+------------+-----------+-----------+----------+
| os             | gcc  | clang | icc  | gcc+shared | gcc+debug | gcc/clang | pdf/html |
+----------------+------+-------+------+------------+-----------+-----------+----------+
| CENTOS82-64    | pass | pass  | pass | pass       | pass      | FAIL      |          |
| RHEL82-64      | pass |       |      |            |           |           |          |
| UB1804-64      | pass |       |      |            |           |           |          |
| FC32-64        | pass | pass  |      |            |           | FAIL      |          |
| CENTOS77-64    | pass |       |      |            |           |           |          |
| UB2004-64      | pass | pass  | pass |            |           | FAIL      | pass     |
| WIN10-64       |      |       |      |            |           | pass      |          |
| UB2004-32      | pass |       |      |            |           |           |          |
| UB1804-32      |      |       |      |            |           | FAIL      |          |
| FreeBSD1201-64 | pass | pass  |      | pass       | pass      | FAIL      |          |
| SUSE15-64      | pass | pass  |      |            |           | FAIL      |          |
+----------------+------+-------+------+------------+-----------+-----------+----------+
Test environment and configuration as below:

** Makefile build **


OS: CENTOS82-64
	Kernel Version: 4.18.0-193.el8.x86_64
	CPU info: Intel(R) Xeon(R) Platinum 8280M CPU @ 2.70GHz
	GCC Version: gcc (GCC) 8.3.1 20191121 (Red Hat 8.3.1-5)
	Clang Version: 9.0.1 (Red Hat 9.0.1-2.module_el8.2.0+309+0c7b6b03)
	x86_64-native-linuxapp-gcc
	x86_64-native-linuxapp-clang
	x86_64-native-linuxapp-icc
	x86_64-native-linuxapp-gcc+shared
	x86_64-native-linuxapp-gcc+debug


OS: RHEL82-64
	Kernel Version: 4.18.0-193.el8.x86_64
	CPU info: Intel(R) Xeon(R) Platinum 8280M CPU @ 2.70GHz
	GCC Version: gcc (GCC) 8.3.1 20191121 (Red Hat 8.3.1-5)
	Clang Version: 8.0.1 (Red Hat 8.0.1-1.module_el8.1.0+215+a01033fb)
	x86_64-native-linuxapp-gcc


OS: UB1804-64
	Kernel Version: 4.15.0-29-generic
	CPU info: Intel(R) Xeon(R) Platinum 8180 CPU @ 2.50GHz
	GCC Version: gcc (Ubuntu 7.5.0-3ubuntu1~18.04) 7.5.0
	Clang Version: 6.0.0-1ubuntu2 (tags/RELEASE_600/final)
	x86_64-native-linuxapp-gcc


OS: FC32-64
	Kernel Version: 5.6.0-0.rc7.git0.2.fc32.x86_64
	CPU info: Intel(R) Xeon(R) Platinum 8280M CPU @ 2.70GHz
	GCC Version: gcc (GCC) 10.0.1 20200311 (Red Hat 10.0.1-0.9)
	Clang Version: 10.0.0 (Fedora 10.0.0-0.3.rc4.fc32)
	x86_64-native-linuxapp-gcc
	x86_64-native-linuxapp-clang


OS: CENTOS77-64
	Kernel Version: 3.10.0-1062.9.1.el7.x86_64
	CPU info: Intel(R) Xeon(R) Platinum 8280M CPU @ 2.70GHz
	GCC Version: gcc (GCC) 4.8.5 20150623 (Red Hat 4.8.5-39)
	Clang Version: 3.4.2 (tags/RELEASE_34/dot2-final)
	x86_64-native-linuxapp-gcc


OS: UB2004-64
	Kernel Version: 5.4.0-26-generic
	CPU info: Intel(R) Xeon(R) Platinum 8180 CPU @ 2.50GHz
	GCC Version: gcc (Ubuntu 10-20200416-0ubuntu1) 10.0.1 20200416 (experimental) [master revision 3c3f12e2a76:dcee354ce56:44b326839d864fc10c459916abcc97f35a9ac3de]
	Clang Version: 10.0.0-4ubuntu1
	x86_64-native-linuxapp-clang
	x86_64-native-linuxapp-gcc
	x86_64-native-linuxapp-icc


OS: UB2004-32
	Kernel Version: 5.4.0-26-generic
	CPU info: Intel(R) Xeon(R) Platinum 8180 CPU @ 2.50GHz
	GCC Version: gcc (Ubuntu 9.3.0-10ubuntu2) 9.3.0
	Clang Version: 10.0.0-4ubuntu1
	i686-native-linuxapp-gcc


OS: FreeBSD1201-64
	Kernel Version: 12.1-RELEASE
	CPU info: Intel(R) Xeon(R) CPU E5-2699 v3 @ 2.30GHz (2294.74-MHz K8-class CPU)
	GCC Version: gcc (FreeBSD Ports Collection) 9.2.0
	Clang Version: 8.0.1 (tags/RELEASE_801/final 366581) (based on LLVM 8.0.1)
	x86_64-native-bsdapp-gcc
	x86_64-native-bsdapp-clang
	x86_64-native-bsdapp-gcc+shared
	x86_64-native-bsdapp-gcc+debug


OS: SUSE15-64
	Kernel Version: 4.12.14-lp150.11-default
	CPU info: Intel(R) Xeon(R) CPU E5-2699 v4 @ 2.20GHz
	GCC Version: gcc (SUSE Linux) 7.3.1 20180323 [gcc-7-branch revision 258812]
	Clang Version: 5.0.1 (tags/RELEASE_501/final 312548)
	x86_64-native-linuxapp-clang
	x86_64-native-linuxapp-gcc

** Meson build **


OS: CENTOS82-64
	Kernel Version: 4.18.0-193.el8.x86_64
	CPU info: Intel(R) Xeon(R) CPU E5-2699 v4 @ 2.20GHz
	GCC Version: gcc (GCC) 8.3.1 20191121 (Red Hat 8.3.1-5)
	Clang Version: 9.0.1 (Red Hat 9.0.1-2.module_el8.2.0+309+0c7b6b03)
	./build-gcc-static
	./build-gcc-shared
	./build-clang-static
	./build-clang-shared
	./build-x86-default


OS: UB2004-64
	Kernel Version: 5.4.0-26-generic
	CPU info: Intel(R) Xeon(R) Platinum 8180 CPU @ 2.50GHz
	GCC Version: gcc (Ubuntu 9.3.0-10ubuntu2) 9.3.0
	Clang Version: 10.0.0-4ubuntu1
	x86_64-native-linuxapp-doc
	./build-gcc-static
	./build-gcc-shared
	./build-clang-static
	./build-clang-shared
	./build-x86-default


OS: FC32-64
	Kernel Version: 5.6.0-0.rc7.git0.2.fc32.x86_64
	CPU info: Intel(R) Xeon(R) CPU E5-2699 v4 @ 2.20GHz
	GCC Version: gcc (GCC) 10.0.1 20200311 (Red Hat 10.0.1-0.9)
	Clang Version: 10.0.0 (Fedora 10.0.0-0.3.rc4.fc32)
	./build-gcc-static
	./build-gcc-shared
	./build-clang-static
	./build-clang-shared
	./build-x86-default


OS: WIN10-64
	Kernel Version: N/A
	CPU info: N/A
	GCC Version: N/A
	Clang Version: Clang 8.0.0
	x86_64-windows-clang


OS: UB1804-32
	Kernel Version: 4.15.0-20-generic
	CPU info: Intel(R) Xeon(R) CPU E5-2699 v4 @ 2.20GHz
	GCC Version: gcc (Ubuntu 7.5.0-3ubuntu1~18.04) 7.5.0
	Clang Version: 6.0.0-1ubuntu2 (tags/RELEASE_600/final)
	./build-gcc-static
	./build-gcc-shared
	./build-clang-static
	./build-clang-shared
	./build-x86-default


OS: FreeBSD1201-64
	Kernel Version: 12.1-RELEASE
	CPU info: Intel(R) Xeon(R) CPU E5-2699 v4 @ 2.20GHz (2194.97-MHz K8-class CPU)
	GCC Version: gcc (FreeBSD Ports Collection) 9.2.0
	Clang Version: 8.0.1 (tags/RELEASE_801/final 366581) (based on LLVM 8.0.1)
	./build-gcc-static
	./build-gcc-shared
	./build-clang-static
	./build-clang-shared
	./build-x86-default


OS: SUSE15-64
	Kernel Version: 4.12.14-lp150.12.82-default
	CPU info: Intel(R) Xeon(R) CPU E5-2699 v4 @ 2.20GHz
	GCC Version: gcc (SUSE Linux) 7.4.1 20190905 [gcc-7-branch revision 275407]
	Clang Version: 5.0.1 (tags/RELEASE_501/final 312548)
	./build-gcc-static
	./build-gcc-shared
	./build-clang-static
	./build-clang-shared
	./build-x86-default



*Meson Build Failed #1:
OS: CENTOS82-64
Target:./build-gcc-static
FAILED: drivers/librte_pmd_qede.so.20.0.3 
gcc  -o drivers/librte_pmd_qede.so.20.0.3 'drivers/a715181@@rte_pmd_qede@sha/meson-generated_.._rte_pmd_qede.pmd.c.o' 'drivers/net/qede/base/f6110d5@@qede_base@sta/bcm_osal.c.o' 'drivers/net/qede/base/f6110d5@@qede_base@sta/ecore_cxt.c.o' 'drivers/net/qede/base/f6110d5@@qede_base@sta/ecore_dcbx.c.o' 'drivers/net/qede/base/f6110d5@@qede_base@sta/ecore_dev.c.o' 'drivers/net/qede/base/f6110d5@@qede_base@sta/ecore_hw.c.o' 'drivers/net/qede/base/f6110d5@@qede_base@sta/ecore_init_fw_funcs.c.o' 'drivers/net/qede/base/f6110d5@@qede_base@sta/ecore_init_ops.c.o' 'drivers/net/qede/base/f6110d5@@qede_base@sta/ecore_int.c.o' 'drivers/net/qede/base/f6110d5@@qede_base@sta/ecore_l2.c.o' 'drivers/net/qede/base/f6110d5@@qede_base@sta/ecore_mcp.c.o' 'drivers/net/qede/base/f6110d5@@qede_base@sta/ecore_sp_commands.c.o' 'drivers/net/qede/base/f6110d5@@qede_base@sta/ecore_spq.c.o' 'drivers/net/qede/base/f6110d5@@qede_base@sta/ecore_sriov.c.o' 'drivers/net/qede/base/f6110d5@@qede_base@sta/ecore_vf.c.o' 'drivers/a715181@@tmp_rte_pmd_qede@sta/net_qede_qede_ethdev.c.o' 'drivers/a715181@@tmp_rte_pmd_qede@sta/net_qede_qede_filter.c.o' 'drivers/a715181@@tmp_rte_pmd_qede@sta/net_qede_qede_main.c.o' 'drivers/a715181@@tmp_rte_pmd_qede@sta/net_qede_qede_rxtx.c.o' -Wl,--as-needed -Wl,--no-undefined -shared -fPIC -Wl,--start-group -Wl,-soname,librte_pmd_qede.so.20.0 -Wl,--no-as-needed -pthread -lm -ldl -lnuma lib/librte_ethdev.so.20.0.3 lib/librte_eal.so.20.0.3 lib/librte_kvargs.so.20.0.3 lib/librte_telemetry.so.0.200.3 lib/librte_net.so.20.0.3 lib/librte_mbuf.so.20.0.3 lib/librte_mempool.so.20.0.3 lib/librte_ring.so.20.0.3 lib/librte_meter.so.20.0.3 drivers/librte_bus_pci.so.20.0.3 lib/librte_pci.so.20.0.3 drivers/librte_bus_vdev.so.20.0.3 -Wl,--end-group -Wl,--version-script=/root/CENTOS82-64_K4.18.0_GCC8.3.1/x86_64-native-linuxapp-gcc/e0e78fea292145bc8505505d50940328/dpdk/drivers/net/qede/rte_pmd_qede_version.map '-Wl,-rpath,$ORIGIN/../lib:$ORIGIN/' -Wl,-rpath-link,/root/CENTOS82-64_K4.18.0_GCC8.3.1/x86_64-native-linuxapp-gcc/e0e78fea292145bc8505505d50940328/dpdk/build-gcc-static/lib -Wl,-rpath-link,/root/CENTOS82-64_K4.18.0_GCC8.3.1/x86_64-native-linuxapp-gcc/e0e78fea292145bc8505505d50940328/dpdk/build-gcc-static/drivers
drivers/net/qede/base/f6110d5@@qede_base@sta/bcm_osal.c.o: In function `qede_hw_err_handler':
/root/CENTOS82-64_K4.18.0_GCC8.3.1/x86_64-native-linuxapp-gcc/e0e78fea292145bc8505505d50940328/dpdk/build-gcc-static/../drivers/net/qede/base/bcm_osal.c:262: undefined reference to `qede_save_fw_dump'
drivers/net/qede/base/f6110d5@@qede_base@sta/ecore_dev.c.o: In function `ecore_resc_alloc':
/root/CENTOS82-64_K4.18.0_GCC8.3.1/x86_64-native-linuxapp-gcc/e0e78fea292145bc8505505d50940328/dpdk/build-gcc-static/../drivers/net/qede/base/ecore_dev.c:2515: undefined reference to `qed_dbg_alloc_user_data'
/root/CENTOS82-64_K4.18.0_GCC8.3.1/x86_64-native-linuxapp-gcc/e0e78fea292145bc8505505d50940328/dpdk/build-gcc-static/../drivers/net/qede/base/ecore_dev.c:2522: undefined reference to `qed_dbg_alloc_user_data'
drivers/a715181@@tmp_rte_pmd_qede@sta/net_qede_qede_ethdev.c.o:(.data.rel.ro+0x530): undefined reference to `qede_get_regs'
drivers/a715181@@tmp_rte_pmd_qede@sta/net_qede_qede_main.c.o: In function `qed_slowpath_start':
/root/CENTOS82-64_K4.18.0_GCC8.3.1/x86_64-native-linuxapp-gcc/e0e78fea292145bc8505505d50940328/dpdk/build-gcc-static/../drivers/net/qede/qede_main.c:285: undefined reference to `qed_dbg_pf_init'
drivers/a715181@@tmp_rte_pmd_qede@sta/net_qede_qede_main.c.o:(.data.rel.ro+0xa8): undefined reference to `qed_dbg_grc'
drivers/a715181@@tmp_rte_pmd_qede@sta/net_qede_qede_main.c.o:(.data.rel.ro+0xb0): undefined reference to `qed_dbg_grc_size'
drivers/a715181@@tmp_rte_pmd_qede@sta/net_qede_qede_main.c.o:(.data.rel.ro+0xb8): undefined reference to `qed_dbg_idle_chk'
drivers/a715181@@tmp_rte_pmd_qede@sta/net_qede_qede_main.c.o:(.data.rel.ro+0xc0): undefined reference to `qed_dbg_idle_chk_size'
drivers/a715181@@tmp_rte_pmd_qede@sta/net_qede_qede_main.c.o:(.data.rel.ro+0xc8): undefined reference to `qed_dbg_reg_fifo'
drivers/a715181@@tmp_rte_pmd_qede@sta/net_qede_qede_main.c.o:(.data.rel.ro+0xd0): undefined reference to `qed_dbg_reg_fifo_size'
drivers/a715181@@tmp_rte_pmd_qede@sta/net_qede_qede_main.c.o:(.data.rel.ro+0xd8): undefined reference to `qed_dbg_mcp_trace'
drivers/a715181@@tmp_rte_pmd_qede@sta/net_qede_qede_main.c.o:(.data.rel.ro+0xe0): undefined reference to `qed_dbg_mcp_trace_size'
drivers/a715181@@tmp_rte_pmd_qede@sta/net_qede_qede_main.c.o:(.data.rel.ro+0xe8): undefined reference to `qed_dbg_protection_override'
drivers/a715181@@tmp_rte_pmd_qede@sta/net_qede_qede_main.c.o:(.data.rel.ro+0xf0): undefined reference to `qed_dbg_protection_override_size'
drivers/a715181@@tmp_rte_pmd_qede@sta/net_qede_qede_main.c.o:(.data.rel.ro+0xf8): undefined reference to `qed_dbg_igu_fifo_size'
drivers/a715181@@tmp_rte_pmd_qede@sta/net_qede_qede_main.c.o:(.data.rel.ro+0x100): undefined reference to `qed_dbg_igu_fifo'
drivers/a715181@@tmp_rte_pmd_qede@sta/net_qede_qede_main.c.o:(.data.rel.ro+0x108): undefined reference to `qed_dbg_fw_asserts'
drivers/a715181@@tmp_rte_pmd_qede@sta/net_qede_qede_main.c.o:(.data.rel.ro+0x110): undefined reference to `qed_dbg_fw_asserts_size'
drivers/a715181@@tmp_rte_pmd_qede@sta/net_qede_qede_main.c.o:(.data.rel.ro+0x118): undefined reference to `qed_dbg_ilt'
drivers/a715181@@tmp_rte_pmd_qede@sta/net_qede_qede_main.c.o:(.data.rel.ro+0x120): undefined reference to `qed_dbg_ilt_size'
drivers/a715181@@tmp_rte_pmd_qede@sta/net_qede_qede_main.c.o:(.data.rel.ro+0x128): undefined reference to `qed_get_debug_engine'
drivers/a715181@@tmp_rte_pmd_qede@sta/net_qede_qede_main.c.o:(.data.rel.ro+0x130): undefined reference to `qed_set_debug_engine'
collect2: error: ld returned 1 exit status
[1413/2197] Compiling C object 'drivers/a715181@@tmp_rte_pmd_sfc@sta/net_sfc_sfc_port.c.o'.
[1414/2197] Compiling C object 'drivers/a715181@@tmp_rte_pmd_sfc@sta/net_sfc_sfc_dp.c.o'.
[1415/2197] Compiling C object 'drivers/a715181@@tmp_rte_pmd_sfc@sta/net_sfc_sfc_ev.c.o'.
[1416/2197] Compiling C object 'drivers/a715181@@tmp_rte_pmd_sfc@sta/net_sfc_sfc_filter.c.o'.
[1417/2197] Compiling C object 'drivers/a715181@@tmp_rte_pmd_sfc@sta/net_sfc_sfc_tso.c.o'.
[1418/2197] Compiling C object 'drivers/a715181@@tmp_rte_pmd_sfc@sta/net_sfc_sfc_ethdev.c.o'.
[1419/2197] Compiling C object 'drivers/a715181@@tmp_rte_pmd_octeontx2@sta/net_octeontx2_otx2_rx.c.o'.
[1420/2197] Compiling C object 'drivers/a715181@@tmp_rte_pmd_sfc@sta/net_sfc_sfc_rx.c.o'.
[1421/2197] Compiling C object 'drivers/a715181@@tmp_rte_pmd_sfc@sta/net_sfc_sfc_tx.c.o'.
[1422/2197] Compiling C object 'drivers/a715181@@tmp_rte_pmd_sfc@sta/net_sfc_sfc_flow.c.o'.
[1423/2197] Compiling C object 'drivers/a715181@@tmp_rte_pmd_octeontx2@sta/net_octeontx2_otx2_tx.c.o'.
ninja: build stopped: subcommand failed




*Meson Build Failed #2:
OS: FC32-64
Target:./build-gcc-static
FAILED: drivers/net/qede/base/f6110d5@@qede_base@sta/ecore_dev.c.o 
gcc -Idrivers/net/qede/base/f6110d5@@qede_base@sta -Idrivers/net/qede/base -I../drivers/net/qede/base -Ilib/librte_net -I../lib/librte_net -I. -I../ -Iconfig -I../config -Ilib/librte_eal/include -I../lib/librte_eal/include -Ilib/librte_eal/linux/include -I../lib/librte_eal/linux/include -Ilib/librte_eal/x86/include -I../lib/librte_eal/x86/include -Ilib/librte_eal/common -I../lib/librte_eal/common -Ilib/librte_eal -I../lib/librte_eal -Ilib/librte_kvargs -I../lib/librte_kvargs -Ilib/librte_telemetry/../librte_metrics -I../lib/librte_telemetry/../librte_metrics -Ilib/librte_telemetry -I../lib/librte_telemetry -Ilib/librte_mbuf -I../lib/librte_mbuf -Ilib/librte_mempool -I../lib/librte_mempool -Ilib/librte_ring -I../lib/librte_ring -fdiagnostics-color=always -pipe -D_FILE_OFFSET_BITS=64 -Wall -Winvalid-pch -Werror -O2 -g -include rte_config.h -Wextra -Wcast-qual -Wdeprecated -Wformat-nonliteral -Wformat-security -Wmissing-declarations -Wmissing-prototypes -Wnested-externs -Wold-style-definition -Wpointer-arith -Wsign-compare -Wstrict-prototypes -Wundef -Wwrite-strings -Wno-address-of-packed-member -Wno-packed-not-aligned -Wno-missing-field-initializers -Wno-zero-length-bounds -D_GNU_SOURCE -fPIC -march=native -DALLOW_EXPERIMENTAL_API -DALLOW_INTERNAL_API -Wno-format-truncation -Wno-unused-parameter -Wno-sign-compare -Wno-missing-prototypes -Wno-cast-qual -Wno-unused-function -Wno-unused-variable -Wno-strict-aliasing -Wno-missing-prototypes -Wno-unused-value -Wno-format-nonliteral -Wno-shift-negative-value -Wno-unused-but-set-variable -Wno-missing-declarations -Wno-maybe-uninitialized -Wno-strict-prototypes -Wno-shift-negative-value -Wno-implicit-fallthrough -Wno-format-extra-args -Wno-empty-body -MD -MQ 'drivers/net/qede/base/f6110d5@@qede_base@sta/ecore_dev.c.o' -MF 'drivers/net/qede/base/f6110d5@@qede_base@sta/ecore_dev.c.o.d' -o 'drivers/net/qede/base/f6110d5@@qede_base@sta/ecore_dev.c.o' -c ../drivers/net/qede/base/ecore_dev.c
../drivers/net/qede/base/ecore_dev.c: In function ‘ecore_resc_alloc’:
../drivers/net/qede/base/ecore_dev.c:2515:6: error: implicit conversion from ‘enum dbg_status’ to ‘enum _ecore_status_t’ [-Werror=enum-conversion]
 2515 |   rc = OSAL_DBG_ALLOC_USER_DATA(p_hwfn, &p_hwfn->dbg_user_info);
      |      ^
../drivers/net/qede/base/ecore_dev.c:2522:6: error: implicit conversion from ‘enum dbg_status’ to ‘enum _ecore_status_t’ [-Werror=enum-conversion]
 2522 |   rc = OSAL_DBG_ALLOC_USER_DATA(p_hwfn, &p_hwfn->dbg_user_info);
      |      ^
cc1: all warnings being treated as errors
[1338/2198] Compiling C object 'drivers/net/qede/base/f6110d5@@qede_base@sta/ecore_vf.c.o'.
[1339/2198] Compiling C object 'drivers/net/sfc/base/59ea503@@sfc_base@sta/efx_ev.c.o'.
[1340/2198] Compiling C object 'drivers/a715181@@tmp_rte_pmd_qede@sta/net_qede_qede_ethdev.c.o'.
[1341/2198] Compiling C object 'drivers/net/sfc/base/59ea503@@sfc_base@sta/efx_crc32.c.o'.
[1342/2198] Compiling C object 'drivers/a715181@@tmp_rte_pmd_qede@sta/net_qede_qede_rxtx.c.o'.
[1343/2198] Compiling C object 'drivers/net/qede/base/f6110d5@@qede_base@sta/ecore_sriov.c.o'.
[1344/2198] Compiling C object 'drivers/a715181@@tmp_rte_pmd_ring@sta/net_ring_rte_eth_ring.c.o'.
[1345/2198] Compiling C object 'drivers/a715181@@tmp_rte_pmd_octeontx2@sta/net_octeontx2_otx2_rx.c.o'.
[1346/2198] Compiling C object 'drivers/a715181@@tmp_rte_pmd_octeontx2@sta/net_octeontx2_otx2_tx.c.o'.
ninja: build stopped: subcommand failed




*Meson Build Failed #3:
OS: FreeBSD1201-64
Target:./build-gcc-static
FAILED: drivers/librte_pmd_qede.so.20.0.3 
gcc  -o drivers/librte_pmd_qede.so.20.0.3 'drivers/a715181@@rte_pmd_qede@sha/meson-generated_.._rte_pmd_qede.pmd.c.o' 'drivers/net/qede/base/f6110d5@@qede_base@sta/bcm_osal.c.o' 'drivers/net/qede/base/f6110d5@@qede_base@sta/ecore_cxt.c.o' 'drivers/net/qede/base/f6110d5@@qede_base@sta/ecore_dcbx.c.o' 'drivers/net/qede/base/f6110d5@@qede_base@sta/ecore_dev.c.o' 'drivers/net/qede/base/f6110d5@@qede_base@sta/ecore_hw.c.o' 'drivers/net/qede/base/f6110d5@@qede_base@sta/ecore_init_fw_funcs.c.o' 'drivers/net/qede/base/f6110d5@@qede_base@sta/ecore_init_ops.c.o' 'drivers/net/qede/base/f6110d5@@qede_base@sta/ecore_int.c.o' 'drivers/net/qede/base/f6110d5@@qede_base@sta/ecore_l2.c.o' 'drivers/net/qede/base/f6110d5@@qede_base@sta/ecore_mcp.c.o' 'drivers/net/qede/base/f6110d5@@qede_base@sta/ecore_sp_commands.c.o' 'drivers/net/qede/base/f6110d5@@qede_base@sta/ecore_spq.c.o' 'drivers/net/qede/base/f6110d5@@qede_base@sta/ecore_sriov.c.o' 'drivers/net/qede/base/f6110d5@@qede_base@sta/ecore_vf.c.o' 'drivers/a715181@@tmp_rte_pmd_qede@sta/net_qede_qede_ethdev.c.o' 'drivers/a715181@@tmp_rte_pmd_qede@sta/net_qede_qede_filter.c.o' 'drivers/a715181@@tmp_rte_pmd_qede@sta/net_qede_qede_main.c.o' 'drivers/a715181@@tmp_rte_pmd_qede@sta/net_qede_qede_rxtx.c.o' -Wl,--as-needed -Wl,--no-undefined -shared -fPIC -Wl,--start-group -Wl,-soname,librte_pmd_qede.so.20.0 -Wl,--no-as-needed -pthread -lm -lexecinfo lib/librte_ethdev.so.20.0.3 lib/librte_eal.so.20.0.3 lib/librte_kvargs.so.20.0.3 lib/librte_telemetry.so.0.200.3 lib/librte_net.so.20.0.3 lib/librte_mbuf.so.20.0.3 lib/librte_mempool.so.20.0.3 lib/librte_ring.so.20.0.3 lib/librte_meter.so.20.0.3 drivers/librte_bus_pci.so.20.0.3 lib/librte_pci.so.20.0.3 drivers/librte_bus_vdev.so.20.0.3 -Wl,--end-group -Wl,--version-script=/root/FreeBSD1201-64_K12.1_GCC9.2.0/x86_64-native-bsdapp-gcc/e0e78fea292145bc8505505d50940328/dpdk/drivers/net/qede/rte_pmd_qede_version.map '-Wl,-rpath,$ORIGIN/../lib:$ORIGIN/' -Wl,-rpath-link,/root/FreeBSD1201-64_K12.1_GCC9.2.0/x86_64-native-bsdapp-gcc/e0e78fea292145bc8505505d50940328/dpdk/build-gcc-static/lib -Wl,-rpath-link,/root/FreeBSD1201-64_K12.1_GCC9.2.0/x86_64-native-bsdapp-gcc/e0e78fea292145bc8505505d50940328/dpdk/build-gcc-static/drivers
/usr/local/bin/ld: drivers/net/qede/base/f6110d5@@qede_base@sta/bcm_osal.c.o: in function `qede_hw_err_handler':
/root/FreeBSD1201-64_K12.1_GCC9.2.0/x86_64-native-bsdapp-gcc/e0e78fea292145bc8505505d50940328/dpdk/build-gcc-static/../drivers/net/qede/base/bcm_osal.c:262: undefined reference to `qede_save_fw_dump'
/usr/local/bin/ld: drivers/net/qede/base/f6110d5@@qede_base@sta/ecore_dev.c.o: in function `ecore_resc_alloc':
/root/FreeBSD1201-64_K12.1_GCC9.2.0/x86_64-native-bsdapp-gcc/e0e78fea292145bc8505505d50940328/dpdk/build-gcc-static/../drivers/net/qede/base/ecore_dev.c:2515: undefined reference to `qed_dbg_alloc_user_data'
/usr/local/bin/ld: /root/FreeBSD1201-64_K12.1_GCC9.2.0/x86_64-native-bsdapp-gcc/e0e78fea292145bc8505505d50940328/dpdk/build-gcc-static/../drivers/net/qede/base/ecore_dev.c:2522: undefined reference to `qed_dbg_alloc_user_data'
/usr/local/bin/ld: drivers/a715181@@tmp_rte_pmd_qede@sta/net_qede_qede_ethdev.c.o:(.data.rel.ro+0x530): undefined reference to `qede_get_regs'
/usr/local/bin/ld: drivers/a715181@@tmp_rte_pmd_qede@sta/net_qede_qede_main.c.o: in function `qed_slowpath_start':
/root/FreeBSD1201-64_K12.1_GCC9.2.0/x86_64-native-bsdapp-gcc/e0e78fea292145bc8505505d50940328/dpdk/build-gcc-static/../drivers/net/qede/qede_main.c:285: undefined reference to `qed_dbg_pf_init'
/usr/local/bin/ld: drivers/a715181@@tmp_rte_pmd_qede@sta/net_qede_qede_main.c.o:(.data.rel.ro+0xa8): undefined reference to `qed_dbg_grc'
/usr/local/bin/ld: drivers/a715181@@tmp_rte_pmd_qede@sta/net_qede_qede_main.c.o:(.data.rel.ro+0xb0): undefined reference to `qed_dbg_grc_size'
/usr/local/bin/ld: drivers/a715181@@tmp_rte_pmd_qede@sta/net_qede_qede_main.c.o:(.data.rel.ro+0xb8): undefined reference to `qed_dbg_idle_chk'
/usr/local/bin/ld: drivers/a715181@@tmp_rte_pmd_qede@sta/net_qede_qede_main.c.o:(.data.rel.ro+0xc0): undefined reference to `qed_dbg_idle_chk_size'
/usr/local/bin/ld: drivers/a715181@@tmp_rte_pmd_qede@sta/net_qede_qede_main.c.o:(.data.rel.ro+0xc8): undefined reference to `qed_dbg_reg_fifo'
/usr/local/bin/ld: drivers/a715181@@tmp_rte_pmd_qede@sta/net_qede_qede_main.c.o:(.data.rel.ro+0xd0): undefined reference to `qed_dbg_reg_fifo_size'
/usr/local/bin/ld: drivers/a715181@@tmp_rte_pmd_qede@sta/net_qede_qede_main.c.o:(.data.rel.ro+0xd8): undefined reference to `qed_dbg_mcp_trace'
/usr/local/bin/ld: drivers/a715181@@tmp_rte_pmd_qede@sta/net_qede_qede_main.c.o:(.data.rel.ro+0xe0): undefined reference to `qed_dbg_mcp_trace_size'
/usr/local/bin/ld: drivers/a715181@@tmp_rte_pmd_qede@sta/net_qede_qede_main.c.o:(.data.rel.ro+0xe8): undefined reference to `qed_dbg_protection_override'
/usr/local/bin/ld: drivers/a715181@@tmp_rte_pmd_qede@sta/net_qede_qede_main.c.o:(.data.rel.ro+0xf0): undefined reference to `qed_dbg_protection_override_size'
/usr/local/bin/ld: drivers/a715181@@tmp_rte_pmd_qede@sta/net_qede_qede_main.c.o:(.data.rel.ro+0xf8): undefined reference to `qed_dbg_igu_fifo_size'
/usr/local/bin/ld: drivers/a715181@@tmp_rte_pmd_qede@sta/net_qede_qede_main.c.o:(.data.rel.ro+0x100): undefined reference to `qed_dbg_igu_fifo'
/usr/local/bin/ld: drivers/a715181@@tmp_rte_pmd_qede@sta/net_qede_qede_main.c.o:(.data.rel.ro+0x108): undefined reference to `qed_dbg_fw_asserts'
/usr/local/bin/ld: drivers/a715181@@tmp_rte_pmd_qede@sta/net_qede_qede_main.c.o:(.data.rel.ro+0x110): undefined reference to `qed_dbg_fw_asserts_size'
/usr/local/bin/ld: drivers/a715181@@tmp_rte_pmd_qede@sta/net_qede_qede_main.c.o:(.data.rel.ro+0x118): undefined reference to `qed_dbg_ilt'
/usr/local/bin/ld: drivers/a715181@@tmp_rte_pmd_qede@sta/net_qede_qede_main.c.o:(.data.rel.ro+0x120): undefined reference to `qed_dbg_ilt_size'
/usr/local/bin/ld: drivers/a715181@@tmp_rte_pmd_qede@sta/net_qede_qede_main.c.o:(.data.rel.ro+0x128): undefined reference to `qed_get_debug_engine'
/usr/local/bin/ld: drivers/a715181@@tmp_rte_pmd_qede@sta/net_qede_qede_main.c.o:(.data.rel.ro+0x130): undefined reference to `qed_set_debug_engine'
collect2: error: ld returned 1 exit status
[1079/1631] Compiling C object 'drivers/net/sfc/base/59ea503@@sfc_base@sta/ef10_phy.c.o'
[1080/1631] Compiling C object 'drivers/net/sfc/base/59ea503@@sfc_base@sta/ef10_mcdi.c.o'
[1081/1631] Compiling C object 'drivers/net/sfc/base/59ea503@@sfc_base@sta/ef10_nic.c.o'
[1082/1631] Compiling C object 'drivers/net/sfc/base/59ea503@@sfc_base@sta/ef10_proxy.c.o'
[1083/1631] Compiling C object 'drivers/net/sfc/base/59ea503@@sfc_base@sta/ef10_vpd.c.o'
[1084/1631] Compiling C object 'drivers/net/sfc/base/59ea503@@sfc_base@sta/ef10_tx.c.o'
[1085/1631] Compiling C object 'drivers/net/sfc/base/59ea503@@sfc_base@sta/ef10_rx.c.o'
[1086/1631] Compiling C object 'drivers/a715181@@tmp_rte_pmd_octeontx2@sta/net_octeontx2_otx2_tx.c.o'
[1087/1631] Compiling C object 'drivers/a715181@@tmp_rte_pmd_octeontx2@sta/net_octeontx2_otx2_rx.c.o'
ninja: build stopped: subcommand failed




*Meson Build Failed #4:
OS: SUSE15-64
Target:./build-gcc-static
FAILED: drivers/librte_pmd_qede.so.20.0.3 
gcc  -o drivers/librte_pmd_qede.so.20.0.3 'drivers/a715181@@rte_pmd_qede@sha/meson-generated_.._rte_pmd_qede.pmd.c.o' 'drivers/net/qede/base/f6110d5@@qede_base@sta/bcm_osal.c.o' 'drivers/net/qede/base/f6110d5@@qede_base@sta/ecore_cxt.c.o' 'drivers/net/qede/base/f6110d5@@qede_base@sta/ecore_dcbx.c.o' 'drivers/net/qede/base/f6110d5@@qede_base@sta/ecore_dev.c.o' 'drivers/net/qede/base/f6110d5@@qede_base@sta/ecore_hw.c.o' 'drivers/net/qede/base/f6110d5@@qede_base@sta/ecore_init_fw_funcs.c.o' 'drivers/net/qede/base/f6110d5@@qede_base@sta/ecore_init_ops.c.o' 'drivers/net/qede/base/f6110d5@@qede_base@sta/ecore_int.c.o' 'drivers/net/qede/base/f6110d5@@qede_base@sta/ecore_l2.c.o' 'drivers/net/qede/base/f6110d5@@qede_base@sta/ecore_mcp.c.o' 'drivers/net/qede/base/f6110d5@@qede_base@sta/ecore_sp_commands.c.o' 'drivers/net/qede/base/f6110d5@@qede_base@sta/ecore_spq.c.o' 'drivers/net/qede/base/f6110d5@@qede_base@sta/ecore_sriov.c.o' 'drivers/net/qede/base/f6110d5@@qede_base@sta/ecore_vf.c.o' 'drivers/a715181@@tmp_rte_pmd_qede@sta/net_qede_qede_ethdev.c.o' 'drivers/a715181@@tmp_rte_pmd_qede@sta/net_qede_qede_filter.c.o' 'drivers/a715181@@tmp_rte_pmd_qede@sta/net_qede_qede_main.c.o' 'drivers/a715181@@tmp_rte_pmd_qede@sta/net_qede_qede_rxtx.c.o' -Wl,--no-undefined -Wl,--as-needed -shared -fPIC -Wl,--start-group -Wl,-soname,librte_pmd_qede.so.20.0 -Wl,--no-as-needed -pthread -lm -ldl -lnuma lib/librte_ethdev.so.20.0.3 lib/librte_eal.so.20.0.3 lib/librte_kvargs.so.20.0.3 lib/librte_telemetry.so.0.200.3 lib/librte_net.so.20.0.3 lib/librte_mbuf.so.20.0.3 lib/librte_mempool.so.20.0.3 lib/librte_ring.so.20.0.3 lib/librte_meter.so.20.0.3 drivers/librte_bus_pci.so.20.0.3 lib/librte_pci.so.20.0.3 drivers/librte_bus_vdev.so.20.0.3 -Wl,--end-group -Wl,--version-script=/root/SUSE15-64_K4.12.14_GCC7.3.1/x86_64-native-linuxapp-gcc/e0e78fea292145bc8505505d50940328/dpdk/drivers/net/qede/rte_pmd_qede_version.map '-Wl,-rpath,$ORIGIN/../lib:$ORIGIN/' -Wl,-rpath-link,/root/SUSE15-64_K4.12.14_GCC7.3.1/x86_64-native-linuxapp-gcc/e0e78fea292145bc8505505d50940328/dpdk/build-gcc-static/lib:/root/SUSE15-64_K4.12.14_GCC7.3.1/x86_64-native-linuxapp-gcc/e0e78fea292145bc8505505d50940328/dpdk/build-gcc-static/drivers 
/usr/lib64/gcc/x86_64-suse-linux/7/../../../../x86_64-suse-linux/bin/ld: drivers/net/qede/base/f6110d5@@qede_base@sta/ecore_dev.c.o: in function `ecore_resc_alloc':
/root/SUSE15-64_K4.12.14_GCC7.3.1/x86_64-native-linuxapp-gcc/e0e78fea292145bc8505505d50940328/dpdk/build-gcc-static/../drivers/net/qede/base/ecore_dev.c:2515: undefined reference to `qed_dbg_alloc_user_data'
/usr/lib64/gcc/x86_64-suse-linux/7/../../../../x86_64-suse-linux/bin/ld: /root/SUSE15-64_K4.12.14_GCC7.3.1/x86_64-native-linuxapp-gcc/e0e78fea292145bc8505505d50940328/dpdk/build-gcc-static/../drivers/net/qede/base/ecore_dev.c:2522: undefined reference to `qed_dbg_alloc_user_data'
/usr/lib64/gcc/x86_64-suse-linux/7/../../../../x86_64-suse-linux/bin/ld: drivers/a715181@@tmp_rte_pmd_qede@sta/net_qede_qede_ethdev.c.o:(.data.rel.ro+0x530): undefined reference to `qede_get_regs'
/usr/lib64/gcc/x86_64-suse-linux/7/../../../../x86_64-suse-linux/bin/ld: drivers/net/qede/base/f6110d5@@qede_base@sta/bcm_osal.c.o: in function `qede_hw_err_handler':
/root/SUSE15-64_K4.12.14_GCC7.3.1/x86_64-native-linuxapp-gcc/e0e78fea292145bc8505505d50940328/dpdk/build-gcc-static/../drivers/net/qede/base/bcm_osal.c:262: undefined reference to `qede_save_fw_dump'
/usr/lib64/gcc/x86_64-suse-linux/7/../../../../x86_64-suse-linux/bin/ld: drivers/a715181@@tmp_rte_pmd_qede@sta/net_qede_qede_main.c.o: in function `qed_slowpath_start':
/root/SUSE15-64_K4.12.14_GCC7.3.1/x86_64-native-linuxapp-gcc/e0e78fea292145bc8505505d50940328/dpdk/build-gcc-static/../drivers/net/qede/qede_main.c:285: undefined reference to `qed_dbg_pf_init'
/usr/lib64/gcc/x86_64-suse-linux/7/../../../../x86_64-suse-linux/bin/ld: drivers/a715181@@tmp_rte_pmd_qede@sta/net_qede_qede_main.c.o:(.data.rel.ro+0xa8): undefined reference to `qed_dbg_grc'
/usr/lib64/gcc/x86_64-suse-linux/7/../../../../x86_64-suse-linux/bin/ld: drivers/a715181@@tmp_rte_pmd_qede@sta/net_qede_qede_main.c.o:(.data.rel.ro+0xb0): undefined reference to `qed_dbg_grc_size'
/usr/lib64/gcc/x86_64-suse-linux/7/../../../../x86_64-suse-linux/bin/ld: drivers/a715181@@tmp_rte_pmd_qede@sta/net_qede_qede_main.c.o:(.data.rel.ro+0xb8): undefined reference to `qed_dbg_idle_chk'
/usr/lib64/gcc/x86_64-suse-linux/7/../../../../x86_64-suse-linux/bin/ld: drivers/a715181@@tmp_rte_pmd_qede@sta/net_qede_qede_main.c.o:(.data.rel.ro+0xc0): undefined reference to `qed_dbg_idle_chk_size'
/usr/lib64/gcc/x86_64-suse-linux/7/../../../../x86_64-suse-linux/bin/ld: drivers/a715181@@tmp_rte_pmd_qede@sta/net_qede_qede_main.c.o:(.data.rel.ro+0xc8): undefined reference to `qed_dbg_reg_fifo'
/usr/lib64/gcc/x86_64-suse-linux/7/../../../../x86_64-suse-linux/bin/ld: drivers/a715181@@tmp_rte_pmd_qede@sta/net_qede_qede_main.c.o:(.data.rel.ro+0xd0): undefined reference to `qed_dbg_reg_fifo_size'
/usr/lib64/gcc/x86_64-suse-linux/7/../../../../x86_64-suse-linux/bin/ld: drivers/a715181@@tmp_rte_pmd_qede@sta/net_qede_qede_main.c.o:(.data.rel.ro+0xd8): undefined reference to `qed_dbg_mcp_trace'
/usr/lib64/gcc/x86_64-suse-linux/7/../../../../x86_64-suse-linux/bin/ld: drivers/a715181@@tmp_rte_pmd_qede@sta/net_qede_qede_main.c.o:(.data.rel.ro+0xe0): undefined reference to `qed_dbg_mcp_trace_size'
/usr/lib64/gcc/x86_64-suse-linux/7/../../../../x86_64-suse-linux/bin/ld: drivers/a715181@@tmp_rte_pmd_qede@sta/net_qede_qede_main.c.o:(.data.rel.ro+0xe8): undefined reference to `qed_dbg_protection_override'
/usr/lib64/gcc/x86_64-suse-linux/7/../../../../x86_64-suse-linux/bin/ld: drivers/a715181@@tmp_rte_pmd_qede@sta/net_qede_qede_main.c.o:(.data.rel.ro+0xf0): undefined reference to `qed_dbg_protection_override_size'
/usr/lib64/gcc/x86_64-suse-linux/7/../../../../x86_64-suse-linux/bin/ld: drivers/a715181@@tmp_rte_pmd_qede@sta/net_qede_qede_main.c.o:(.data.rel.ro+0xf8): undefined reference to `qed_dbg_igu_fifo_size'
/usr/lib64/gcc/x86_64-suse-linux/7/../../../../x86_64-suse-linux/bin/ld: drivers/a715181@@tmp_rte_pmd_qede@sta/net_qede_qede_main.c.o:(.data.rel.ro+0x100): undefined reference to `qed_dbg_igu_fifo'
/usr/lib64/gcc/x86_64-suse-linux/7/../../../../x86_64-suse-linux/bin/ld: drivers/a715181@@tmp_rte_pmd_qede@sta/net_qede_qede_main.c.o:(.data.rel.ro+0x108): undefined reference to `qed_dbg_fw_asserts'
/usr/lib64/gcc/x86_64-suse-linux/7/../../../../x86_64-suse-linux/bin/ld: drivers/a715181@@tmp_rte_pmd_qede@sta/net_qede_qede_main.c.o:(.data.rel.ro+0x110): undefined reference to `qed_dbg_fw_asserts_size'
/usr/lib64/gcc/x86_64-suse-linux/7/../../../../x86_64-suse-linux/bin/ld: drivers/a715181@@tmp_rte_pmd_qede@sta/net_qede_qede_main.c.o:(.data.rel.ro+0x118): undefined reference to `qed_dbg_ilt'
/usr/lib64/gcc/x86_64-suse-linux/7/../../../../x86_64-suse-linux/bin/ld: drivers/a715181@@tmp_rte_pmd_qede@sta/net_qede_qede_main.c.o:(.data.rel.ro+0x120): undefined reference to `qed_dbg_ilt_size'
/usr/lib64/gcc/x86_64-suse-linux/7/../../../../x86_64-suse-linux/bin/ld: drivers/a715181@@tmp_rte_pmd_qede@sta/net_qede_qede_main.c.o:(.data.rel.ro+0x128): undefined reference to `qed_get_debug_engine'
/usr/lib64/gcc/x86_64-suse-linux/7/../../../../x86_64-suse-linux/bin/ld: drivers/a715181@@tmp_rte_pmd_qede@sta/net_qede_qede_main.c.o:(.data.rel.ro+0x130): undefined reference to `qed_set_debug_engine'
collect2: error: ld returned 1 exit status
[1383/2101] Compiling C object 'drivers/net/sfc/base/59ea503@@sfc_base@sta/medford2_nic.c.o'.
[1384/2101] Compiling C object 'drivers/a715181@@tmp_rte_pmd_octeontx2@sta/net_octeontx2_otx2_tx.c.o'.
[1385/2101] Compiling C object 'drivers/a715181@@tmp_rte_pmd_sfc@sta/net_sfc_sfc_intr.c.o'.
[1386/2101] Compiling C object 'drivers/a715181@@tmp_rte_pmd_sfc@sta/net_sfc_sfc_kvargs.c.o'.
[1387/2101] Compiling C object 'drivers/a715181@@tmp_rte_pmd_sfc@sta/net_sfc_sfc_mcdi.c.o'.
[1388/2101] Compiling C object 'drivers/a715181@@tmp_rte_pmd_sfc@sta/net_sfc_sfc_port.c.o'.
[1389/2101] Compiling C object 'drivers/a715181@@tmp_rte_pmd_sfc@sta/net_sfc_sfc.c.o'.
[1390/2101] Compiling C object 'drivers/a715181@@tmp_rte_pmd_sfc@sta/net_sfc_sfc_ev.c.o'.
[1391/2101] Compiling C object 'drivers/a715181@@tmp_rte_pmd_sfc@sta/net_sfc_sfc_ethdev.c.o'.
ninja: build stopped: subcommand failed




*Meson Build Failed #5:
OS: UB1804-32
Target:./build-gcc-static
FAILED: drivers/librte_pmd_qede.so.20.0.3 
gcc  -o drivers/librte_pmd_qede.so.20.0.3 'drivers/a715181@@rte_pmd_qede@sha/meson-generated_.._rte_pmd_qede.pmd.c.o' 'drivers/net/qede/base/f6110d5@@qede_base@sta/bcm_osal.c.o' 'drivers/net/qede/base/f6110d5@@qede_base@sta/ecore_cxt.c.o' 'drivers/net/qede/base/f6110d5@@qede_base@sta/ecore_dcbx.c.o' 'drivers/net/qede/base/f6110d5@@qede_base@sta/ecore_dev.c.o' 'drivers/net/qede/base/f6110d5@@qede_base@sta/ecore_hw.c.o' 'drivers/net/qede/base/f6110d5@@qede_base@sta/ecore_init_fw_funcs.c.o' 'drivers/net/qede/base/f6110d5@@qede_base@sta/ecore_init_ops.c.o' 'drivers/net/qede/base/f6110d5@@qede_base@sta/ecore_int.c.o' 'drivers/net/qede/base/f6110d5@@qede_base@sta/ecore_l2.c.o' 'drivers/net/qede/base/f6110d5@@qede_base@sta/ecore_mcp.c.o' 'drivers/net/qede/base/f6110d5@@qede_base@sta/ecore_sp_commands.c.o' 'drivers/net/qede/base/f6110d5@@qede_base@sta/ecore_spq.c.o' 'drivers/net/qede/base/f6110d5@@qede_base@sta/ecore_sriov.c.o' 'drivers/net/qede/base/f6110d5@@qede_base@sta/ecore_vf.c.o' 'drivers/a715181@@tmp_rte_pmd_qede@sta/net_qede_qede_ethdev.c.o' 'drivers/a715181@@tmp_rte_pmd_qede@sta/net_qede_qede_filter.c.o' 'drivers/a715181@@tmp_rte_pmd_qede@sta/net_qede_qede_main.c.o' 'drivers/a715181@@tmp_rte_pmd_qede@sta/net_qede_qede_rxtx.c.o' -Wl,--no-undefined -Wl,--as-needed -shared -fPIC -Wl,--start-group -Wl,-soname,librte_pmd_qede.so.20.0 -Wl,--no-as-needed -pthread -lm -ldl -lnuma -m32 lib/librte_ethdev.so.20.0.3 lib/librte_eal.so.20.0.3 lib/librte_kvargs.so.20.0.3 lib/librte_telemetry.so.0.200.3 lib/librte_net.so.20.0.3 lib/librte_mbuf.so.20.0.3 lib/librte_mempool.so.20.0.3 lib/librte_ring.so.20.0.3 lib/librte_meter.so.20.0.3 drivers/librte_bus_pci.so.20.0.3 lib/librte_pci.so.20.0.3 drivers/librte_bus_vdev.so.20.0.3 -Wl,--end-group -Wl,--version-script=/root/UB1804-32_K4.15.0_GCC7.3.0/i686-native-linuxapp-gcc/e0e78fea292145bc8505505d50940328/dpdk/drivers/net/qede/rte_pmd_qede_version.map '-Wl,-rpath,$ORIGIN/../lib:$ORIGIN/' -Wl,-rpath-link,/root/UB1804-32_K4.15.0_GCC7.3.0/i686-native-linuxapp-gcc/e0e78fea292145bc8505505d50940328/dpdk/build-gcc-static/lib:/root/UB1804-32_K4.15.0_GCC7.3.0/i686-native-linuxapp-gcc/e0e78fea292145bc8505505d50940328/dpdk/build-gcc-static/drivers 
/usr/local/bin/ld: drivers/net/qede/base/f6110d5@@qede_base@sta/ecore_dev.c.o: in function `ecore_resc_alloc':
/root/UB1804-32_K4.15.0_GCC7.3.0/i686-native-linuxapp-gcc/e0e78fea292145bc8505505d50940328/dpdk/build-gcc-static/../drivers/net/qede/base/ecore_dev.c:2515: undefined reference to `qed_dbg_alloc_user_data'
/usr/local/bin/ld: /root/UB1804-32_K4.15.0_GCC7.3.0/i686-native-linuxapp-gcc/e0e78fea292145bc8505505d50940328/dpdk/build-gcc-static/../drivers/net/qede/base/ecore_dev.c:2522: undefined reference to `qed_dbg_alloc_user_data'
/usr/local/bin/ld: drivers/a715181@@tmp_rte_pmd_qede@sta/net_qede_qede_ethdev.c.o:(.data.rel.ro+0x298): undefined reference to `qede_get_regs'
/usr/local/bin/ld: drivers/net/qede/base/f6110d5@@qede_base@sta/bcm_osal.c.o: in function `qede_hw_err_handler':
/root/UB1804-32_K4.15.0_GCC7.3.0/i686-native-linuxapp-gcc/e0e78fea292145bc8505505d50940328/dpdk/build-gcc-static/../drivers/net/qede/base/bcm_osal.c:262: undefined reference to `qede_save_fw_dump'
/usr/local/bin/ld: drivers/a715181@@tmp_rte_pmd_qede@sta/net_qede_qede_main.c.o: in function `qed_slowpath_start':
/root/UB1804-32_K4.15.0_GCC7.3.0/i686-native-linuxapp-gcc/e0e78fea292145bc8505505d50940328/dpdk/build-gcc-static/../drivers/net/qede/qede_main.c:285: undefined reference to `qed_dbg_pf_init'
/usr/local/bin/ld: drivers/a715181@@tmp_rte_pmd_qede@sta/net_qede_qede_main.c.o:(.data.rel.ro+0x64): undefined reference to `qed_dbg_grc'
/usr/local/bin/ld: drivers/a715181@@tmp_rte_pmd_qede@sta/net_qede_qede_main.c.o:(.data.rel.ro+0x68): undefined reference to `qed_dbg_grc_size'
/usr/local/bin/ld: drivers/a715181@@tmp_rte_pmd_qede@sta/net_qede_qede_main.c.o:(.data.rel.ro+0x6c): undefined reference to `qed_dbg_idle_chk'
/usr/local/bin/ld: drivers/a715181@@tmp_rte_pmd_qede@sta/net_qede_qede_main.c.o:(.data.rel.ro+0x70): undefined reference to `qed_dbg_idle_chk_size'
/usr/local/bin/ld: drivers/a715181@@tmp_rte_pmd_qede@sta/net_qede_qede_main.c.o:(.data.rel.ro+0x74): undefined reference to `qed_dbg_reg_fifo'
/usr/local/bin/ld: drivers/a715181@@tmp_rte_pmd_qede@sta/net_qede_qede_main.c.o:(.data.rel.ro+0x78): undefined reference to `qed_dbg_reg_fifo_size'
/usr/local/bin/ld: drivers/a715181@@tmp_rte_pmd_qede@sta/net_qede_qede_main.c.o:(.data.rel.ro+0x7c): undefined reference to `qed_dbg_mcp_trace'
/usr/local/bin/ld: drivers/a715181@@tmp_rte_pmd_qede@sta/net_qede_qede_main.c.o:(.data.rel.ro+0x80): undefined reference to `qed_dbg_mcp_trace_size'
/usr/local/bin/ld: drivers/a715181@@tmp_rte_pmd_qede@sta/net_qede_qede_main.c.o:(.data.rel.ro+0x84): undefined reference to `qed_dbg_protection_override'
/usr/local/bin/ld: drivers/a715181@@tmp_rte_pmd_qede@sta/net_qede_qede_main.c.o:(.data.rel.ro+0x88): undefined reference to `qed_dbg_protection_override_size'
/usr/local/bin/ld: drivers/a715181@@tmp_rte_pmd_qede@sta/net_qede_qede_main.c.o:(.data.rel.ro+0x8c): undefined reference to `qed_dbg_igu_fifo_size'
/usr/local/bin/ld: drivers/a715181@@tmp_rte_pmd_qede@sta/net_qede_qede_main.c.o:(.data.rel.ro+0x90): undefined reference to `qed_dbg_igu_fifo'
/usr/local/bin/ld: drivers/a715181@@tmp_rte_pmd_qede@sta/net_qede_qede_main.c.o:(.data.rel.ro+0x94): undefined reference to `qed_dbg_fw_asserts'
/usr/local/bin/ld: drivers/a715181@@tmp_rte_pmd_qede@sta/net_qede_qede_main.c.o:(.data.rel.ro+0x98): undefined reference to `qed_dbg_fw_asserts_size'
/usr/local/bin/ld: drivers/a715181@@tmp_rte_pmd_qede@sta/net_qede_qede_main.c.o:(.data.rel.ro+0x9c): undefined reference to `qed_dbg_ilt'
/usr/local/bin/ld: drivers/a715181@@tmp_rte_pmd_qede@sta/net_qede_qede_main.c.o:(.data.rel.ro+0xa0): undefined reference to `qed_dbg_ilt_size'
/usr/local/bin/ld: drivers/a715181@@tmp_rte_pmd_qede@sta/net_qede_qede_main.c.o:(.data.rel.ro+0xa4): undefined reference to `qed_get_debug_engine'
/usr/local/bin/ld: drivers/a715181@@tmp_rte_pmd_qede@sta/net_qede_qede_main.c.o:(.data.rel.ro+0xa8): undefined reference to `qed_set_debug_engine'
collect2: error: ld returned 1 exit status
[1300/1953] Compiling C object 'drivers/a715181@@tmp_rte_pmd_thunderx@sta/net_thunderx_nicvf_rxtx.c.o'.
[1301/1953] Compiling C object 'drivers/net/thunderx/base/80ab7c6@@nicvf_base@sta/nicvf_mbox.c.o'.
[1302/1953] Compiling C object 'drivers/a715181@@tmp_rte_pmd_vdev_netvsc@sta/net_vdev_netvsc_vdev_netvsc.c.o'.
[1303/1953] Compiling C object 'drivers/a715181@@tmp_rte_pmd_tap@sta/net_tap_rte_eth_tap.c.o'.
[1304/1953] Compiling C object 'drivers/a715181@@tmp_rte_pmd_softnic@sta/net_softnic_rte_eth_softnic_cli.c.o'.
[1305/1953] Compiling C object 'drivers/a715181@@tmp_rte_pmd_virtio@sta/net_virtio_virtio_pci.c.o'.
[1306/1953] Compiling C object 'drivers/a715181@@tmp_rte_pmd_vhost@sta/net_vhost_rte_eth_vhost.c.o'.
[1307/1953] Compiling C object 'drivers/a715181@@tmp_rte_pmd_virtio@sta/net_virtio_virtio_ethdev.c.o'.
[1308/1953] Compiling C object 'drivers/a715181@@tmp_rte_pmd_thunderx@sta/net_thunderx_nicvf_ethdev.c.o'.
[1309/1953] Compiling C object 'drivers/a715181@@tmp_rte_pmd_octeontx2@sta/net_octeontx2_otx2_tx.c.o'.
[1310/1953] Compiling C object 'drivers/a715181@@tmp_rte_pmd_octeontx2@sta/net_octeontx2_otx2_rx.c.o'.
ninja: build stopped: subcommand failed




*Meson Build Failed #6:
OS: UB2004-64
Target:./build-gcc-static
FAILED: drivers/librte_pmd_qede.so.20.0.3 
gcc  -o drivers/librte_pmd_qede.so.20.0.3 'drivers/a715181@@rte_pmd_qede@sha/meson-generated_.._rte_pmd_qede.pmd.c.o' 'drivers/net/qede/base/f6110d5@@qede_base@sta/bcm_osal.c.o' 'drivers/net/qede/base/f6110d5@@qede_base@sta/ecore_cxt.c.o' 'drivers/net/qede/base/f6110d5@@qede_base@sta/ecore_dcbx.c.o' 'drivers/net/qede/base/f6110d5@@qede_base@sta/ecore_dev.c.o' 'drivers/net/qede/base/f6110d5@@qede_base@sta/ecore_hw.c.o' 'drivers/net/qede/base/f6110d5@@qede_base@sta/ecore_init_fw_funcs.c.o' 'drivers/net/qede/base/f6110d5@@qede_base@sta/ecore_init_ops.c.o' 'drivers/net/qede/base/f6110d5@@qede_base@sta/ecore_int.c.o' 'drivers/net/qede/base/f6110d5@@qede_base@sta/ecore_l2.c.o' 'drivers/net/qede/base/f6110d5@@qede_base@sta/ecore_mcp.c.o' 'drivers/net/qede/base/f6110d5@@qede_base@sta/ecore_sp_commands.c.o' 'drivers/net/qede/base/f6110d5@@qede_base@sta/ecore_spq.c.o' 'drivers/net/qede/base/f6110d5@@qede_base@sta/ecore_sriov.c.o' 'drivers/net/qede/base/f6110d5@@qede_base@sta/ecore_vf.c.o' 'drivers/a715181@@tmp_rte_pmd_qede@sta/net_qede_qede_ethdev.c.o' 'drivers/a715181@@tmp_rte_pmd_qede@sta/net_qede_qede_filter.c.o' 'drivers/a715181@@tmp_rte_pmd_qede@sta/net_qede_qede_main.c.o' 'drivers/a715181@@tmp_rte_pmd_qede@sta/net_qede_qede_rxtx.c.o' -Wl,--as-needed -Wl,--no-undefined -shared -fPIC -Wl,--start-group -Wl,-soname,librte_pmd_qede.so.20.0 -Wl,--no-as-needed -pthread -lm -ldl -lnuma lib/librte_ethdev.so.20.0.3 lib/librte_eal.so.20.0.3 lib/librte_kvargs.so.20.0.3 lib/librte_telemetry.so.0.200.3 lib/librte_net.so.20.0.3 lib/librte_mbuf.so.20.0.3 lib/librte_mempool.so.20.0.3 lib/librte_ring.so.20.0.3 lib/librte_meter.so.20.0.3 drivers/librte_bus_pci.so.20.0.3 lib/librte_pci.so.20.0.3 drivers/librte_bus_vdev.so.20.0.3 -Wl,--end-group -Wl,--version-script=/root/UB2004-64_K5.4.0_GCC9.3.0/x86_64-native-linuxapp-gcc/e0e78fea292145bc8505505d50940328/dpdk/drivers/net/qede/rte_pmd_qede_version.map '-Wl,-rpath,$ORIGIN/../lib:$ORIGIN/' -Wl,-rpath-link,/root/UB2004-64_K5.4.0_GCC9.3.0/x86_64-native-linuxapp-gcc/e0e78fea292145bc8505505d50940328/dpdk/build-gcc-static/lib -Wl,-rpath-link,/root/UB2004-64_K5.4.0_GCC9.3.0/x86_64-native-linuxapp-gcc/e0e78fea292145bc8505505d50940328/dpdk/build-gcc-static/drivers
/usr/bin/ld: drivers/net/qede/base/f6110d5@@qede_base@sta/bcm_osal.c.o: in function `qede_hw_err_handler':
/root/UB2004-64_K5.4.0_GCC9.3.0/x86_64-native-linuxapp-gcc/e0e78fea292145bc8505505d50940328/dpdk/build-gcc-static/../drivers/net/qede/base/bcm_osal.c:262: undefined reference to `qede_save_fw_dump'
/usr/bin/ld: drivers/net/qede/base/f6110d5@@qede_base@sta/ecore_dev.c.o: in function `ecore_resc_alloc':
/root/UB2004-64_K5.4.0_GCC9.3.0/x86_64-native-linuxapp-gcc/e0e78fea292145bc8505505d50940328/dpdk/build-gcc-static/../drivers/net/qede/base/ecore_dev.c:2515: undefined reference to `qed_dbg_alloc_user_data'
/usr/bin/ld: /root/UB2004-64_K5.4.0_GCC9.3.0/x86_64-native-linuxapp-gcc/e0e78fea292145bc8505505d50940328/dpdk/build-gcc-static/../drivers/net/qede/base/ecore_dev.c:2522: undefined reference to `qed_dbg_alloc_user_data'
/usr/bin/ld: drivers/a715181@@tmp_rte_pmd_qede@sta/net_qede_qede_ethdev.c.o:(.data.rel.ro+0x530): undefined reference to `qede_get_regs'
/usr/bin/ld: drivers/a715181@@tmp_rte_pmd_qede@sta/net_qede_qede_main.c.o: in function `qed_slowpath_start':
/root/UB2004-64_K5.4.0_GCC9.3.0/x86_64-native-linuxapp-gcc/e0e78fea292145bc8505505d50940328/dpdk/build-gcc-static/../drivers/net/qede/qede_main.c:285: undefined reference to `qed_dbg_pf_init'
/usr/bin/ld: drivers/a715181@@tmp_rte_pmd_qede@sta/net_qede_qede_main.c.o:(.data.rel.ro+0xa8): undefined reference to `qed_dbg_grc'
/usr/bin/ld: drivers/a715181@@tmp_rte_pmd_qede@sta/net_qede_qede_main.c.o:(.data.rel.ro+0xb0): undefined reference to `qed_dbg_grc_size'
/usr/bin/ld: drivers/a715181@@tmp_rte_pmd_qede@sta/net_qede_qede_main.c.o:(.data.rel.ro+0xb8): undefined reference to `qed_dbg_idle_chk'
/usr/bin/ld: drivers/a715181@@tmp_rte_pmd_qede@sta/net_qede_qede_main.c.o:(.data.rel.ro+0xc0): undefined reference to `qed_dbg_idle_chk_size'
/usr/bin/ld: drivers/a715181@@tmp_rte_pmd_qede@sta/net_qede_qede_main.c.o:(.data.rel.ro+0xc8): undefined reference to `qed_dbg_reg_fifo'
/usr/bin/ld: drivers/a715181@@tmp_rte_pmd_qede@sta/net_qede_qede_main.c.o:(.data.rel.ro+0xd0): undefined reference to `qed_dbg_reg_fifo_size'
/usr/bin/ld: drivers/a715181@@tmp_rte_pmd_qede@sta/net_qede_qede_main.c.o:(.data.rel.ro+0xd8): undefined reference to `qed_dbg_mcp_trace'
/usr/bin/ld: drivers/a715181@@tmp_rte_pmd_qede@sta/net_qede_qede_main.c.o:(.data.rel.ro+0xe0): undefined reference to `qed_dbg_mcp_trace_size'
/usr/bin/ld: drivers/a715181@@tmp_rte_pmd_qede@sta/net_qede_qede_main.c.o:(.data.rel.ro+0xe8): undefined reference to `qed_dbg_protection_override'
/usr/bin/ld: drivers/a715181@@tmp_rte_pmd_qede@sta/net_qede_qede_main.c.o:(.data.rel.ro+0xf0): undefined reference to `qed_dbg_protection_override_size'
/usr/bin/ld: drivers/a715181@@tmp_rte_pmd_qede@sta/net_qede_qede_main.c.o:(.data.rel.ro+0xf8): undefined reference to `qed_dbg_igu_fifo_size'
/usr/bin/ld: drivers/a715181@@tmp_rte_pmd_qede@sta/net_qede_qede_main.c.o:(.data.rel.ro+0x100): undefined reference to `qed_dbg_igu_fifo'
/usr/bin/ld: drivers/a715181@@tmp_rte_pmd_qede@sta/net_qede_qede_main.c.o:(.data.rel.ro+0x108): undefined reference to `qed_dbg_fw_asserts'
/usr/bin/ld: drivers/a715181@@tmp_rte_pmd_qede@sta/net_qede_qede_main.c.o:(.data.rel.ro+0x110): undefined reference to `qed_dbg_fw_asserts_size'
/usr/bin/ld: drivers/a715181@@tmp_rte_pmd_qede@sta/net_qede_qede_main.c.o:(.data.rel.ro+0x118): undefined reference to `qed_dbg_ilt'
/usr/bin/ld: drivers/a715181@@tmp_rte_pmd_qede@sta/net_qede_qede_main.c.o:(.data.rel.ro+0x120): undefined reference to `qed_dbg_ilt_size'
/usr/bin/ld: drivers/a715181@@tmp_rte_pmd_qede@sta/net_qede_qede_main.c.o:(.data.rel.ro+0x128): undefined reference to `qed_get_debug_engine'
/usr/bin/ld: drivers/a715181@@tmp_rte_pmd_qede@sta/net_qede_qede_main.c.o:(.data.rel.ro+0x130): undefined reference to `qed_set_debug_engine'
collect2: error: ld returned 1 exit status
[1395/2189] Compiling C object 'drivers/net/sfc/base/59ea503@@sfc_base@sta/ef10_vpd.c.o'.
[1396/2189] Compiling C object 'drivers/net/sfc/base/59ea503@@sfc_base@sta/ef10_rx.c.o'.
[1397/2189] Compiling C object 'drivers/net/sfc/base/59ea503@@sfc_base@sta/hunt_nic.c.o'.
[1398/2189] Compiling C object 'drivers/net/sfc/base/59ea503@@sfc_base@sta/ef10_tx.c.o'.
[1399/2189] Compiling C object 'drivers/net/sfc/base/59ea503@@sfc_base@sta/medford_nic.c.o'.
[1400/2189] Compiling C object 'drivers/net/sfc/base/59ea503@@sfc_base@sta/medford2_nic.c.o'.
[1401/2189] Compiling C object 'drivers/a715181@@tmp_rte_pmd_sfc@sta/net_sfc_sfc.c.o'.
[1402/2189] Compiling C object 'drivers/a715181@@tmp_rte_pmd_sfc@sta/net_sfc_sfc_intr.c.o'.
[1403/2189] Compiling C object 'drivers/a715181@@tmp_rte_pmd_sfc@sta/net_sfc_sfc_ev.c.o'.
[1404/2189] Compiling C object 'drivers/a715181@@tmp_rte_pmd_octeontx2@sta/net_octeontx2_otx2_rx.c.o'.
[1405/2189] Compiling C object 'drivers/a715181@@tmp_rte_pmd_octeontx2@sta/net_octeontx2_otx2_tx.c.o'.
ninja: build stopped: subcommand failed


DPDK STV team

^ permalink raw reply	[flat|nested] only message in thread

only message in thread, back to index

Thread overview: (only message) (download: mbox.gz / follow: Atom feed)
-- links below jump to the message on this page --
2020-06-29 13:02 [dpdk-test-report] |FAILURE| pw(72372) [4/4] net/qede: add support for get register operation sys_stv

automatic DPDK test reports

Archives are clonable:
	git clone --mirror http://inbox.dpdk.org/test-report/0 test-report/git/0.git

	# If you have public-inbox 1.1+ installed, you may
	# initialize and index your mirror using the following commands:
	public-inbox-init -V2 test-report test-report/ http://inbox.dpdk.org/test-report \
		test-report@dpdk.org
	public-inbox-index test-report


Newsgroup available over NNTP:
	nntp://inbox.dpdk.org/inbox.dpdk.test-report


AGPL code for this site: git clone https://public-inbox.org/ public-inbox