automatic DPDK test reports
 help / color / Atom feed
* [dpdk-test-report]  |FAILURE| pw(72413) [v10, 07/10] drivers: fix incorrect meson import folder for Windows
@ 2020-06-29 14:09 sys_stv
  0 siblings, 0 replies; only message in thread
From: sys_stv @ 2020-06-29 14:09 UTC (permalink / raw)
  To: test-report

[-- Attachment #1: Type: text/plain, Size: 17380 bytes --]


Test-Label: Intel-compilation
Test-Status: FAILURE
http://dpdk.org/patch/72413

_Compilation issues_

Submitter: Tal Shnaiderman <talshn@mellanox.com>
Date: 2020-06-29 12:37:38
Reply_mail: 20200629123741.20716-8-talshn@mellanox.com

DPDK git baseline: Repo:dpdk, CommitID: 6248368a9ae1eadf6b7fb05ab37497afdb714429


Meson build Summary: 8 Builds Done, 7 Successful, 1 Failures, 0 Blocked

Makefile build Summary: 20 Builds Done, 16 Successful, 4 Failures, 0 Blocked

                +==============================================+===========+==========+
                |                   Makefile                   |   Meson   | Document |
+----------------+------+-------+------+------------+-----------+-----------+----------+
| os             | gcc  | clang | icc  | gcc+shared | gcc+debug | gcc/clang | pdf/html |
+----------------+------+-------+------+------------+-----------+-----------+----------+
| CENTOS82-64    | pass | pass  | pass | pass       | pass      | pass      |          |
| RHEL82-64      | pass |       |      |            |           |           |          |
| UB1804-64      | pass |       |      |            |           |           |          |
| FC32-64        | pass | pass  |      |            |           | pass      |          |
| CENTOS77-64    | pass |       |      |            |           |           |          |
| UB2004-64      | pass | pass  | pass |            |           | pass      | pass     |
| WIN10-64       |      |       |      |            |           | pass      |          |
| UB2004-32      | pass |       |      |            |           |           |          |
| UB1804-32      |      |       |      |            |           | pass      |          |
| FreeBSD1201-64 | FAIL | FAIL  |      | FAIL       | FAIL      | FAIL      |          |
| SUSE15-64      | pass | pass  |      |            |           | pass      |          |
+----------------+------+-------+------+------------+-----------+-----------+----------+
Test environment and configuration as below:

** Makefile build **


OS: CENTOS82-64
	Kernel Version: 4.18.0-193.el8.x86_64
	CPU info: Intel(R) Xeon(R) Platinum 8280M CPU @ 2.70GHz
	GCC Version: gcc (GCC) 8.3.1 20191121 (Red Hat 8.3.1-5)
	Clang Version: 9.0.1 (Red Hat 9.0.1-2.module_el8.2.0+309+0c7b6b03)
	x86_64-native-linuxapp-gcc
	x86_64-native-linuxapp-clang
	x86_64-native-linuxapp-icc
	x86_64-native-linuxapp-gcc+shared
	x86_64-native-linuxapp-gcc+debug


OS: RHEL82-64
	Kernel Version: 4.18.0-193.el8.x86_64
	CPU info: Intel(R) Xeon(R) Platinum 8280M CPU @ 2.70GHz
	GCC Version: gcc (GCC) 8.3.1 20191121 (Red Hat 8.3.1-5)
	Clang Version: 8.0.1 (Red Hat 8.0.1-1.module_el8.1.0+215+a01033fb)
	x86_64-native-linuxapp-gcc


OS: UB1804-64
	Kernel Version: 4.15.0-29-generic
	CPU info: Intel(R) Xeon(R) Platinum 8180 CPU @ 2.50GHz
	GCC Version: gcc (Ubuntu 7.5.0-3ubuntu1~18.04) 7.5.0
	Clang Version: 6.0.0-1ubuntu2 (tags/RELEASE_600/final)
	x86_64-native-linuxapp-gcc


OS: FC32-64
	Kernel Version: 5.6.0-0.rc7.git0.2.fc32.x86_64
	CPU info: Intel(R) Xeon(R) Platinum 8280M CPU @ 2.70GHz
	GCC Version: gcc (GCC) 10.0.1 20200311 (Red Hat 10.0.1-0.9)
	Clang Version: 10.0.0 (Fedora 10.0.0-0.3.rc4.fc32)
	x86_64-native-linuxapp-gcc
	x86_64-native-linuxapp-clang


OS: CENTOS77-64
	Kernel Version: 3.10.0-1062.9.1.el7.x86_64
	CPU info: Intel(R) Xeon(R) Platinum 8280M CPU @ 2.70GHz
	GCC Version: gcc (GCC) 4.8.5 20150623 (Red Hat 4.8.5-39)
	Clang Version: 3.4.2 (tags/RELEASE_34/dot2-final)
	x86_64-native-linuxapp-gcc


OS: UB2004-64
	Kernel Version: 5.4.0-26-generic
	CPU info: Intel(R) Xeon(R) Platinum 8180 CPU @ 2.50GHz
	GCC Version: gcc (Ubuntu 10-20200416-0ubuntu1) 10.0.1 20200416 (experimental) [master revision 3c3f12e2a76:dcee354ce56:44b326839d864fc10c459916abcc97f35a9ac3de]
	Clang Version: 10.0.0-4ubuntu1
	x86_64-native-linuxapp-clang
	x86_64-native-linuxapp-gcc
	x86_64-native-linuxapp-icc


OS: UB2004-32
	Kernel Version: 5.4.0-26-generic
	CPU info: Intel(R) Xeon(R) Platinum 8180 CPU @ 2.50GHz
	GCC Version: gcc (Ubuntu 9.3.0-10ubuntu2) 9.3.0
	Clang Version: 10.0.0-4ubuntu1
	i686-native-linuxapp-gcc


OS: FreeBSD1201-64
	Kernel Version: 12.1-RELEASE
	CPU info: Intel(R) Xeon(R) CPU E5-2699 v3 @ 2.30GHz (2294.74-MHz K8-class CPU)
	GCC Version: gcc (FreeBSD Ports Collection) 9.2.0
	Clang Version: 8.0.1 (tags/RELEASE_801/final 366581) (based on LLVM 8.0.1)
	x86_64-native-bsdapp-gcc
	x86_64-native-bsdapp-clang
	x86_64-native-bsdapp-gcc+shared
	x86_64-native-bsdapp-gcc+debug


OS: SUSE15-64
	Kernel Version: 4.12.14-lp150.11-default
	CPU info: Intel(R) Xeon(R) CPU E5-2699 v4 @ 2.20GHz
	GCC Version: gcc (SUSE Linux) 7.3.1 20180323 [gcc-7-branch revision 258812]
	Clang Version: 5.0.1 (tags/RELEASE_501/final 312548)
	x86_64-native-linuxapp-clang
	x86_64-native-linuxapp-gcc

** Meson build **


OS: CENTOS82-64
	Kernel Version: 4.18.0-193.el8.x86_64
	CPU info: Intel(R) Xeon(R) CPU E5-2699 v4 @ 2.20GHz
	GCC Version: gcc (GCC) 8.3.1 20191121 (Red Hat 8.3.1-5)
	Clang Version: 9.0.1 (Red Hat 9.0.1-2.module_el8.2.0+309+0c7b6b03)
	./build-gcc-static
	./build-gcc-shared
	./build-clang-static
	./build-clang-shared
	./build-x86-default


OS: UB2004-64
	Kernel Version: 5.4.0-26-generic
	CPU info: Intel(R) Xeon(R) Platinum 8180 CPU @ 2.50GHz
	GCC Version: gcc (Ubuntu 9.3.0-10ubuntu2) 9.3.0
	Clang Version: 10.0.0-4ubuntu1
	x86_64-native-linuxapp-doc
	./build-gcc-static
	./build-gcc-shared
	./build-clang-static
	./build-clang-shared
	./build-x86-default


OS: FC32-64
	Kernel Version: 5.6.0-0.rc7.git0.2.fc32.x86_64
	CPU info: Intel(R) Xeon(R) CPU E5-2699 v4 @ 2.20GHz
	GCC Version: gcc (GCC) 10.0.1 20200311 (Red Hat 10.0.1-0.9)
	Clang Version: 10.0.0 (Fedora 10.0.0-0.3.rc4.fc32)
	./build-gcc-static
	./build-gcc-shared
	./build-clang-static
	./build-clang-shared
	./build-x86-default


OS: WIN10-64
	Kernel Version: N/A
	CPU info: N/A
	GCC Version: N/A
	Clang Version: Clang 8.0.0
	x86_64-windows-clang


OS: UB1804-32
	Kernel Version: 4.15.0-20-generic
	CPU info: Intel(R) Xeon(R) CPU E5-2699 v4 @ 2.20GHz
	GCC Version: gcc (Ubuntu 7.5.0-3ubuntu1~18.04) 7.5.0
	Clang Version: 6.0.0-1ubuntu2 (tags/RELEASE_600/final)
	./build-gcc-static
	./build-gcc-shared
	./build-clang-static
	./build-clang-shared
	./build-x86-default


OS: FreeBSD1201-64
	Kernel Version: 12.1-RELEASE
	CPU info: Intel(R) Xeon(R) CPU E5-2699 v4 @ 2.20GHz (2194.97-MHz K8-class CPU)
	GCC Version: gcc (FreeBSD Ports Collection) 9.2.0
	Clang Version: 8.0.1 (tags/RELEASE_801/final 366581) (based on LLVM 8.0.1)
	./build-gcc-static
	./build-gcc-shared
	./build-clang-static
	./build-clang-shared
	./build-x86-default


OS: SUSE15-64
	Kernel Version: 4.12.14-lp150.12.82-default
	CPU info: Intel(R) Xeon(R) CPU E5-2699 v4 @ 2.20GHz
	GCC Version: gcc (SUSE Linux) 7.4.1 20190905 [gcc-7-branch revision 275407]
	Clang Version: 5.0.1 (tags/RELEASE_501/final 312548)
	./build-gcc-static
	./build-gcc-shared
	./build-clang-static
	./build-clang-shared
	./build-x86-default



*Meson Build Failed #1:
OS: FreeBSD1201-64
Target:./build-gcc-static
FAILED: lib/76b5a35@@rte_eal@sta/librte_eal_freebsd_eal.c.o 
gcc -Ilib/76b5a35@@rte_eal@sta -Ilib -I../lib -I. -I.. -Iconfig -I../config -Ilib/librte_eal/include -I../lib/librte_eal/include -Ilib/librte_eal/freebsd/include -I../lib/librte_eal/freebsd/include -Ilib/librte_eal/x86/include -I../lib/librte_eal/x86/include -Ilib/librte_eal/common -I../lib/librte_eal/common -Ilib/librte_eal -I../lib/librte_eal -Ilib/librte_kvargs -I../lib/librte_kvargs -Ilib/librte_metrics -I../lib/librte_metrics -Ilib/librte_telemetry -I../lib/librte_telemetry -fdiagnostics-color=always -pipe -D_FILE_OFFSET_BITS=64 -Wall -Winvalid-pch -Werror -O2 -g -include rte_config.h -Wextra -Wcast-qual -Wdeprecated -Wformat-nonliteral -Wformat-security -Wmissing-declarations -Wmissing-prototypes -Wnested-externs -Wold-style-definition -Wpointer-arith -Wsign-compare -Wstrict-prototypes -Wundef -Wwrite-strings -Wno-address-of-packed-member -Wno-packed-not-aligned -Wno-missing-field-initializers -D_GNU_SOURCE -D__BSD_VISIBLE -fPIC -march=native -DALLOW_EXPERIMENTAL_API -DALLOW_INTERNAL_API -Wno-format-truncation -DRTE_LIBEAL_USE_GETENTROPY -DHAVE_GETOPT_H -DHAVE_GETOPT -DHAVE_GETOPT_LONG -MD -MQ 'lib/76b5a35@@rte_eal@sta/librte_eal_freebsd_eal.c.o' -MF 'lib/76b5a35@@rte_eal@sta/librte_eal_freebsd_eal.c.o.d' -o 'lib/76b5a35@@rte_eal@sta/librte_eal_freebsd_eal.c.o' -c ../lib/librte_eal/freebsd/eal.c
../lib/librte_eal/freebsd/eal.c: In function 'rte_eal_config_create':
../lib/librte_eal/freebsd/eal.c:187:26: error: 'rte_mem_config' undeclared (first use in this function)
  187 |  size_t cfg_len = sizeof(rte_mem_config);
      |                          ^~~~~~~~~~~~~~
../lib/librte_eal/freebsd/eal.c:187:26: note: each undeclared identifier is reported only once for each function it appears in
[52/1739] Compiling C object 'lib/76b5a35@@rte_eal@sta/librte_eal_freebsd_eal_cpuflags.c.o'
[53/1739] Generating telemetry.sym_chk with a meson_exe.py custom command
[54/1739] Compiling C object 'lib/76b5a35@@rte_eal@sta/librte_eal_common_rte_service.c.o'
[55/1739] Compiling C object 'lib/76b5a35@@rte_eal@sta/librte_eal_common_rte_random.c.o'
[56/1739] Compiling C object 'lib/76b5a35@@rte_eal@sta/librte_eal_freebsd_eal_alarm.c.o'
[57/1739] Compiling C object 'lib/76b5a35@@rte_eal@sta/librte_eal_common_eal_common_options.c.o'
[58/1739] Generating symbol file 'lib/76b5a35@@rte_kvargs@sha/librte_kvargs.so.20.0.3.symbols'
WARNING: Symbol extracting has not been implemented for this platform. Relinking will always happen on source changes.
[59/1739] Compiling C object 'lib/76b5a35@@rte_eal@sta/librte_eal_common_malloc_heap.c.o'
[60/1739] Compiling C object 'lib/76b5a35@@rte_eal@sta/librte_eal_common_rte_malloc.c.o'
ninja: build stopped: subcommand failed



*Makefile Build Failed #1:
OS: FreeBSD1201-64
Target: x86_64-native-bsdapp-gcc
  CC eal_memalloc.o
  CC eal_lcore.o
/root/FreeBSD1201-64_K12.1_GCC9.2.0/x86_64-native-bsdapp-gcc/7a19b545d8f94273b2600eb7aee26723/dpdk/lib/librte_eal/freebsd/eal.c: In function 'rte_eal_config_create':
/root/FreeBSD1201-64_K12.1_GCC9.2.0/x86_64-native-bsdapp-gcc/7a19b545d8f94273b2600eb7aee26723/dpdk/lib/librte_eal/freebsd/eal.c:187:26: error: 'rte_mem_config' undeclared (first use in this function)
  187 |  size_t cfg_len = sizeof(rte_mem_config);
      |                          ^~~~~~~~~~~~~~
/root/FreeBSD1201-64_K12.1_GCC9.2.0/x86_64-native-bsdapp-gcc/7a19b545d8f94273b2600eb7aee26723/dpdk/lib/librte_eal/freebsd/eal.c:187:26: note: each undeclared identifier is reported only once for each function it appears in
  CC eal_timer.o
  CC eal_interrupts.o
gmake[6]: *** [/root/FreeBSD1201-64_K12.1_GCC9.2.0/x86_64-native-bsdapp-gcc/7a19b545d8f94273b2600eb7aee26723/dpdk/mk/internal/rte.compile-pre.mk:116: eal.o] Error 1
gmake[6]: *** Waiting for unfinished jobs....
gmake[5]: *** [/root/FreeBSD1201-64_K12.1_GCC9.2.0/x86_64-native-bsdapp-gcc/7a19b545d8f94273b2600eb7aee26723/dpdk/mk/rte.subdir.mk:37: freebsd] Error 2
gmake[4]: *** [/root/FreeBSD1201-64_K12.1_GCC9.2.0/x86_64-native-bsdapp-gcc/7a19b545d8f94273b2600eb7aee26723/dpdk/mk/rte.subdir.mk:37: librte_eal] Error 2
gmake[3]: *** [/root/FreeBSD1201-64_K12.1_GCC9.2.0/x86_64-native-bsdapp-gcc/7a19b545d8f94273b2600eb7aee26723/dpdk/mk/rte.sdkbuild.mk:53: lib] Error 2
gmake[2]: *** [/root/FreeBSD1201-64_K12.1_GCC9.2.0/x86_64-native-bsdapp-gcc/7a19b545d8f94273b2600eb7aee26723/dpdk/mk/rte.sdkroot.mk:99: all] Error 2
gmake[1]: *** [/root/FreeBSD1201-64_K12.1_GCC9.2.0/x86_64-native-bsdapp-gcc/7a19b545d8f94273b2600eb7aee26723/dpdk/mk/rte.sdkinstall.mk:61: pre_install] Error 2
gmake: *** [/root/FreeBSD1201-64_K12.1_GCC9.2.0/x86_64-native-bsdapp-gcc/7a19b545d8f94273b2600eb7aee26723/dpdk/mk/rte.sdkroot.mk:77: install] Error 2


*Makefile Build Failed #2:
OS: FreeBSD1201-64
Target: x86_64-native-bsdapp-clang
  CC eal_memalloc.o
  CC eal_timer.o
  CC eal_interrupts.o
/root/FreeBSD1201-64_K12.1_Clang8.0.1/x86_64-native-bsdapp-clang/7a19b545d8f94273b2600eb7aee26723/dpdk/lib/librte_eal/freebsd/eal.c:187:26: error: use of undeclared identifier 'rte_mem_config'
        size_t cfg_len = sizeof(rte_mem_config);
                                ^
1 error generated.
gmake[6]: *** [/root/FreeBSD1201-64_K12.1_Clang8.0.1/x86_64-native-bsdapp-clang/7a19b545d8f94273b2600eb7aee26723/dpdk/mk/internal/rte.compile-pre.mk:116: eal.o] Error 1
gmake[6]: *** Waiting for unfinished jobs....
gmake[5]: *** [/root/FreeBSD1201-64_K12.1_Clang8.0.1/x86_64-native-bsdapp-clang/7a19b545d8f94273b2600eb7aee26723/dpdk/mk/rte.subdir.mk:37: freebsd] Error 2
gmake[4]: *** [/root/FreeBSD1201-64_K12.1_Clang8.0.1/x86_64-native-bsdapp-clang/7a19b545d8f94273b2600eb7aee26723/dpdk/mk/rte.subdir.mk:37: librte_eal] Error 2
gmake[3]: *** [/root/FreeBSD1201-64_K12.1_Clang8.0.1/x86_64-native-bsdapp-clang/7a19b545d8f94273b2600eb7aee26723/dpdk/mk/rte.sdkbuild.mk:53: lib] Error 2
gmake[2]: *** [/root/FreeBSD1201-64_K12.1_Clang8.0.1/x86_64-native-bsdapp-clang/7a19b545d8f94273b2600eb7aee26723/dpdk/mk/rte.sdkroot.mk:99: all] Error 2
gmake[1]: *** [/root/FreeBSD1201-64_K12.1_Clang8.0.1/x86_64-native-bsdapp-clang/7a19b545d8f94273b2600eb7aee26723/dpdk/mk/rte.sdkinstall.mk:61: pre_install] Error 2
gmake: *** [/root/FreeBSD1201-64_K12.1_Clang8.0.1/x86_64-native-bsdapp-clang/7a19b545d8f94273b2600eb7aee26723/dpdk/mk/rte.sdkroot.mk:77: install] Error 2


*Makefile Build Failed #3:
OS: FreeBSD1201-64
Target: x86_64-native-bsdapp-gcc+shared
  CC eal_lcore.o
  CC eal_memalloc.o
/root/FreeBSD1201-64_K12.1_GCC7.3.0/x86_64-native-bsdapp-gcc+shared/7a19b545d8f94273b2600eb7aee26723/dpdk/lib/librte_eal/freebsd/eal.c: In function 'rte_eal_config_create':
/root/FreeBSD1201-64_K12.1_GCC7.3.0/x86_64-native-bsdapp-gcc+shared/7a19b545d8f94273b2600eb7aee26723/dpdk/lib/librte_eal/freebsd/eal.c:187:26: error: 'rte_mem_config' undeclared (first use in this function)
  187 |  size_t cfg_len = sizeof(rte_mem_config);
      |                          ^~~~~~~~~~~~~~
/root/FreeBSD1201-64_K12.1_GCC7.3.0/x86_64-native-bsdapp-gcc+shared/7a19b545d8f94273b2600eb7aee26723/dpdk/lib/librte_eal/freebsd/eal.c:187:26: note: each undeclared identifier is reported only once for each function it appears in
  CC eal_interrupts.o
gmake[6]: *** [/root/FreeBSD1201-64_K12.1_GCC7.3.0/x86_64-native-bsdapp-gcc+shared/7a19b545d8f94273b2600eb7aee26723/dpdk/mk/internal/rte.compile-pre.mk:116: eal.o] Error 1
gmake[6]: *** Waiting for unfinished jobs....
  CC eal_timer.o
gmake[5]: *** [/root/FreeBSD1201-64_K12.1_GCC7.3.0/x86_64-native-bsdapp-gcc+shared/7a19b545d8f94273b2600eb7aee26723/dpdk/mk/rte.subdir.mk:37: freebsd] Error 2
gmake[4]: *** [/root/FreeBSD1201-64_K12.1_GCC7.3.0/x86_64-native-bsdapp-gcc+shared/7a19b545d8f94273b2600eb7aee26723/dpdk/mk/rte.subdir.mk:37: librte_eal] Error 2
gmake[3]: *** [/root/FreeBSD1201-64_K12.1_GCC7.3.0/x86_64-native-bsdapp-gcc+shared/7a19b545d8f94273b2600eb7aee26723/dpdk/mk/rte.sdkbuild.mk:53: lib] Error 2
gmake[2]: *** [/root/FreeBSD1201-64_K12.1_GCC7.3.0/x86_64-native-bsdapp-gcc+shared/7a19b545d8f94273b2600eb7aee26723/dpdk/mk/rte.sdkroot.mk:99: all] Error 2
gmake[1]: *** [/root/FreeBSD1201-64_K12.1_GCC7.3.0/x86_64-native-bsdapp-gcc+shared/7a19b545d8f94273b2600eb7aee26723/dpdk/mk/rte.sdkinstall.mk:61: pre_install] Error 2
gmake: *** [/root/FreeBSD1201-64_K12.1_GCC7.3.0/x86_64-native-bsdapp-gcc+shared/7a19b545d8f94273b2600eb7aee26723/dpdk/mk/rte.sdkroot.mk:77: install] Error 2


*Makefile Build Failed #4:
OS: FreeBSD1201-64
Target: x86_64-native-bsdapp-gcc+debug
  CC eal_timer.o
  CC eal_interrupts.o
/root/FreeBSD1201-64_K12.1_GCC7.3.0/x86_64-native-bsdapp-gcc+debug/7a19b545d8f94273b2600eb7aee26723/dpdk/lib/librte_eal/freebsd/eal.c: In function 'rte_eal_config_create':
/root/FreeBSD1201-64_K12.1_GCC7.3.0/x86_64-native-bsdapp-gcc+debug/7a19b545d8f94273b2600eb7aee26723/dpdk/lib/librte_eal/freebsd/eal.c:187:26: error: 'rte_mem_config' undeclared (first use in this function)
  187 |  size_t cfg_len = sizeof(rte_mem_config);
      |                          ^~~~~~~~~~~~~~
/root/FreeBSD1201-64_K12.1_GCC7.3.0/x86_64-native-bsdapp-gcc+debug/7a19b545d8f94273b2600eb7aee26723/dpdk/lib/librte_eal/freebsd/eal.c:187:26: note: each undeclared identifier is reported only once for each function it appears in
gmake[6]: *** [/root/FreeBSD1201-64_K12.1_GCC7.3.0/x86_64-native-bsdapp-gcc+debug/7a19b545d8f94273b2600eb7aee26723/dpdk/mk/internal/rte.compile-pre.mk:116: eal.o] Error 1
gmake[6]: *** Waiting for unfinished jobs....
gmake[5]: *** [/root/FreeBSD1201-64_K12.1_GCC7.3.0/x86_64-native-bsdapp-gcc+debug/7a19b545d8f94273b2600eb7aee26723/dpdk/mk/rte.subdir.mk:37: freebsd] Error 2
gmake[4]: *** [/root/FreeBSD1201-64_K12.1_GCC7.3.0/x86_64-native-bsdapp-gcc+debug/7a19b545d8f94273b2600eb7aee26723/dpdk/mk/rte.subdir.mk:37: librte_eal] Error 2
gmake[3]: *** [/root/FreeBSD1201-64_K12.1_GCC7.3.0/x86_64-native-bsdapp-gcc+debug/7a19b545d8f94273b2600eb7aee26723/dpdk/mk/rte.sdkbuild.mk:53: lib] Error 2
gmake[2]: *** [/root/FreeBSD1201-64_K12.1_GCC7.3.0/x86_64-native-bsdapp-gcc+debug/7a19b545d8f94273b2600eb7aee26723/dpdk/mk/rte.sdkroot.mk:99: all] Error 2
gmake[1]: *** [/root/FreeBSD1201-64_K12.1_GCC7.3.0/x86_64-native-bsdapp-gcc+debug/7a19b545d8f94273b2600eb7aee26723/dpdk/mk/rte.sdkinstall.mk:61: pre_install] Error 2
gmake: *** [/root/FreeBSD1201-64_K12.1_GCC7.3.0/x86_64-native-bsdapp-gcc+debug/7a19b545d8f94273b2600eb7aee26723/dpdk/mk/rte.sdkroot.mk:77: install] Error 2
DPDK STV team

^ permalink raw reply	[flat|nested] only message in thread

only message in thread, back to index

Thread overview: (only message) (download: mbox.gz / follow: Atom feed)
-- links below jump to the message on this page --
2020-06-29 14:09 [dpdk-test-report] |FAILURE| pw(72413) [v10, 07/10] drivers: fix incorrect meson import folder for Windows sys_stv

automatic DPDK test reports

Archives are clonable:
	git clone --mirror http://inbox.dpdk.org/test-report/0 test-report/git/0.git

	# If you have public-inbox 1.1+ installed, you may
	# initialize and index your mirror using the following commands:
	public-inbox-init -V2 test-report test-report/ http://inbox.dpdk.org/test-report \
		test-report@dpdk.org
	public-inbox-index test-report


Newsgroup available over NNTP:
	nntp://inbox.dpdk.org/inbox.dpdk.test-report


AGPL code for this site: git clone https://public-inbox.org/ public-inbox