automatic DPDK test reports
 help / color / Atom feed
* [dpdk-test-report] |FAILURE| pw(72434) speed-capabilities: Added Speed Capabilities test case
@ 2020-06-29 21:12 sys_stv
  0 siblings, 0 replies; only message in thread
From: sys_stv @ 2020-06-29 21:12 UTC (permalink / raw)
  To: test-report

[-- Attachment #1: Type: text/plain, Size: 20666 bytes --]


Test-Label: Intel-compilation
Test-Status: FAILURE
http://dpdk.org/patch/72434

_Compilation issues_

Submitter: dkirichok@iol.unh.edu
Date: 2020-06-29 20:03:46
Reply_mail: 20200629200346.4621-1-dkirichok@iol.unh.edu

DPDK git baseline: Repo:dpdk, CommitID: 014a7ec6c418eaf24a13be8ade8229638ddc6eed


Meson build Summary: 8 Builds Done, 8 Successful, 0 Failures, 0 Blocked

Makefile build Summary: 20 Builds Done, 0 Successful, 20 Failures, 0 Blocked

                +==============================================+===========+==========+
                |                   Makefile                   |   Meson   | Document |
+----------------+------+-------+------+------------+-----------+-----------+----------+
| os             | gcc  | clang | icc  | gcc+shared | gcc+debug | gcc/clang | pdf/html |
+----------------+------+-------+------+------------+-----------+-----------+----------+
| CENTOS82-64    | FAIL | FAIL  | FAIL | FAIL       | FAIL      | pass      |          |
| RHEL82-64      | FAIL |       |      |            |           |           |          |
| UB1804-64      | FAIL |       |      |            |           |           |          |
| FC32-64        | FAIL | FAIL  |      |            |           | pass      |          |
| CENTOS77-64    | FAIL |       |      |            |           |           |          |
| UB2004-64      | FAIL | FAIL  | FAIL |            |           | pass      | pass     |
| WIN10-64       |      |       |      |            |           | pass      |          |
| UB2004-32      | FAIL |       |      |            |           |           |          |
| UB1804-32      |      |       |      |            |           | pass      |          |
| FreeBSD1201-64 | FAIL | FAIL  |      | FAIL       | FAIL      | pass      |          |
| SUSE15-64      | FAIL | FAIL  |      |            |           | pass      |          |
+----------------+------+-------+------+------------+-----------+-----------+----------+
Test environment and configuration as below:

** Makefile build **


OS: CENTOS82-64
	Kernel Version: 4.18.0-193.el8.x86_64
	CPU info: Intel(R) Xeon(R) Platinum 8280M CPU @ 2.70GHz
	GCC Version: gcc (GCC) 8.3.1 20191121 (Red Hat 8.3.1-5)
	Clang Version: 9.0.1 (Red Hat 9.0.1-2.module_el8.2.0+309+0c7b6b03)
	x86_64-native-linuxapp-gcc
	x86_64-native-linuxapp-clang
	x86_64-native-linuxapp-icc
	x86_64-native-linuxapp-gcc+shared
	x86_64-native-linuxapp-gcc+debug


OS: RHEL82-64
	Kernel Version: 4.18.0-193.el8.x86_64
	CPU info: Intel(R) Xeon(R) Platinum 8280M CPU @ 2.70GHz
	GCC Version: gcc (GCC) 8.3.1 20191121 (Red Hat 8.3.1-5)
	Clang Version: 8.0.1 (Red Hat 8.0.1-1.module_el8.1.0+215+a01033fb)
	x86_64-native-linuxapp-gcc


OS: UB1804-64
	Kernel Version: 4.15.0-29-generic
	CPU info: Intel(R) Xeon(R) Platinum 8180 CPU @ 2.50GHz
	GCC Version: gcc (Ubuntu 7.5.0-3ubuntu1~18.04) 7.5.0
	Clang Version: 6.0.0-1ubuntu2 (tags/RELEASE_600/final)
	x86_64-native-linuxapp-gcc


OS: FC32-64
	Kernel Version: 5.6.0-0.rc7.git0.2.fc32.x86_64
	CPU info: Intel(R) Xeon(R) Platinum 8280M CPU @ 2.70GHz
	GCC Version: gcc (GCC) 10.0.1 20200311 (Red Hat 10.0.1-0.9)
	Clang Version: 10.0.0 (Fedora 10.0.0-0.3.rc4.fc32)
	x86_64-native-linuxapp-gcc
	x86_64-native-linuxapp-clang


OS: CENTOS77-64
	Kernel Version: 3.10.0-1062.9.1.el7.x86_64
	CPU info: Intel(R) Xeon(R) Platinum 8280M CPU @ 2.70GHz
	GCC Version: gcc (GCC) 4.8.5 20150623 (Red Hat 4.8.5-39)
	Clang Version: 3.4.2 (tags/RELEASE_34/dot2-final)
	x86_64-native-linuxapp-gcc


OS: UB2004-64
	Kernel Version: 5.4.0-26-generic
	CPU info: Intel(R) Xeon(R) Platinum 8180 CPU @ 2.50GHz
	GCC Version: gcc (Ubuntu 10-20200416-0ubuntu1) 10.0.1 20200416 (experimental) [master revision 3c3f12e2a76:dcee354ce56:44b326839d864fc10c459916abcc97f35a9ac3de]
	Clang Version: 10.0.0-4ubuntu1
	x86_64-native-linuxapp-clang
	x86_64-native-linuxapp-gcc
	x86_64-native-linuxapp-icc


OS: UB2004-32
	Kernel Version: 5.4.0-26-generic
	CPU info: Intel(R) Xeon(R) Platinum 8180 CPU @ 2.50GHz
	GCC Version: gcc (Ubuntu 9.3.0-10ubuntu2) 9.3.0
	Clang Version: 10.0.0-4ubuntu1
	i686-native-linuxapp-gcc


OS: FreeBSD1201-64
	Kernel Version: 12.1-RELEASE
	CPU info: Intel(R) Xeon(R) CPU E5-2699 v3 @ 2.30GHz (2294.74-MHz K8-class CPU)
	GCC Version: gcc (FreeBSD Ports Collection) 9.2.0
	Clang Version: 8.0.1 (tags/RELEASE_801/final 366581) (based on LLVM 8.0.1)
	x86_64-native-bsdapp-gcc
	x86_64-native-bsdapp-clang
	x86_64-native-bsdapp-gcc+shared
	x86_64-native-bsdapp-gcc+debug


OS: SUSE15-64
	Kernel Version: 4.12.14-lp150.11-default
	CPU info: Intel(R) Xeon(R) CPU E5-2699 v4 @ 2.20GHz
	GCC Version: gcc (SUSE Linux) 7.3.1 20180323 [gcc-7-branch revision 258812]
	Clang Version: 5.0.1 (tags/RELEASE_501/final 312548)
	x86_64-native-linuxapp-clang
	x86_64-native-linuxapp-gcc

** Meson build **


OS: CENTOS82-64
	Kernel Version: 4.18.0-193.el8.x86_64
	CPU info: Intel(R) Xeon(R) CPU E5-2699 v4 @ 2.20GHz
	GCC Version: gcc (GCC) 8.3.1 20191121 (Red Hat 8.3.1-5)
	Clang Version: 9.0.1 (Red Hat 9.0.1-2.module_el8.2.0+309+0c7b6b03)
	./build-gcc-static
	./build-gcc-shared
	./build-clang-static
	./build-clang-shared
	./build-x86-default


OS: UB2004-64
	Kernel Version: 5.4.0-26-generic
	CPU info: Intel(R) Xeon(R) Platinum 8180 CPU @ 2.50GHz
	GCC Version: gcc (Ubuntu 9.3.0-10ubuntu2) 9.3.0
	Clang Version: 10.0.0-4ubuntu1
	x86_64-native-linuxapp-doc
	./build-gcc-static
	./build-gcc-shared
	./build-clang-static
	./build-clang-shared
	./build-x86-default


OS: FC32-64
	Kernel Version: 5.6.0-0.rc7.git0.2.fc32.x86_64
	CPU info: Intel(R) Xeon(R) CPU E5-2699 v4 @ 2.20GHz
	GCC Version: gcc (GCC) 10.0.1 20200311 (Red Hat 10.0.1-0.9)
	Clang Version: 10.0.0 (Fedora 10.0.0-0.3.rc4.fc32)
	./build-gcc-static
	./build-gcc-shared
	./build-clang-static
	./build-clang-shared
	./build-x86-default


OS: WIN10-64
	Kernel Version: N/A
	CPU info: N/A
	GCC Version: N/A
	Clang Version: Clang 8.0.0
	x86_64-windows-clang


OS: UB1804-32
	Kernel Version: 4.15.0-20-generic
	CPU info: Intel(R) Xeon(R) CPU E5-2699 v4 @ 2.20GHz
	GCC Version: gcc (Ubuntu 7.5.0-3ubuntu1~18.04) 7.5.0
	Clang Version: 6.0.0-1ubuntu2 (tags/RELEASE_600/final)
	./build-gcc-static
	./build-gcc-shared
	./build-clang-static
	./build-clang-shared
	./build-x86-default


OS: FreeBSD1201-64
	Kernel Version: 12.1-RELEASE
	CPU info: Intel(R) Xeon(R) CPU E5-2699 v4 @ 2.20GHz (2194.97-MHz K8-class CPU)
	GCC Version: gcc (FreeBSD Ports Collection) 9.2.0
	Clang Version: 8.0.1 (tags/RELEASE_801/final 366581) (based on LLVM 8.0.1)
	./build-gcc-static
	./build-gcc-shared
	./build-clang-static
	./build-clang-shared
	./build-x86-default


OS: SUSE15-64
	Kernel Version: 4.12.14-lp150.12.82-default
	CPU info: Intel(R) Xeon(R) CPU E5-2699 v4 @ 2.20GHz
	GCC Version: gcc (SUSE Linux) 7.4.1 20190905 [gcc-7-branch revision 275407]
	Clang Version: 5.0.1 (tags/RELEASE_501/final 312548)
	./build-gcc-static
	./build-gcc-shared
	./build-clang-static
	./build-clang-shared
	./build-x86-default



*Makefile Build Failed #1:
OS: CENTOS77-64
Target: x86_64-native-linuxapp-gcc
This deprecation warning can be passed by adding MAKE_PAUSE=n
to 'make' command line or as an exported environment variable.
Press enter to continue...
make[2]: *** [warning] Error 1
make[1]: *** [pre_install] Error 2
make: *** [install] Error 2


*Makefile Build Failed #2:
OS: CENTOS82-64
Target: x86_64-native-linuxapp-gcc
This deprecation warning can be passed by adding MAKE_PAUSE=n
to 'make' command line or as an exported environment variable.
Press enter to continue...
make[2]: *** [/root/CENTOS82-64_K4.18.0_GCC8.3.1/x86_64-native-linuxapp-gcc/e17be8cac02145aab8a4c55062ac1e7e/dpdk/mk/rte.sdkroot.mk:72: warning] Error 1
make[1]: *** [/root/CENTOS82-64_K4.18.0_GCC8.3.1/x86_64-native-linuxapp-gcc/e17be8cac02145aab8a4c55062ac1e7e/dpdk/mk/rte.sdkinstall.mk:60: pre_install] Error 2
make: *** [/root/CENTOS82-64_K4.18.0_GCC8.3.1/x86_64-native-linuxapp-gcc/e17be8cac02145aab8a4c55062ac1e7e/dpdk/mk/rte.sdkroot.mk:92: install] Error 2


*Makefile Build Failed #3:
OS: CENTOS82-64
Target: x86_64-native-linuxapp-clang
This deprecation warning can be passed by adding MAKE_PAUSE=n
to 'make' command line or as an exported environment variable.
Press enter to continue...
make[2]: *** [/root/CENTOS82-64_K4.18.0_Clang7.0.1/x86_64-native-linuxapp-clang/e17be8cac02145aab8a4c55062ac1e7e/dpdk/mk/rte.sdkroot.mk:72: warning] Error 1
make[1]: *** [/root/CENTOS82-64_K4.18.0_Clang7.0.1/x86_64-native-linuxapp-clang/e17be8cac02145aab8a4c55062ac1e7e/dpdk/mk/rte.sdkinstall.mk:60: pre_install] Error 2
make: *** [/root/CENTOS82-64_K4.18.0_Clang7.0.1/x86_64-native-linuxapp-clang/e17be8cac02145aab8a4c55062ac1e7e/dpdk/mk/rte.sdkroot.mk:92: install] Error 2


*Makefile Build Failed #4:
OS: CENTOS82-64
Target: x86_64-native-linuxapp-icc
This deprecation warning can be passed by adding MAKE_PAUSE=n
to 'make' command line or as an exported environment variable.
Press enter to continue...
make[2]: *** [/root/CENTOS82-64_K4.18.0_ICC19.1.1/x86_64-native-linuxapp-icc/e17be8cac02145aab8a4c55062ac1e7e/dpdk/mk/rte.sdkroot.mk:72: warning] Error 1
make[1]: *** [/root/CENTOS82-64_K4.18.0_ICC19.1.1/x86_64-native-linuxapp-icc/e17be8cac02145aab8a4c55062ac1e7e/dpdk/mk/rte.sdkinstall.mk:60: pre_install] Error 2
make: *** [/root/CENTOS82-64_K4.18.0_ICC19.1.1/x86_64-native-linuxapp-icc/e17be8cac02145aab8a4c55062ac1e7e/dpdk/mk/rte.sdkroot.mk:92: install] Error 2


*Makefile Build Failed #5:
OS: CENTOS82-64
Target: x86_64-native-linuxapp-gcc+shared
This deprecation warning can be passed by adding MAKE_PAUSE=n
to 'make' command line or as an exported environment variable.
Press enter to continue...
make[2]: *** [/root/CENTOS82-64_K4.18.0_GCC8.3.1/x86_64-native-linuxapp-gcc+shared/e17be8cac02145aab8a4c55062ac1e7e/dpdk/mk/rte.sdkroot.mk:72: warning] Error 1
make[1]: *** [/root/CENTOS82-64_K4.18.0_GCC8.3.1/x86_64-native-linuxapp-gcc+shared/e17be8cac02145aab8a4c55062ac1e7e/dpdk/mk/rte.sdkinstall.mk:60: pre_install] Error 2
make: *** [/root/CENTOS82-64_K4.18.0_GCC8.3.1/x86_64-native-linuxapp-gcc+shared/e17be8cac02145aab8a4c55062ac1e7e/dpdk/mk/rte.sdkroot.mk:92: install] Error 2


*Makefile Build Failed #6:
OS: CENTOS82-64
Target: x86_64-native-linuxapp-gcc+debug
This deprecation warning can be passed by adding MAKE_PAUSE=n
to 'make' command line or as an exported environment variable.
Press enter to continue...
make[2]: *** [/root/CENTOS82-64_K4.18.0_GCC8.3.1/x86_64-native-linuxapp-gcc+debug/e17be8cac02145aab8a4c55062ac1e7e/dpdk/mk/rte.sdkroot.mk:72: warning] Error 1
make[1]: *** [/root/CENTOS82-64_K4.18.0_GCC8.3.1/x86_64-native-linuxapp-gcc+debug/e17be8cac02145aab8a4c55062ac1e7e/dpdk/mk/rte.sdkinstall.mk:60: pre_install] Error 2
make: *** [/root/CENTOS82-64_K4.18.0_GCC8.3.1/x86_64-native-linuxapp-gcc+debug/e17be8cac02145aab8a4c55062ac1e7e/dpdk/mk/rte.sdkroot.mk:92: install] Error 2


*Makefile Build Failed #7:
OS: FC32-64
Target: x86_64-native-linuxapp-gcc
This deprecation warning can be passed by adding MAKE_PAUSE=n
to 'make' command line or as an exported environment variable.
Press enter to continue...
make[2]: *** [/root/FC32-64_K5.6.0_GCC10.0.1/x86_64-native-linuxapp-gcc/e17be8cac02145aab8a4c55062ac1e7e/dpdk/mk/rte.sdkroot.mk:72: warning] Error 1
make[1]: *** [/root/FC32-64_K5.6.0_GCC10.0.1/x86_64-native-linuxapp-gcc/e17be8cac02145aab8a4c55062ac1e7e/dpdk/mk/rte.sdkinstall.mk:60: pre_install] Error 2
make: *** [/root/FC32-64_K5.6.0_GCC10.0.1/x86_64-native-linuxapp-gcc/e17be8cac02145aab8a4c55062ac1e7e/dpdk/mk/rte.sdkroot.mk:92: install] Error 2


*Makefile Build Failed #8:
OS: FC32-64
Target: x86_64-native-linuxapp-clang
This deprecation warning can be passed by adding MAKE_PAUSE=n
to 'make' command line or as an exported environment variable.
Press enter to continue...
make[2]: *** [/root/FC32-64_K5.6.0_Clang10.0.0/x86_64-native-linuxapp-clang/e17be8cac02145aab8a4c55062ac1e7e/dpdk/mk/rte.sdkroot.mk:72: warning] Error 1
make[1]: *** [/root/FC32-64_K5.6.0_Clang10.0.0/x86_64-native-linuxapp-clang/e17be8cac02145aab8a4c55062ac1e7e/dpdk/mk/rte.sdkinstall.mk:60: pre_install] Error 2
make: *** [/root/FC32-64_K5.6.0_Clang10.0.0/x86_64-native-linuxapp-clang/e17be8cac02145aab8a4c55062ac1e7e/dpdk/mk/rte.sdkroot.mk:92: install] Error 2


*Makefile Build Failed #9:
OS: FreeBSD1201-64
Target: x86_64-native-bsdapp-gcc
This deprecation warning can be passed by adding MAKE_PAUSE=n
to 'make' command line or as an exported environment variable.
Press enter to continue...
gmake[2]: *** [/root/FreeBSD1201-64_K12.1_GCC9.2.0/x86_64-native-bsdapp-gcc/e17be8cac02145aab8a4c55062ac1e7e/dpdk/mk/rte.sdkroot.mk:72: warning] Error 1
gmake[1]: *** [/root/FreeBSD1201-64_K12.1_GCC9.2.0/x86_64-native-bsdapp-gcc/e17be8cac02145aab8a4c55062ac1e7e/dpdk/mk/rte.sdkinstall.mk:60: pre_install] Error 2
gmake: *** [/root/FreeBSD1201-64_K12.1_GCC9.2.0/x86_64-native-bsdapp-gcc/e17be8cac02145aab8a4c55062ac1e7e/dpdk/mk/rte.sdkroot.mk:92: install] Error 2


*Makefile Build Failed #10:
OS: FreeBSD1201-64
Target: x86_64-native-bsdapp-clang
This deprecation warning can be passed by adding MAKE_PAUSE=n
to 'make' command line or as an exported environment variable.
Press enter to continue...
gmake[2]: *** [/root/FreeBSD1201-64_K12.1_Clang8.0.1/x86_64-native-bsdapp-clang/e17be8cac02145aab8a4c55062ac1e7e/dpdk/mk/rte.sdkroot.mk:72: warning] Error 1
gmake[1]: *** [/root/FreeBSD1201-64_K12.1_Clang8.0.1/x86_64-native-bsdapp-clang/e17be8cac02145aab8a4c55062ac1e7e/dpdk/mk/rte.sdkinstall.mk:60: pre_install] Error 2
gmake: *** [/root/FreeBSD1201-64_K12.1_Clang8.0.1/x86_64-native-bsdapp-clang/e17be8cac02145aab8a4c55062ac1e7e/dpdk/mk/rte.sdkroot.mk:92: install] Error 2


*Makefile Build Failed #11:
OS: FreeBSD1201-64
Target: x86_64-native-bsdapp-gcc+shared
This deprecation warning can be passed by adding MAKE_PAUSE=n
to 'make' command line or as an exported environment variable.
Press enter to continue...
gmake[2]: *** [/root/FreeBSD1201-64_K12.1_GCC7.3.0/x86_64-native-bsdapp-gcc+shared/e17be8cac02145aab8a4c55062ac1e7e/dpdk/mk/rte.sdkroot.mk:72: warning] Error 1
gmake[1]: *** [/root/FreeBSD1201-64_K12.1_GCC7.3.0/x86_64-native-bsdapp-gcc+shared/e17be8cac02145aab8a4c55062ac1e7e/dpdk/mk/rte.sdkinstall.mk:60: pre_install] Error 2
gmake: *** [/root/FreeBSD1201-64_K12.1_GCC7.3.0/x86_64-native-bsdapp-gcc+shared/e17be8cac02145aab8a4c55062ac1e7e/dpdk/mk/rte.sdkroot.mk:92: install] Error 2


*Makefile Build Failed #12:
OS: FreeBSD1201-64
Target: x86_64-native-bsdapp-gcc+debug
This deprecation warning can be passed by adding MAKE_PAUSE=n
to 'make' command line or as an exported environment variable.
Press enter to continue...
gmake[2]: *** [/root/FreeBSD1201-64_K12.1_GCC7.3.0/x86_64-native-bsdapp-gcc+debug/e17be8cac02145aab8a4c55062ac1e7e/dpdk/mk/rte.sdkroot.mk:72: warning] Error 1
gmake[1]: *** [/root/FreeBSD1201-64_K12.1_GCC7.3.0/x86_64-native-bsdapp-gcc+debug/e17be8cac02145aab8a4c55062ac1e7e/dpdk/mk/rte.sdkinstall.mk:60: pre_install] Error 2
gmake: *** [/root/FreeBSD1201-64_K12.1_GCC7.3.0/x86_64-native-bsdapp-gcc+debug/e17be8cac02145aab8a4c55062ac1e7e/dpdk/mk/rte.sdkroot.mk:92: install] Error 2


*Makefile Build Failed #13:
OS: RHEL82-64
Target: x86_64-native-linuxapp-gcc
This deprecation warning can be passed by adding MAKE_PAUSE=n
to 'make' command line or as an exported environment variable.
Press enter to continue...
make[2]: *** [/root/RHEL82-64_K4.18.0_GCC8.3.1/x86_64-native-linuxapp-gcc/e17be8cac02145aab8a4c55062ac1e7e/dpdk/mk/rte.sdkroot.mk:72: warning] Error 1
make[1]: *** [/root/RHEL82-64_K4.18.0_GCC8.3.1/x86_64-native-linuxapp-gcc/e17be8cac02145aab8a4c55062ac1e7e/dpdk/mk/rte.sdkinstall.mk:60: pre_install] Error 2
make: *** [/root/RHEL82-64_K4.18.0_GCC8.3.1/x86_64-native-linuxapp-gcc/e17be8cac02145aab8a4c55062ac1e7e/dpdk/mk/rte.sdkroot.mk:92: install] Error 2


*Makefile Build Failed #14:
OS: SUSE15-64
Target: x86_64-native-linuxapp-clang
This deprecation warning can be passed by adding MAKE_PAUSE=n
to 'make' command line or as an exported environment variable.
Press enter to continue...
make[2]: *** [/root/SUSE15-64_K4.12.14_Clang5.0.1/x86_64-native-linuxapp-clang/e17be8cac02145aab8a4c55062ac1e7e/dpdk/mk/rte.sdkroot.mk:72: warning] Error 1
make[1]: *** [/root/SUSE15-64_K4.12.14_Clang5.0.1/x86_64-native-linuxapp-clang/e17be8cac02145aab8a4c55062ac1e7e/dpdk/mk/rte.sdkinstall.mk:60: pre_install] Error 2
make: *** [/root/SUSE15-64_K4.12.14_Clang5.0.1/x86_64-native-linuxapp-clang/e17be8cac02145aab8a4c55062ac1e7e/dpdk/mk/rte.sdkroot.mk:92: install] Error 2


*Makefile Build Failed #15:
OS: SUSE15-64
Target: x86_64-native-linuxapp-gcc
This deprecation warning can be passed by adding MAKE_PAUSE=n
to 'make' command line or as an exported environment variable.
Press enter to continue...
make[2]: *** [/root/SUSE15-64_K4.12.14_GCC7.3.1/x86_64-native-linuxapp-gcc/e17be8cac02145aab8a4c55062ac1e7e/dpdk/mk/rte.sdkroot.mk:72: warning] Error 1
make[1]: *** [/root/SUSE15-64_K4.12.14_GCC7.3.1/x86_64-native-linuxapp-gcc/e17be8cac02145aab8a4c55062ac1e7e/dpdk/mk/rte.sdkinstall.mk:60: pre_install] Error 2
make: *** [/root/SUSE15-64_K4.12.14_GCC7.3.1/x86_64-native-linuxapp-gcc/e17be8cac02145aab8a4c55062ac1e7e/dpdk/mk/rte.sdkroot.mk:92: install] Error 2


*Makefile Build Failed #16:
OS: UB1804-64
Target: x86_64-native-linuxapp-gcc
This deprecation warning can be passed by adding MAKE_PAUSE=n
to 'make' command line or as an exported environment variable.
Press enter to continue...
/root/UB1804-64_K4.15.0_GCC7.3.0/x86_64-native-linuxapp-gcc/e17be8cac02145aab8a4c55062ac1e7e/dpdk/mk/rte.sdkroot.mk:65: recipe for target 'warning' failed
make[2]: *** [warning] Error 1
/root/UB1804-64_K4.15.0_GCC7.3.0/x86_64-native-linuxapp-gcc/e17be8cac02145aab8a4c55062ac1e7e/dpdk/mk/rte.sdkinstall.mk:60: recipe for target 'pre_install' failed
make[1]: *** [pre_install] Error 2
/root/UB1804-64_K4.15.0_GCC7.3.0/x86_64-native-linuxapp-gcc/e17be8cac02145aab8a4c55062ac1e7e/dpdk/mk/rte.sdkroot.mk:92: recipe for target 'install' failed
make: *** [install] Error 2


*Makefile Build Failed #17:
OS: UB2004-32
Target: i686-native-linuxapp-gcc
This deprecation warning can be passed by adding MAKE_PAUSE=n
to 'make' command line or as an exported environment variable.
Press enter to continue...
make[2]: *** [/root/UB2004-32_K4.15.0_GCC9.3.0/i686-native-linuxapp-gcc/e17be8cac02145aab8a4c55062ac1e7e/dpdk/mk/rte.sdkroot.mk:72: warning] Error 1
make[1]: *** [/root/UB2004-32_K4.15.0_GCC9.3.0/i686-native-linuxapp-gcc/e17be8cac02145aab8a4c55062ac1e7e/dpdk/mk/rte.sdkinstall.mk:60: pre_install] Error 2
make: *** [/root/UB2004-32_K4.15.0_GCC9.3.0/i686-native-linuxapp-gcc/e17be8cac02145aab8a4c55062ac1e7e/dpdk/mk/rte.sdkroot.mk:92: install] Error 2


*Makefile Build Failed #18:
OS: UB2004-64
Target: x86_64-native-linuxapp-clang
This deprecation warning can be passed by adding MAKE_PAUSE=n
to 'make' command line or as an exported environment variable.
Press enter to continue...
make[2]: *** [/root/UB2004-64_K5.4.0_Clang10.0.0/x86_64-native-linuxapp-clang/e17be8cac02145aab8a4c55062ac1e7e/dpdk/mk/rte.sdkroot.mk:72: warning] Error 1
make[1]: *** [/root/UB2004-64_K5.4.0_Clang10.0.0/x86_64-native-linuxapp-clang/e17be8cac02145aab8a4c55062ac1e7e/dpdk/mk/rte.sdkinstall.mk:60: pre_install] Error 2
make: *** [/root/UB2004-64_K5.4.0_Clang10.0.0/x86_64-native-linuxapp-clang/e17be8cac02145aab8a4c55062ac1e7e/dpdk/mk/rte.sdkroot.mk:92: install] Error 2


*Makefile Build Failed #19:
OS: UB2004-64
Target: x86_64-native-linuxapp-gcc
This deprecation warning can be passed by adding MAKE_PAUSE=n
to 'make' command line or as an exported environment variable.
Press enter to continue...
make[2]: *** [/root/UB2004-64_K5.4.0_GCC9.3.0/x86_64-native-linuxapp-gcc/e17be8cac02145aab8a4c55062ac1e7e/dpdk/mk/rte.sdkroot.mk:72: warning] Error 1
make[1]: *** [/root/UB2004-64_K5.4.0_GCC9.3.0/x86_64-native-linuxapp-gcc/e17be8cac02145aab8a4c55062ac1e7e/dpdk/mk/rte.sdkinstall.mk:60: pre_install] Error 2
make: *** [/root/UB2004-64_K5.4.0_GCC9.3.0/x86_64-native-linuxapp-gcc/e17be8cac02145aab8a4c55062ac1e7e/dpdk/mk/rte.sdkroot.mk:92: install] Error 2


*Makefile Build Failed #20:
OS: UB2004-64
Target: x86_64-native-linuxapp-icc
This deprecation warning can be passed by adding MAKE_PAUSE=n
to 'make' command line or as an exported environment variable.
Press enter to continue...
make[2]: *** [/root/UB2004-64_K5.4.0_ICC19.1.0/x86_64-native-linuxapp-icc/e17be8cac02145aab8a4c55062ac1e7e/dpdk/mk/rte.sdkroot.mk:72: warning] Error 1
make[1]: *** [/root/UB2004-64_K5.4.0_ICC19.1.0/x86_64-native-linuxapp-icc/e17be8cac02145aab8a4c55062ac1e7e/dpdk/mk/rte.sdkinstall.mk:60: pre_install] Error 2
make: *** [/root/UB2004-64_K5.4.0_ICC19.1.0/x86_64-native-linuxapp-icc/e17be8cac02145aab8a4c55062ac1e7e/dpdk/mk/rte.sdkroot.mk:92: install] Error 2
DPDK STV team

^ permalink raw reply	[flat|nested] only message in thread

only message in thread, back to index

Thread overview: (only message) (download: mbox.gz / follow: Atom feed)
-- links below jump to the message on this page --
2020-06-29 21:12 [dpdk-test-report] |FAILURE| pw(72434) speed-capabilities: Added Speed Capabilities test case sys_stv

automatic DPDK test reports

Archives are clonable:
	git clone --mirror http://inbox.dpdk.org/test-report/0 test-report/git/0.git

	# If you have public-inbox 1.1+ installed, you may
	# initialize and index your mirror using the following commands:
	public-inbox-init -V2 test-report test-report/ http://inbox.dpdk.org/test-report \
		test-report@dpdk.org
	public-inbox-index test-report


Newsgroup available over NNTP:
	nntp://inbox.dpdk.org/inbox.dpdk.test-report


AGPL code for this site: git clone https://public-inbox.org/ public-inbox