automatic DPDK test reports
 help / color / mirror / Atom feed
* [dpdk-test-report]  |FAILURE| pw(73635) [v3, 1/3] drivers/net/softnic: Remove the re-implementation of inet_pton
@ 2020-07-11  4:35 sys_stv
  0 siblings, 0 replies; only message in thread
From: sys_stv @ 2020-07-11  4:35 UTC (permalink / raw)
  To: test-report

[-- Attachment #1: Type: text/plain, Size: 10607 bytes --]


Test-Label: Intel-compilation
Test-Status: FAILURE
http://dpdk.org/patch/73635

_Compilation issues_

Submitter: Ibtisam Tariq <ibtisam.tariq@emumba.com>
Date: 2020-07-09 10:38:35
Reply_mail: 20200709103837.12393-1-ibtisam.tariq@emumba.com

DPDK git baseline: Repo:dpdk, CommitID: 2d6ed071a8b93ead509ff26914bdb8938efd7543


Meson build Summary: 8 Builds Done, 7 Successful, 1 Failures, 0 Blocked

Makefile build Summary: 20 Builds Done, 20 Successful, 0 Failures, 0 Blocked

                +==============================================+===========+==========+
                |                   Makefile                   |   Meson   | Document |
+----------------+------+-------+------+------------+-----------+-----------+----------+
| os             | gcc  | clang | icc  | gcc+shared | gcc+debug | gcc/clang | pdf/html |
+----------------+------+-------+------+------------+-----------+-----------+----------+
| CENTOS82-64    | pass | pass  | pass | pass       | pass      | pass      |          |
| RHEL82-64      | pass |       |      |            |           |           |          |
| UB1804-64      | pass |       |      |            |           |           |          |
| FC32-64        | pass | pass  |      |            |           | pass      |          |
| CENTOS77-64    | pass |       |      |            |           |           |          |
| UB2004-64      | pass | pass  | pass |            |           | pass      | pass     |
| WIN10-64       |      |       |      |            |           | pass      |          |
| UB2004-32      | pass |       |      |            |           |           |          |
| UB1804-32      |      |       |      |            |           | pass      |          |
| FreeBSD1201-64 | pass | pass  |      | pass       | pass      | FAIL      |          |
| SUSE15-64      | pass | pass  |      |            |           | pass      |          |
+----------------+------+-------+------+------------+-----------+-----------+----------+
Test environment and configuration as below:

** Makefile build **


OS: CENTOS82-64
	Kernel Version: 4.18.0-193.el8.x86_64
	CPU info: Intel(R) Xeon(R) Platinum 8280M CPU @ 2.70GHz
	GCC Version: gcc (GCC) 8.3.1 20191121 (Red Hat 8.3.1-5)
	Clang Version: 9.0.1 (Red Hat 9.0.1-2.module_el8.2.0+309+0c7b6b03)
	x86_64-native-linuxapp-gcc
	x86_64-native-linuxapp-clang
	x86_64-native-linuxapp-icc
	x86_64-native-linuxapp-gcc+shared
	x86_64-native-linuxapp-gcc+debug


OS: RHEL82-64
	Kernel Version: 4.18.0-193.el8.x86_64
	CPU info: Intel(R) Xeon(R) Platinum 8280M CPU @ 2.70GHz
	GCC Version: gcc (GCC) 8.3.1 20191121 (Red Hat 8.3.1-5)
	Clang Version: 8.0.1 (Red Hat 8.0.1-1.module_el8.1.0+215+a01033fb)
	x86_64-native-linuxapp-gcc


OS: UB1804-64
	Kernel Version: 4.15.0-29-generic
	CPU info: Intel(R) Xeon(R) Platinum 8180 CPU @ 2.50GHz
	GCC Version: gcc (Ubuntu 7.5.0-3ubuntu1~18.04) 7.5.0
	Clang Version: 6.0.0-1ubuntu2 (tags/RELEASE_600/final)
	x86_64-native-linuxapp-gcc


OS: FC32-64
	Kernel Version: 5.6.0-0.rc7.git0.2.fc32.x86_64
	CPU info: Intel(R) Xeon(R) Platinum 8280M CPU @ 2.70GHz
	GCC Version: gcc (GCC) 10.0.1 20200311 (Red Hat 10.0.1-0.9)
	Clang Version: 10.0.0 (Fedora 10.0.0-0.3.rc4.fc32)
	x86_64-native-linuxapp-gcc
	x86_64-native-linuxapp-clang


OS: CENTOS77-64
	Kernel Version: 3.10.0-1062.9.1.el7.x86_64
	CPU info: Intel(R) Xeon(R) Platinum 8280M CPU @ 2.70GHz
	GCC Version: gcc (GCC) 4.8.5 20150623 (Red Hat 4.8.5-39)
	Clang Version: 3.4.2 (tags/RELEASE_34/dot2-final)
	x86_64-native-linuxapp-gcc


OS: UB2004-64
	Kernel Version: 5.4.0-26-generic
	CPU info: Intel(R) Xeon(R) Platinum 8180 CPU @ 2.50GHz
	GCC Version: gcc (Ubuntu 10-20200416-0ubuntu1) 10.0.1 20200416 (experimental) [master revision 3c3f12e2a76:dcee354ce56:44b326839d864fc10c459916abcc97f35a9ac3de]
	Clang Version: 10.0.0-4ubuntu1
	x86_64-native-linuxapp-clang
	x86_64-native-linuxapp-gcc
	x86_64-native-linuxapp-icc


OS: UB2004-32
	Kernel Version: 5.4.0-26-generic
	CPU info: Intel(R) Xeon(R) Platinum 8180 CPU @ 2.50GHz
	GCC Version: gcc (Ubuntu 9.3.0-10ubuntu2) 9.3.0
	Clang Version: 10.0.0-4ubuntu1
	i686-native-linuxapp-gcc


OS: FreeBSD1201-64
	Kernel Version: 12.1-RELEASE
	CPU info: Intel(R) Xeon(R) CPU E5-2699 v3 @ 2.30GHz (2294.74-MHz K8-class CPU)
	GCC Version: gcc (FreeBSD Ports Collection) 9.2.0
	Clang Version: 8.0.1 (tags/RELEASE_801/final 366581) (based on LLVM 8.0.1)
	x86_64-native-bsdapp-gcc
	x86_64-native-bsdapp-clang
	x86_64-native-bsdapp-gcc+shared
	x86_64-native-bsdapp-gcc+debug


OS: SUSE15-64
	Kernel Version: 4.12.14-lp150.11-default
	CPU info: Intel(R) Xeon(R) CPU E5-2699 v4 @ 2.20GHz
	GCC Version: gcc (SUSE Linux) 7.3.1 20180323 [gcc-7-branch revision 258812]
	Clang Version: 5.0.1 (tags/RELEASE_501/final 312548)
	x86_64-native-linuxapp-clang
	x86_64-native-linuxapp-gcc

** Meson build **


OS: CENTOS82-64
	Kernel Version: 4.18.0-193.el8.x86_64
	CPU info: Intel(R) Xeon(R) CPU E5-2699 v4 @ 2.20GHz
	GCC Version: gcc (GCC) 8.3.1 20191121 (Red Hat 8.3.1-5)
	Clang Version: 9.0.1 (Red Hat 9.0.1-2.module_el8.2.0+309+0c7b6b03)
	./build-gcc-static
	./build-gcc-shared
	./build-clang-static
	./build-clang-shared
	./build-x86-default


OS: UB2004-64
	Kernel Version: 5.4.0-26-generic
	CPU info: Intel(R) Xeon(R) Platinum 8180 CPU @ 2.50GHz
	GCC Version: gcc (Ubuntu 9.3.0-10ubuntu2) 9.3.0
	Clang Version: 10.0.0-4ubuntu1
	x86_64-native-linuxapp-doc
	./build-gcc-static
	./build-gcc-shared
	./build-clang-static
	./build-clang-shared
	./build-x86-default


OS: FC32-64
	Kernel Version: 5.6.0-0.rc7.git0.2.fc32.x86_64
	CPU info: Intel(R) Xeon(R) CPU E5-2699 v4 @ 2.20GHz
	GCC Version: gcc (GCC) 10.0.1 20200311 (Red Hat 10.0.1-0.9)
	Clang Version: 10.0.0 (Fedora 10.0.0-0.3.rc4.fc32)
	./build-gcc-static
	./build-gcc-shared
	./build-clang-static
	./build-clang-shared
	./build-x86-default


OS: WIN10-64
	Kernel Version: N/A
	CPU info: N/A
	GCC Version: N/A
	Clang Version: Clang 8.0.0
	x86_64-windows-clang


OS: UB1804-32
	Kernel Version: 4.15.0-20-generic
	CPU info: Intel(R) Xeon(R) CPU E5-2699 v4 @ 2.20GHz
	GCC Version: gcc (Ubuntu 7.5.0-3ubuntu1~18.04) 7.5.0
	Clang Version: 6.0.0-1ubuntu2 (tags/RELEASE_600/final)
	./build-gcc-static
	./build-gcc-shared
	./build-clang-static
	./build-clang-shared
	./build-x86-default


OS: FreeBSD1201-64
	Kernel Version: 12.1-RELEASE
	CPU info: Intel(R) Xeon(R) CPU E5-2699 v4 @ 2.20GHz (2194.97-MHz K8-class CPU)
	GCC Version: gcc (FreeBSD Ports Collection) 9.2.0
	Clang Version: 8.0.1 (tags/RELEASE_801/final 366581) (based on LLVM 8.0.1)
	./build-gcc-static
	./build-gcc-shared
	./build-clang-static
	./build-clang-shared
	./build-x86-default


OS: SUSE15-64
	Kernel Version: 4.12.14-lp150.12.82-default
	CPU info: Intel(R) Xeon(R) CPU E5-2699 v4 @ 2.20GHz
	GCC Version: gcc (SUSE Linux) 7.4.1 20190905 [gcc-7-branch revision 275407]
	Clang Version: 5.0.1 (tags/RELEASE_501/final 312548)
	./build-gcc-static
	./build-gcc-shared
	./build-clang-static
	./build-clang-shared
	./build-x86-default



*Meson Build Failed #1:
OS: FreeBSD1201-64
Target:./build-gcc-static
FAILED: examples/c590b3c@@dpdk-ipsec-secgw@exe/ipsec-secgw_parser.c.o 
gcc -Iexamples/c590b3c@@dpdk-ipsec-secgw@exe -Iexamples -I../examples -Iexamples/ipsec-secgw -I../examples/ipsec-secgw -I. -I.. -Iconfig -I../config -Ilib/librte_eal/include -I../lib/librte_eal/include -Ilib/librte_eal/freebsd/include -I../lib/librte_eal/freebsd/include -Ilib/librte_eal/x86/include -I../lib/librte_eal/x86/include -Ilib/librte_eal/common -I../lib/librte_eal/common -Ilib/librte_eal -I../lib/librte_eal -Ilib/librte_kvargs -I../lib/librte_kvargs -Ilib/librte_metrics -I../lib/librte_metrics -Ilib/librte_telemetry -I../lib/librte_telemetry -Ilib/librte_mempool -I../lib/librte_mempool -Ilib/librte_ring -I../lib/librte_ring -Ilib/librte_net -I../lib/librte_net -Ilib/librte_mbuf -I../lib/librte_mbuf -Ilib/librte_ethdev -I../lib/librte_ethdev -Ilib/librte_meter -I../lib/librte_meter -Ilib/librte_cmdline -I../lib/librte_cmdline -Ilib/librte_security -I../lib/librte_security -Ilib/librte_cryptodev -I../lib/librte_cryptodev -Ilib/librte_lpm -I../lib/librte_lpm -Ilib/librte_hash -I../lib/librte_hash -Ilib/librte_acl -I../lib/librte_acl -Ilib/librte_ip_frag -I../lib/librte_ip_frag -Ilib/librte_ipsec -I../lib/librte_ipsec -Ilib/librte_eventdev -I../lib/librte_eventdev -Ilib/librte_timer -I../lib/librte_timer -fdiagnostics-color=always -pipe -D_FILE_OFFSET_BITS=64 -Wall -Winvalid-pch -Werror -O2 -g -include rte_config.h -Wextra -Wcast-qual -Wdeprecated -Wformat-nonliteral -Wformat-security -Wmissing-declarations -Wmissing-prototypes -Wnested-externs -Wold-style-definition -Wpointer-arith -Wsign-compare -Wstrict-prototypes -Wundef -Wwrite-strings -Wno-address-of-packed-member -Wno-packed-not-aligned -Wno-missing-field-initializers -D_GNU_SOURCE -D__BSD_VISIBLE -march=native -mno-avx512f -Wno-format-truncation -DALLOW_EXPERIMENTAL_API -MD -MQ 'examples/c590b3c@@dpdk-ipsec-secgw@exe/ipsec-secgw_parser.c.o' -MF 'examples/c590b3c@@dpdk-ipsec-secgw@exe/ipsec-secgw_parser.c.o.d' -o 'examples/c590b3c@@dpdk-ipsec-secgw@exe/ipsec-secgw_parser.c.o' -c ../examples/ipsec-secgw/parser.c
../examples/ipsec-secgw/parser.c: In function 'parse_ipv4_addr':
../examples/ipsec-secgw/parser.c:67:16: error: 'AF_INET' undeclared (first use in this function)
   67 |  if (inet_pton(AF_INET, ip_str, ipv4) != 1)
      |                ^~~~~~~
../examples/ipsec-secgw/parser.c:67:16: note: each undeclared identifier is reported only once for each function it appears in
../examples/ipsec-secgw/parser.c: In function 'parse_ipv6_addr':
../examples/ipsec-secgw/parser.c:98:16: error: 'AF_INET6' undeclared (first use in this function)
   98 |  if (inet_pton(AF_INET6, ip_str, ipv6) != 1)
      |                ^~~~~~~~
[1827/1940] Compiling C object 'examples/c590b3c@@dpdk-ipsec-secgw@exe/ipsec-secgw_rt.c.o'
[1828/1940] Compiling C object 'examples/c590b3c@@dpdk-ipsec-secgw@exe/ipsec-secgw_sad.c.o'
[1829/1940] Compiling C object 'examples/c590b3c@@dpdk-ipsec-secgw@exe/ipsec-secgw_sp4.c.o'
[1830/1940] Linking target app/test/dpdk-test
[1831/1940] Compiling C object 'examples/c590b3c@@dpdk-ipsec-secgw@exe/ipsec-secgw_ipsec-secgw.c.o'
[1832/1940] Compiling C object 'examples/c590b3c@@dpdk-ipsec-secgw@exe/ipsec-secgw_sp6.c.o'
[1833/1940] Compiling C object 'examples/c590b3c@@dpdk-ipsec-secgw@exe/ipsec-secgw_sa.c.o'
[1834/1940] Compiling C object 'drivers/a715181@@tmp_rte_pmd_octeontx2_event@sta/event_octeontx2_otx2_worker.c.o'
[1835/1940] Compiling C object 'drivers/a715181@@tmp_rte_pmd_octeontx2_event@sta/event_octeontx2_otx2_worker_dual.c.o'
ninja: build stopped: subcommand failed


DPDK STV team

^ permalink raw reply	[flat|nested] only message in thread

only message in thread, other threads:[~2020-07-11  4:35 UTC | newest]

Thread overview: (only message) (download: mbox.gz / follow: Atom feed)
-- links below jump to the message on this page --
2020-07-11  4:35 [dpdk-test-report] |FAILURE| pw(73635) [v3, 1/3] drivers/net/softnic: Remove the re-implementation of inet_pton sys_stv

automatic DPDK test reports

This inbox may be cloned and mirrored by anyone:

	git clone --mirror http://inbox.dpdk.org/test-report/0 test-report/git/0.git

	# If you have public-inbox 1.1+ installed, you may
	# initialize and index your mirror using the following commands:
	public-inbox-init -V2 test-report test-report/ http://inbox.dpdk.org/test-report \
		test-report@dpdk.org
	public-inbox-index test-report

Example config snippet for mirrors.
Newsgroup available over NNTP:
	nntp://inbox.dpdk.org/inbox.dpdk.test-report


AGPL code for this site: git clone https://public-inbox.org/public-inbox.git