automatic DPDK test reports
 help / color / Atom feed
* [dpdk-test-report] |FAILURE| pw(77740) [4/4] vhost: remove dequeue zero-copy support
@ 2020-09-16  2:18 sys_stv
  0 siblings, 0 replies; only message in thread
From: sys_stv @ 2020-09-16  2:18 UTC (permalink / raw)
  To: test-report

[-- Attachment #1: Type: text/plain, Size: 47207 bytes --]


Test-Label: Intel-compilation
Test-Status: FAILURE
http://dpdk.org/patch/77740

_Compilation issues_

Submitter: Maxime Coquelin <maxime.coquelin@redhat.com>
Date: 2020-09-15 13:35:58
Reply_mail: 20200915133558.210639-5-maxime.coquelin@redhat.com

DPDK git baseline: Repo:dpdk-next-virtio, CommitID: 89f6a4be217f22f7592b616d5d69c775530dce88


Build Summary: 22 Builds Done, 7 Successful, 15 Failures, 0 Blocked

+----------------+------------+--------------+------------+------------+-----------+----------+
| os             | gcc-static | clang-static | icc-static | gcc-shared | gcc-debug | document |
+----------------+------------+--------------+------------+------------+-----------+----------+
| CENTOS82-64    | FAIL       | FAIL         | pass       | FAIL       | FAIL      |          |
| RHEL82-64      | FAIL       |              |            |            |           |          |
| UB1804-64      | FAIL       |              |            |            |           |          |
| FC32-64        | FAIL       | FAIL         |            |            |           |          |
| CENTOS77-64    | FAIL       |              |            |            |           |          |
| UB2004-64      | FAIL       | FAIL         | pass       |            |           | FAIL     |
| WIN10-64       |            | pass         |            |            |           |          |
| UB2004-32      | FAIL       |              |            |            |           |          |
| FreeBSD1201-64 | pass       | pass         |            | pass       | pass      |          |
| SUSE15-64      | FAIL       | FAIL         |            |            |           |          |
+----------------+------------+--------------+------------+------------+-----------+----------+
Test environment and configuration as below:
** Meson build **



OS: CENTOS82-64
	Kernel Version: 4.18.0-193.el8.x86_64
	CPU info: Intel(R) Xeon(R) Platinum 8280M CPU @ 2.70GHz
	GCC Version: gcc (GCC) 8.3.1 20191121 (Red Hat 8.3.1-5)
	Clang Version: 9.0.1 (Red Hat 9.0.1-2.module_el8.2.0+309+0c7b6b03)
	x86_64-gcc-static
	x86_64-clang-static
	x86_64-icc-static
	x86_64-gcc-shared
	x86_64-gcc-debug


OS: RHEL82-64
	Kernel Version: 4.18.0-193.el8.x86_64
	CPU info: Intel(R) Xeon(R) Platinum 8280M CPU @ 2.70GHz
	GCC Version: gcc (GCC) 8.3.1 20191121 (Red Hat 8.3.1-5)
	Clang Version: 8.0.1 (Red Hat 8.0.1-1.module_el8.1.0+215+a01033fb)
	x86_64-gcc-static


OS: UB1804-64
	Kernel Version: 5.3.0-59-generic
	CPU info: Intel(R) Xeon(R) Platinum 8180 CPU @ 2.50GHz
	GCC Version: gcc (Ubuntu 8.4.0-1ubuntu1~18.04) 8.4.0
	Clang Version: 6.0.0-1ubuntu2 (tags/RELEASE_600/final)
	x86_64-gcc-static


OS: FC32-64
	Kernel Version: 5.6.0-0.rc7.git0.2.fc32.x86_64
	CPU info: Intel(R) Xeon(R) Platinum 8280M CPU @ 2.70GHz
	GCC Version: gcc (GCC) 10.0.1 20200311 (Red Hat 10.0.1-0.9)
	Clang Version: 10.0.0 (Fedora 10.0.0-0.3.rc4.fc32)
	x86_64-gcc-static
	x86_64-clang-static


OS: CENTOS77-64
	Kernel Version: 3.10.0-1062.9.1.el7.x86_64
	CPU info: Intel(R) Xeon(R) Platinum 8280M CPU @ 2.70GHz
	GCC Version: gcc (GCC) 4.8.5 20150623 (Red Hat 4.8.5-39)
	Clang Version: 3.4.2 (tags/RELEASE_34/dot2-final)
	x86_64-gcc-static


OS: UB2004-64
	Kernel Version: 5.4.0-26-generic
	CPU info: Intel(R) Xeon(R) Platinum 8180 CPU @ 2.50GHz
	GCC Version: gcc (Ubuntu 10-20200416-0ubuntu1) 10.0.1 20200416 (experimental) [master revision 3c3f12e2a76:dcee354ce56:44b326839d864fc10c459916abcc97f35a9ac3de]
	Clang Version: 10.0.0-4ubuntu1
	x86_64-clang-static
	x86_64-gcc-static
	x86_64-icc-static
	x86_64-gcc-doc


OS: WIN10-64
	Kernel Version: N/A
	CPU info: N/A
	GCC Version: N/A
	Clang Version: Clang 8.0.0
	x86_64-windows-clang


OS: UB2004-32
	Kernel Version: 5.4.0-26-generic
	CPU info: Intel(R) Xeon(R) Platinum 8180 CPU @ 2.50GHz
	GCC Version: gcc (Ubuntu 9.3.0-10ubuntu2) 9.3.0
	Clang Version: 10.0.0-4ubuntu1
	i686-gcc-static


OS: FreeBSD1201-64
	Kernel Version: 12.1-RELEASE
	CPU info: Intel(R) Xeon(R) CPU E5-2699 v3 @ 2.30GHz (2294.74-MHz K8-class CPU)
	GCC Version: gcc (FreeBSD Ports Collection) 9.2.0
	Clang Version: 8.0.1 (tags/RELEASE_801/final 366581) (based on LLVM 8.0.1)
	x86_64-gcc-static
	x86_64-clang-static
	x86_64-gcc-shared
	x86_64-gcc-debug


OS: SUSE15-64
	Kernel Version: 4.12.14-lp150.11-default
	CPU info: Intel(R) Xeon(R) CPU E5-2699 v4 @ 2.20GHz
	GCC Version: gcc (SUSE Linux) 7.3.1 20180323 [gcc-7-branch revision 258812]
	Clang Version: 5.0.1 (tags/RELEASE_501/final 312548)
	x86_64-clang-static
	x86_64-gcc-static



*Build Failed #1:
OS: CENTOS77-64
Target: x86_64-gcc-static
FAILED: lib/76b5a35@@rte_vhost@sta/librte_vhost_vhost_user.c.o 
gcc -Ilib/76b5a35@@rte_vhost@sta -Ilib -I../lib -Ilib/librte_vhost -I../lib/librte_vhost -I. -I../ -Iconfig -I../config -Ilib/librte_eal/include -I../lib/librte_eal/include -Ilib/librte_eal/linux/include -I../lib/librte_eal/linux/include -Ilib/librte_eal/x86/include -I../lib/librte_eal/x86/include -Ilib/librte_eal/common -I../lib/librte_eal/common -Ilib/librte_eal -I../lib/librte_eal -Ilib/librte_kvargs -I../lib/librte_kvargs -Ilib/librte_telemetry/../librte_metrics -I../lib/librte_telemetry/../librte_metrics -Ilib/librte_telemetry -I../lib/librte_telemetry -Ilib/librte_ethdev -I../lib/librte_ethdev -Ilib/librte_net -I../lib/librte_net -Ilib/librte_mbuf -I../lib/librte_mbuf -Ilib/librte_mempool -I../lib/librte_mempool -Ilib/librte_ring -I../lib/librte_ring -Ilib/librte_meter -I../lib/librte_meter -Ilib/librte_cryptodev -I../lib/librte_cryptodev -Ilib/librte_hash -I../lib/librte_hash -Ilib/librte_pci -I../lib/librte_pci -pipe -D_FILE_OFFSET_BITS=64 -Wall -Winvalid-pch -Werror -O3 -include rte_config.h -Wextra -Wcast-qual -Wdeprecated -Wformat-nonliteral -Wformat-security -Wmissing-declarations -Wmissing-prototypes -Wnested-externs -Wold-style-definition -Wpointer-arith -Wsign-compare -Wstrict-prototypes -Wundef -Wwrite-strings -Wno-missing-field-initializers -D_GNU_SOURCE -fPIC -march=native -DALLOW_EXPERIMENTAL_API -DALLOW_INTERNAL_API -fno-strict-aliasing -MD -MQ 'lib/76b5a35@@rte_vhost@sta/librte_vhost_vhost_user.c.o' -MF 'lib/76b5a35@@rte_vhost@sta/librte_vhost_vhost_user.c.o.d' -o 'lib/76b5a35@@rte_vhost@sta/librte_vhost_vhost_user.c.o' -c ../lib/librte_vhost/vhost_user.c
../lib/librte_vhost/vhost_user.c: In function ‘free_mem_region’:
../lib/librte_vhost/vhost_user.c:142:26: error: unused variable ‘vq’ [-Werror=unused-variable]
  struct vhost_virtqueue *vq;
                          ^
cc1: all warnings being treated as errors
[409/2549] Linking target lib/librte_stack.so.20.0.3.
[410/2549] Linking target lib/librte_security.so.20.0.3.
[411/2549] Generating symbol file 'lib/76b5a35@@rte_ethdev@sha/librte_ethdev.so.20.0.3.symbols'.
[412/2549] Compiling C object 'lib/76b5a35@@rte_vhost@sta/librte_vhost_vhost.c.o'.
[413/2549] Generating rib.sym_chk with a meson_exe.py custom command.
[414/2549] Generating symbol file 'lib/76b5a35@@rte_reorder@sha/librte_reorder.so.20.0.3.symbols'.
[415/2549] Generating sched.sym_chk with a meson_exe.py custom command.
[416/2549] Compiling C object 'lib/76b5a35@@rte_vhost@sta/librte_vhost_vhost_crypto.c.o'.
[417/2549] Compiling C object 'lib/76b5a35@@rte_vhost@sta/librte_vhost_virtio_net.c.o'.
ninja: build stopped: subcommand failed




*Build Failed #2:
OS: CENTOS82-64
Target: x86_64-gcc-static
FAILED: lib/76b5a35@@rte_vhost@sta/librte_vhost_vhost_user.c.o 
gcc -Ilib/76b5a35@@rte_vhost@sta -Ilib -I../lib -Ilib/librte_vhost -I../lib/librte_vhost -I. -I../ -Iconfig -I../config -Ilib/librte_eal/include -I../lib/librte_eal/include -Ilib/librte_eal/linux/include -I../lib/librte_eal/linux/include -Ilib/librte_eal/x86/include -I../lib/librte_eal/x86/include -Ilib/librte_eal/common -I../lib/librte_eal/common -Ilib/librte_eal -I../lib/librte_eal -Ilib/librte_kvargs -I../lib/librte_kvargs -Ilib/librte_telemetry/../librte_metrics -I../lib/librte_telemetry/../librte_metrics -Ilib/librte_telemetry -I../lib/librte_telemetry -Ilib/librte_ethdev -I../lib/librte_ethdev -Ilib/librte_net -I../lib/librte_net -Ilib/librte_mbuf -I../lib/librte_mbuf -Ilib/librte_mempool -I../lib/librte_mempool -Ilib/librte_ring -I../lib/librte_ring -Ilib/librte_meter -I../lib/librte_meter -Ilib/librte_cryptodev -I../lib/librte_cryptodev -Ilib/librte_hash -I../lib/librte_hash -Ilib/librte_pci -I../lib/librte_pci -fdiagnostics-color=always -pipe -D_FILE_OFFSET_BITS=64 -Wall -Winvalid-pch -Werror -O3 -include rte_config.h -Wextra -Wcast-qual -Wdeprecated -Wformat-nonliteral -Wformat-security -Wmissing-declarations -Wmissing-prototypes -Wnested-externs -Wold-style-definition -Wpointer-arith -Wsign-compare -Wstrict-prototypes -Wundef -Wwrite-strings -Wno-packed-not-aligned -Wno-missing-field-initializers -D_GNU_SOURCE -fPIC -march=native -mno-avx512f -DALLOW_EXPERIMENTAL_API -DALLOW_INTERNAL_API -Wno-format-truncation -DVHOST_GCC_UNROLL_PRAGMA -fno-strict-aliasing -MD -MQ 'lib/76b5a35@@rte_vhost@sta/librte_vhost_vhost_user.c.o' -MF 'lib/76b5a35@@rte_vhost@sta/librte_vhost_vhost_user.c.o.d' -o 'lib/76b5a35@@rte_vhost@sta/librte_vhost_vhost_user.c.o' -c ../lib/librte_vhost/vhost_user.c
../lib/librte_vhost/vhost_user.c: In function ‘free_mem_region’:
../lib/librte_vhost/vhost_user.c:142:26: error: unused variable ‘vq’ [-Werror=unused-variable]
  struct vhost_virtqueue *vq;
                          ^~
cc1: all warnings being treated as errors
[424/2582] Generating symbol file 'lib/76b5a35@@rte_stack@sha/librte_stack.so.20.0.3.symbols'.
[425/2582] Generating symbol file 'lib/76b5a35@@rte_security@sha/librte_security.so.20.0.3.symbols'.
[426/2582] Generating sched.sym_chk with a meson_exe.py custom command.
[427/2582] Compiling C object 'lib/76b5a35@@rte_ipsec@sta/librte_ipsec_sa.c.o'.
[428/2582] Generating symbol file 'lib/76b5a35@@rte_rib@sha/librte_rib.so.20.0.3.symbols'.
[429/2582] Compiling C object 'lib/76b5a35@@rte_ipsec@sta/librte_ipsec_esp_outb.c.o'.
[430/2582] Compiling C object 'lib/76b5a35@@rte_vhost@sta/librte_vhost_vhost_crypto.c.o'.
[431/2582] Compiling C object 'lib/76b5a35@@rte_ipsec@sta/librte_ipsec_esp_inb.c.o'.
[432/2582] Compiling C object 'lib/76b5a35@@rte_vhost@sta/librte_vhost_virtio_net.c.o'.
ninja: build stopped: subcommand failed




*Build Failed #3:
OS: CENTOS82-64
Target: x86_64-clang-static
FAILED: lib/76b5a35@@rte_vhost@sta/librte_vhost_vhost_user.c.o 
clang -Ilib/76b5a35@@rte_vhost@sta -Ilib -I../lib -Ilib/librte_vhost -I../lib/librte_vhost -I. -I../ -Iconfig -I../config -Ilib/librte_eal/include -I../lib/librte_eal/include -Ilib/librte_eal/linux/include -I../lib/librte_eal/linux/include -Ilib/librte_eal/x86/include -I../lib/librte_eal/x86/include -Ilib/librte_eal/common -I../lib/librte_eal/common -Ilib/librte_eal -I../lib/librte_eal -Ilib/librte_kvargs -I../lib/librte_kvargs -Ilib/librte_telemetry/../librte_metrics -I../lib/librte_telemetry/../librte_metrics -Ilib/librte_telemetry -I../lib/librte_telemetry -Ilib/librte_ethdev -I../lib/librte_ethdev -Ilib/librte_net -I../lib/librte_net -Ilib/librte_mbuf -I../lib/librte_mbuf -Ilib/librte_mempool -I../lib/librte_mempool -Ilib/librte_ring -I../lib/librte_ring -Ilib/librte_meter -I../lib/librte_meter -Ilib/librte_cryptodev -I../lib/librte_cryptodev -Ilib/librte_hash -I../lib/librte_hash -Ilib/librte_pci -I../lib/librte_pci -Xclang -fcolor-diagnostics -pipe -D_FILE_OFFSET_BITS=64 -Wall -Winvalid-pch -Werror -O3 -include rte_config.h -Wextra -Wcast-qual -Wdeprecated -Wformat-nonliteral -Wformat-security -Wmissing-declarations -Wmissing-prototypes -Wnested-externs -Wold-style-definition -Wpointer-arith -Wsign-compare -Wstrict-prototypes -Wundef -Wwrite-strings -Wno-address-of-packed-member -Wno-missing-field-initializers -D_GNU_SOURCE -fPIC -march=native -mno-avx512f -DALLOW_EXPERIMENTAL_API -DALLOW_INTERNAL_API -DVHOST_CLANG_UNROLL_PRAGMA -fno-strict-aliasing -MD -MQ 'lib/76b5a35@@rte_vhost@sta/librte_vhost_vhost_user.c.o' -MF 'lib/76b5a35@@rte_vhost@sta/librte_vhost_vhost_user.c.o.d' -o 'lib/76b5a35@@rte_vhost@sta/librte_vhost_vhost_user.c.o' -c ../lib/librte_vhost/vhost_user.c
../lib/librte_vhost/vhost_user.c:142:26: error: unused variable 'vq' [-Werror,-Wunused-variable]
        struct vhost_virtqueue *vq;
                                ^
1 error generated.
[429/2582] Generating symbol file 'lib/76b5a35@@rte_sched@sha/librte_sched.so.20.0.3.symbols'.
[430/2582] Compiling C object 'lib/76b5a35@@rte_ipsec@sta/librte_ipsec_ipsec_sad.c.o'.
[431/2582] Compiling C object 'lib/76b5a35@@rte_vhost@sta/librte_vhost_vhost.c.o'.
[432/2582] Compiling C object 'lib/76b5a35@@rte_ipsec@sta/librte_ipsec_ses.c.o'.
[433/2582] Compiling C object 'lib/76b5a35@@rte_ipsec@sta/librte_ipsec_sa.c.o'.
[434/2582] Compiling C object 'lib/76b5a35@@rte_ipsec@sta/librte_ipsec_esp_outb.c.o'.
[435/2582] Compiling C object 'lib/76b5a35@@rte_ipsec@sta/librte_ipsec_esp_inb.c.o'.
[436/2582] Compiling C object 'lib/76b5a35@@rte_vhost@sta/librte_vhost_vhost_crypto.c.o'.
[437/2582] Compiling C object 'lib/76b5a35@@rte_vhost@sta/librte_vhost_virtio_net.c.o'.
ninja: build stopped: subcommand failed




*Build Failed #4:
OS: CENTOS82-64
Target: x86_64-gcc-shared
FAILED: lib/76b5a35@@rte_vhost@sta/librte_vhost_vhost_user.c.o 
gcc -Ilib/76b5a35@@rte_vhost@sta -Ilib -I../lib -Ilib/librte_vhost -I../lib/librte_vhost -I. -I../ -Iconfig -I../config -Ilib/librte_eal/include -I../lib/librte_eal/include -Ilib/librte_eal/linux/include -I../lib/librte_eal/linux/include -Ilib/librte_eal/x86/include -I../lib/librte_eal/x86/include -Ilib/librte_eal/common -I../lib/librte_eal/common -Ilib/librte_eal -I../lib/librte_eal -Ilib/librte_kvargs -I../lib/librte_kvargs -Ilib/librte_telemetry/../librte_metrics -I../lib/librte_telemetry/../librte_metrics -Ilib/librte_telemetry -I../lib/librte_telemetry -Ilib/librte_ethdev -I../lib/librte_ethdev -Ilib/librte_net -I../lib/librte_net -Ilib/librte_mbuf -I../lib/librte_mbuf -Ilib/librte_mempool -I../lib/librte_mempool -Ilib/librte_ring -I../lib/librte_ring -Ilib/librte_meter -I../lib/librte_meter -Ilib/librte_cryptodev -I../lib/librte_cryptodev -Ilib/librte_hash -I../lib/librte_hash -Ilib/librte_pci -I../lib/librte_pci -fdiagnostics-color=always -pipe -D_FILE_OFFSET_BITS=64 -Wall -Winvalid-pch -Werror -O3 -include rte_config.h -Wextra -Wcast-qual -Wdeprecated -Wformat-nonliteral -Wformat-security -Wmissing-declarations -Wmissing-prototypes -Wnested-externs -Wold-style-definition -Wpointer-arith -Wsign-compare -Wstrict-prototypes -Wundef -Wwrite-strings -Wno-packed-not-aligned -Wno-missing-field-initializers -D_GNU_SOURCE -fPIC -march=native -mno-avx512f -DALLOW_EXPERIMENTAL_API -DALLOW_INTERNAL_API -Wno-format-truncation -DVHOST_GCC_UNROLL_PRAGMA -fno-strict-aliasing -MD -MQ 'lib/76b5a35@@rte_vhost@sta/librte_vhost_vhost_user.c.o' -MF 'lib/76b5a35@@rte_vhost@sta/librte_vhost_vhost_user.c.o.d' -o 'lib/76b5a35@@rte_vhost@sta/librte_vhost_vhost_user.c.o' -c ../lib/librte_vhost/vhost_user.c
../lib/librte_vhost/vhost_user.c: In function ‘free_mem_region’:
../lib/librte_vhost/vhost_user.c:142:26: error: unused variable ‘vq’ [-Werror=unused-variable]
  struct vhost_virtqueue *vq;
                          ^~
cc1: all warnings being treated as errors
[442/2611] Compiling C object 'lib/76b5a35@@rte_ipsec@sta/librte_ipsec_sa.c.o'.
[443/2611] Compiling C object 'lib/76b5a35@@rte_ipsec@sta/librte_ipsec_esp_inb.c.o'.
[444/2611] Compiling C object 'lib/76b5a35@@rte_ipsec@sta/librte_ipsec_esp_outb.c.o'.
[445/2611] Compiling C object 'lib/76b5a35@@rte_vhost@sta/librte_vhost_vhost_crypto.c.o'.
[446/2611] Compiling C object 'lib/76b5a35@@rte_vhost@sta/librte_vhost_virtio_net.c.o'.
ninja: build stopped: subcommand failed




*Build Failed #5:
OS: CENTOS82-64
Target: x86_64-gcc-debug
FAILED: lib/76b5a35@@rte_vhost@sta/librte_vhost_vhost_user.c.o 
gcc -Ilib/76b5a35@@rte_vhost@sta -Ilib -I../lib -Ilib/librte_vhost -I../lib/librte_vhost -I. -I../ -Iconfig -I../config -Ilib/librte_eal/include -I../lib/librte_eal/include -Ilib/librte_eal/linux/include -I../lib/librte_eal/linux/include -Ilib/librte_eal/x86/include -I../lib/librte_eal/x86/include -Ilib/librte_eal/common -I../lib/librte_eal/common -Ilib/librte_eal -I../lib/librte_eal -Ilib/librte_kvargs -I../lib/librte_kvargs -Ilib/librte_telemetry/../librte_metrics -I../lib/librte_telemetry/../librte_metrics -Ilib/librte_telemetry -I../lib/librte_telemetry -Ilib/librte_ethdev -I../lib/librte_ethdev -Ilib/librte_net -I../lib/librte_net -Ilib/librte_mbuf -I../lib/librte_mbuf -Ilib/librte_mempool -I../lib/librte_mempool -Ilib/librte_ring -I../lib/librte_ring -Ilib/librte_meter -I../lib/librte_meter -Ilib/librte_cryptodev -I../lib/librte_cryptodev -Ilib/librte_hash -I../lib/librte_hash -Ilib/librte_pci -I../lib/librte_pci -fdiagnostics-color=always -pipe -D_FILE_OFFSET_BITS=64 -Wall -Winvalid-pch -Werror -O2 -g -include rte_config.h -Wextra -Wcast-qual -Wdeprecated -Wformat-nonliteral -Wformat-security -Wmissing-declarations -Wmissing-prototypes -Wnested-externs -Wold-style-definition -Wpointer-arith -Wsign-compare -Wstrict-prototypes -Wundef -Wwrite-strings -Wno-packed-not-aligned -Wno-missing-field-initializers -D_GNU_SOURCE -fPIC -march=native -mno-avx512f -DALLOW_EXPERIMENTAL_API -DALLOW_INTERNAL_API -Wno-format-truncation -DVHOST_GCC_UNROLL_PRAGMA -fno-strict-aliasing -MD -MQ 'lib/76b5a35@@rte_vhost@sta/librte_vhost_vhost_user.c.o' -MF 'lib/76b5a35@@rte_vhost@sta/librte_vhost_vhost_user.c.o.d' -o 'lib/76b5a35@@rte_vhost@sta/librte_vhost_vhost_user.c.o' -c ../lib/librte_vhost/vhost_user.c
../lib/librte_vhost/vhost_user.c: In function ‘free_mem_region’:
../lib/librte_vhost/vhost_user.c:142:26: error: unused variable ‘vq’ [-Werror=unused-variable]
  struct vhost_virtqueue *vq;
                          ^~
cc1: all warnings being treated as errors
[428/2582] Generating symbol file 'lib/76b5a35@@rte_sched@sha/librte_sched.so.20.0.3.symbols'.
[429/2582] Generating symbol file 'lib/76b5a35@@rte_rib@sha/librte_rib.so.20.0.3.symbols'.
[430/2582] Compiling C object 'lib/76b5a35@@rte_ipsec@sta/librte_ipsec_esp_outb.c.o'.
[431/2582] Compiling C object 'lib/76b5a35@@rte_vhost@sta/librte_vhost_vhost_crypto.c.o'.
[432/2582] Compiling C object 'lib/76b5a35@@rte_vhost@sta/librte_vhost_virtio_net.c.o'.
ninja: build stopped: subcommand failed




*Build Failed #6:
OS: FC32-64
Target: x86_64-gcc-static
FAILED: lib/76b5a35@@rte_vhost@sta/librte_vhost_vhost_user.c.o 
gcc -Ilib/76b5a35@@rte_vhost@sta -Ilib -I../lib -Ilib/librte_vhost -I../lib/librte_vhost -I. -I../ -Iconfig -I../config -Ilib/librte_eal/include -I../lib/librte_eal/include -Ilib/librte_eal/linux/include -I../lib/librte_eal/linux/include -Ilib/librte_eal/x86/include -I../lib/librte_eal/x86/include -Ilib/librte_eal/common -I../lib/librte_eal/common -Ilib/librte_eal -I../lib/librte_eal -Ilib/librte_kvargs -I../lib/librte_kvargs -Ilib/librte_telemetry/../librte_metrics -I../lib/librte_telemetry/../librte_metrics -Ilib/librte_telemetry -I../lib/librte_telemetry -Ilib/librte_ethdev -I../lib/librte_ethdev -Ilib/librte_net -I../lib/librte_net -Ilib/librte_mbuf -I../lib/librte_mbuf -Ilib/librte_mempool -I../lib/librte_mempool -Ilib/librte_ring -I../lib/librte_ring -Ilib/librte_meter -I../lib/librte_meter -Ilib/librte_cryptodev -I../lib/librte_cryptodev -Ilib/librte_hash -I../lib/librte_hash -Ilib/librte_pci -I../lib/librte_pci -fdiagnostics-color=always -pipe -D_FILE_OFFSET_BITS=64 -Wall -Winvalid-pch -Werror -O3 -include rte_config.h -Wextra -Wcast-qual -Wdeprecated -Wformat-nonliteral -Wformat-security -Wmissing-declarations -Wmissing-prototypes -Wnested-externs -Wold-style-definition -Wpointer-arith -Wsign-compare -Wstrict-prototypes -Wundef -Wwrite-strings -Wno-address-of-packed-member -Wno-packed-not-aligned -Wno-missing-field-initializers -Wno-zero-length-bounds -D_GNU_SOURCE -fPIC -march=native -DALLOW_EXPERIMENTAL_API -DALLOW_INTERNAL_API -Wno-format-truncation -DVHOST_GCC_UNROLL_PRAGMA -fno-strict-aliasing -MD -MQ 'lib/76b5a35@@rte_vhost@sta/librte_vhost_vhost_user.c.o' -MF 'lib/76b5a35@@rte_vhost@sta/librte_vhost_vhost_user.c.o.d' -o 'lib/76b5a35@@rte_vhost@sta/librte_vhost_vhost_user.c.o' -c ../lib/librte_vhost/vhost_user.c
../lib/librte_vhost/vhost_user.c: In function ‘free_mem_region’:
../lib/librte_vhost/vhost_user.c:142:26: error: unused variable ‘vq’ [-Werror=unused-variable]
  142 |  struct vhost_virtqueue *vq;
      |                          ^~
cc1: all warnings being treated as errors
[441/2583] Compiling C object 'lib/76b5a35@@rte_fib@sta/librte_fib_dir24_8.c.o'.
[442/2583] Compiling C object 'lib/76b5a35@@rte_ipsec@sta/librte_ipsec_esp_outb.c.o'.
[443/2583] Compiling C object 'lib/76b5a35@@rte_ipsec@sta/librte_ipsec_esp_inb.c.o'.
[444/2583] Compiling C object 'lib/76b5a35@@rte_port@sta/librte_port_rte_port_ras.c.o'.
[445/2583] Compiling C object 'lib/76b5a35@@rte_vhost@sta/librte_vhost_vhost_crypto.c.o'.
[446/2583] Compiling C object 'lib/76b5a35@@rte_port@sta/librte_port_rte_port_fd.c.o'.
[447/2583] Compiling C object 'lib/76b5a35@@rte_port@sta/librte_port_rte_port_frag.c.o'.
[448/2583] Compiling C object 'lib/76b5a35@@rte_port@sta/librte_port_rte_port_ethdev.c.o'.
[449/2583] Compiling C object 'lib/76b5a35@@rte_fib@sta/librte_fib_trie.c.o'.
[450/2583] Compiling C object 'lib/76b5a35@@rte_port@sta/librte_port_rte_port_ring.c.o'.
[451/2583] Compiling C object 'lib/76b5a35@@rte_vhost@sta/librte_vhost_virtio_net.c.o'.
ninja: build stopped: subcommand failed




*Build Failed #7:
OS: FC32-64
Target: x86_64-clang-static
FAILED: lib/76b5a35@@rte_vhost@sta/librte_vhost_vhost_user.c.o 
clang -Ilib/76b5a35@@rte_vhost@sta -Ilib -I../lib -Ilib/librte_vhost -I../lib/librte_vhost -I. -I../ -Iconfig -I../config -Ilib/librte_eal/include -I../lib/librte_eal/include -Ilib/librte_eal/linux/include -I../lib/librte_eal/linux/include -Ilib/librte_eal/x86/include -I../lib/librte_eal/x86/include -Ilib/librte_eal/common -I../lib/librte_eal/common -Ilib/librte_eal -I../lib/librte_eal -Ilib/librte_kvargs -I../lib/librte_kvargs -Ilib/librte_telemetry/../librte_metrics -I../lib/librte_telemetry/../librte_metrics -Ilib/librte_telemetry -I../lib/librte_telemetry -Ilib/librte_ethdev -I../lib/librte_ethdev -Ilib/librte_net -I../lib/librte_net -Ilib/librte_mbuf -I../lib/librte_mbuf -Ilib/librte_mempool -I../lib/librte_mempool -Ilib/librte_ring -I../lib/librte_ring -Ilib/librte_meter -I../lib/librte_meter -Ilib/librte_cryptodev -I../lib/librte_cryptodev -Ilib/librte_hash -I../lib/librte_hash -Ilib/librte_pci -I../lib/librte_pci -Xclang -fcolor-diagnostics -pipe -D_FILE_OFFSET_BITS=64 -Wall -Winvalid-pch -Werror -O3 -include rte_config.h -Wextra -Wcast-qual -Wdeprecated -Wformat-nonliteral -Wformat-security -Wmissing-declarations -Wmissing-prototypes -Wnested-externs -Wold-style-definition -Wpointer-arith -Wsign-compare -Wstrict-prototypes -Wundef -Wwrite-strings -Wno-address-of-packed-member -Wno-missing-field-initializers -D_GNU_SOURCE -fPIC -march=native -DALLOW_EXPERIMENTAL_API -DALLOW_INTERNAL_API -DVHOST_CLANG_UNROLL_PRAGMA -fno-strict-aliasing -MD -MQ 'lib/76b5a35@@rte_vhost@sta/librte_vhost_vhost_user.c.o' -MF 'lib/76b5a35@@rte_vhost@sta/librte_vhost_vhost_user.c.o.d' -o 'lib/76b5a35@@rte_vhost@sta/librte_vhost_vhost_user.c.o' -c ../lib/librte_vhost/vhost_user.c
../lib/librte_vhost/vhost_user.c:142:26: error: unused variable 'vq' [-Werror,-Wunused-variable]
        struct vhost_virtqueue *vq;
                                ^
1 error generated.
[428/2583] Compiling C object 'lib/76b5a35@@rte_ipsec@sta/librte_ipsec_ipsec_sad.c.o'.
[429/2583] Compiling C object 'lib/76b5a35@@rte_ipsec@sta/librte_ipsec_ses.c.o'.
[430/2583] Generating symbol file 'lib/76b5a35@@rte_sched@sha/librte_sched.so.20.0.3.symbols'.
[431/2583] Compiling C object 'lib/76b5a35@@rte_ipsec@sta/librte_ipsec_sa.c.o'.
[432/2583] Compiling C object 'lib/76b5a35@@rte_vhost@sta/librte_vhost_vhost.c.o'.
[433/2583] Compiling C object 'lib/76b5a35@@rte_ipsec@sta/librte_ipsec_esp_inb.c.o'.
[434/2583] Compiling C object 'lib/76b5a35@@rte_ipsec@sta/librte_ipsec_esp_outb.c.o'.
[435/2583] Compiling C object 'lib/76b5a35@@rte_vhost@sta/librte_vhost_vhost_crypto.c.o'.
[436/2583] Compiling C object 'lib/76b5a35@@rte_vhost@sta/librte_vhost_virtio_net.c.o'.
ninja: build stopped: subcommand failed




*Build Failed #8:
OS: RHEL82-64
Target: x86_64-gcc-static
FAILED: lib/76b5a35@@rte_vhost@sta/librte_vhost_vhost_user.c.o 
gcc -Ilib/76b5a35@@rte_vhost@sta -Ilib -I../lib -Ilib/librte_vhost -I../lib/librte_vhost -I. -I../ -Iconfig -I../config -Ilib/librte_eal/include -I../lib/librte_eal/include -Ilib/librte_eal/linux/include -I../lib/librte_eal/linux/include -Ilib/librte_eal/x86/include -I../lib/librte_eal/x86/include -Ilib/librte_eal/common -I../lib/librte_eal/common -Ilib/librte_eal -I../lib/librte_eal -Ilib/librte_kvargs -I../lib/librte_kvargs -Ilib/librte_telemetry/../librte_metrics -I../lib/librte_telemetry/../librte_metrics -Ilib/librte_telemetry -I../lib/librte_telemetry -Ilib/librte_ethdev -I../lib/librte_ethdev -Ilib/librte_net -I../lib/librte_net -Ilib/librte_mbuf -I../lib/librte_mbuf -Ilib/librte_mempool -I../lib/librte_mempool -Ilib/librte_ring -I../lib/librte_ring -Ilib/librte_meter -I../lib/librte_meter -Ilib/librte_cryptodev -I../lib/librte_cryptodev -Ilib/librte_hash -I../lib/librte_hash -Ilib/librte_pci -I../lib/librte_pci -fdiagnostics-color=always -pipe -D_FILE_OFFSET_BITS=64 -Wall -Winvalid-pch -Werror -O3 -include rte_config.h -Wextra -Wcast-qual -Wdeprecated -Wformat-nonliteral -Wformat-security -Wmissing-declarations -Wmissing-prototypes -Wnested-externs -Wold-style-definition -Wpointer-arith -Wsign-compare -Wstrict-prototypes -Wundef -Wwrite-strings -Wno-packed-not-aligned -Wno-missing-field-initializers -D_GNU_SOURCE -fPIC -march=native -mno-avx512f -DALLOW_EXPERIMENTAL_API -DALLOW_INTERNAL_API -Wno-format-truncation -DVHOST_GCC_UNROLL_PRAGMA -fno-strict-aliasing -MD -MQ 'lib/76b5a35@@rte_vhost@sta/librte_vhost_vhost_user.c.o' -MF 'lib/76b5a35@@rte_vhost@sta/librte_vhost_vhost_user.c.o.d' -o 'lib/76b5a35@@rte_vhost@sta/librte_vhost_vhost_user.c.o' -c ../lib/librte_vhost/vhost_user.c
../lib/librte_vhost/vhost_user.c: In function ‘free_mem_region’:
../lib/librte_vhost/vhost_user.c:142:26: error: unused variable ‘vq’ [-Werror=unused-variable]
  struct vhost_virtqueue *vq;
                          ^~
cc1: all warnings being treated as errors
[436/2582] Compiling C object 'lib/76b5a35@@rte_ipsec@sta/librte_ipsec_esp_inb.c.o'.
[437/2582] Compiling C object 'lib/76b5a35@@rte_fib@sta/librte_fib_rte_fib.c.o'.
[438/2582] Compiling C object 'lib/76b5a35@@rte_ipsec@sta/librte_ipsec_esp_outb.c.o'.
[439/2582] Generating symbol file 'lib/76b5a35@@rte_sched@sha/librte_sched.so.20.0.3.symbols'.
[440/2582] Compiling C object 'lib/76b5a35@@rte_ipsec@sta/librte_ipsec_ipsec_sad.c.o'.
[441/2582] Compiling C object 'lib/76b5a35@@rte_fib@sta/librte_fib_rte_fib6.c.o'.
[442/2582] Compiling C object 'lib/76b5a35@@rte_vhost@sta/librte_vhost_vhost_crypto.c.o'.
[443/2582] Compiling C object 'lib/76b5a35@@rte_fib@sta/librte_fib_dir24_8.c.o'.
[444/2582] Compiling C object 'lib/76b5a35@@rte_vhost@sta/librte_vhost_virtio_net.c.o'.
ninja: build stopped: subcommand failed




*Build Failed #9:
OS: SUSE15-64
Target: x86_64-clang-static
FAILED: lib/librte_vhost.a.p/librte_vhost_vhost_user.c.o 
clang -Ilib/librte_vhost.a.p -Ilib -I../lib -Ilib/librte_vhost -I../lib/librte_vhost -I. -I.. -Iconfig -I../config -Ilib/librte_eal/include -I../lib/librte_eal/include -Ilib/librte_eal/linux/include -I../lib/librte_eal/linux/include -Ilib/librte_eal/x86/include -I../lib/librte_eal/x86/include -Ilib/librte_eal/common -I../lib/librte_eal/common -Ilib/librte_eal -I../lib/librte_eal -Ilib/librte_kvargs -I../lib/librte_kvargs -Ilib/librte_metrics -I../lib/librte_metrics -Ilib/librte_telemetry -I../lib/librte_telemetry -Ilib/librte_ethdev -I../lib/librte_ethdev -Ilib/librte_net -I../lib/librte_net -Ilib/librte_mbuf -I../lib/librte_mbuf -Ilib/librte_mempool -I../lib/librte_mempool -Ilib/librte_ring -I../lib/librte_ring -Ilib/librte_meter -I../lib/librte_meter -Ilib/librte_cryptodev -I../lib/librte_cryptodev -Ilib/librte_hash -I../lib/librte_hash -Ilib/librte_pci -I../lib/librte_pci -Xclang -fcolor-diagnostics -pipe -D_FILE_OFFSET_BITS=64 -Wall -Winvalid-pch -Werror -O3 -include rte_config.h -Wextra -Wcast-qual -Wdeprecated -Wformat-nonliteral -Wformat-security -Wmissing-declarations -Wmissing-prototypes -Wnested-externs -Wold-style-definition -Wpointer-arith -Wsign-compare -Wstrict-prototypes -Wundef -Wwrite-strings -Wno-address-of-packed-member -Wno-missing-field-initializers -D_GNU_SOURCE -fPIC -march=native -DALLOW_EXPERIMENTAL_API -DALLOW_INTERNAL_API -DVHOST_CLANG_UNROLL_PRAGMA -fno-strict-aliasing -MD -MQ lib/librte_vhost.a.p/librte_vhost_vhost_user.c.o -MF lib/librte_vhost.a.p/librte_vhost_vhost_user.c.o.d -o lib/librte_vhost.a.p/librte_vhost_vhost_user.c.o -c ../lib/librte_vhost/vhost_user.c
../lib/librte_vhost/vhost_user.c:142:26: error: unused variable 'vq' [-Werror,-Wunused-variable]
        struct vhost_virtqueue *vq;
                                ^
1 error generated.
[425/2551] Generating sched.sym_chk with a meson_exe.py custom command
[426/2551] Linking target lib/librte_security.so.20.0.3
[427/2551] Generating symbol file lib/librte_stack.so.20.0.3.p/librte_stack.so.20.0.3.symbols
[428/2551] Compiling C object lib/librte_vhost.a.p/librte_vhost_socket.c.o
[429/2551] Generating symbol file lib/librte_rib.so.20.0.3.p/librte_rib.so.20.0.3.symbols
[430/2551] Compiling C object lib/librte_vhost.a.p/librte_vhost_vhost.c.o
[431/2551] Compiling C object lib/librte_ipsec.a.p/librte_ipsec_esp_outb.c.o
[432/2551] Compiling C object lib/librte_vhost.a.p/librte_vhost_vhost_crypto.c.o
[433/2551] Compiling C object lib/librte_vhost.a.p/librte_vhost_virtio_net.c.o
ninja: build stopped: subcommand failed




*Build Failed #10:
OS: SUSE15-64
Target: x86_64-gcc-static
FAILED: lib/76b5a35@@rte_vhost@sta/librte_vhost_vhost_user.c.o 
gcc -Ilib/76b5a35@@rte_vhost@sta -Ilib -I../lib -Ilib/librte_vhost -I../lib/librte_vhost -I. -I.. -Iconfig -I../config -Ilib/librte_eal/include -I../lib/librte_eal/include -Ilib/librte_eal/linux/include -I../lib/librte_eal/linux/include -Ilib/librte_eal/x86/include -I../lib/librte_eal/x86/include -Ilib/librte_eal/common -I../lib/librte_eal/common -Ilib/librte_eal -I../lib/librte_eal -Ilib/librte_kvargs -I../lib/librte_kvargs -Ilib/librte_metrics -I../lib/librte_metrics -Ilib/librte_telemetry -I../lib/librte_telemetry -Ilib/librte_ethdev -I../lib/librte_ethdev -Ilib/librte_net -I../lib/librte_net -Ilib/librte_mbuf -I../lib/librte_mbuf -Ilib/librte_mempool -I../lib/librte_mempool -Ilib/librte_ring -I../lib/librte_ring -Ilib/librte_meter -I../lib/librte_meter -Ilib/librte_cryptodev -I../lib/librte_cryptodev -Ilib/librte_hash -I../lib/librte_hash -Ilib/librte_pci -I../lib/librte_pci -fdiagnostics-color=always -pipe -D_FILE_OFFSET_BITS=64 -Wall -Winvalid-pch -Werror -O3 -include rte_config.h -Wextra -Wcast-qual -Wdeprecated -Wformat-nonliteral -Wformat-security -Wmissing-declarations -Wmissing-prototypes -Wnested-externs -Wold-style-definition -Wpointer-arith -Wsign-compare -Wstrict-prototypes -Wundef -Wwrite-strings -Wno-missing-field-initializers -D_GNU_SOURCE -fPIC -march=native -DALLOW_EXPERIMENTAL_API -DALLOW_INTERNAL_API -Wno-format-truncation -fno-strict-aliasing -MD -MQ 'lib/76b5a35@@rte_vhost@sta/librte_vhost_vhost_user.c.o' -MF 'lib/76b5a35@@rte_vhost@sta/librte_vhost_vhost_user.c.o.d' -o 'lib/76b5a35@@rte_vhost@sta/librte_vhost_vhost_user.c.o' -c ../lib/librte_vhost/vhost_user.c
../lib/librte_vhost/vhost_user.c: In function ‘free_mem_region’:
../lib/librte_vhost/vhost_user.c:142:26: error: unused variable ‘vq’ [-Werror=unused-variable]
  struct vhost_virtqueue *vq;
                          ^~
cc1: all warnings being treated as errors
[432/2551] Compiling C object 'lib/76b5a35@@rte_ipsec@sta/librte_ipsec_ses.c.o'
[433/2551] Compiling C object 'lib/76b5a35@@rte_ipsec@sta/librte_ipsec_sa.c.o'
[434/2551] Compiling C object 'lib/76b5a35@@rte_fib@sta/librte_fib_rte_fib6.c.o'
[435/2551] Generating symbol file 'lib/76b5a35@@rte_sched@sha/librte_sched.so.20.0.3.symbols'
[436/2551] Compiling C object 'lib/76b5a35@@rte_ipsec@sta/librte_ipsec_ipsec_sad.c.o'
[437/2551] Compiling C object 'lib/76b5a35@@rte_ipsec@sta/librte_ipsec_esp_inb.c.o'
[438/2551] Compiling C object 'lib/76b5a35@@rte_ipsec@sta/librte_ipsec_esp_outb.c.o'
[439/2551] Compiling C object 'lib/76b5a35@@rte_vhost@sta/librte_vhost_vhost_crypto.c.o'
[440/2551] Compiling C object 'lib/76b5a35@@rte_vhost@sta/librte_vhost_virtio_net.c.o'
ninja: build stopped: subcommand failed




*Build Failed #11:
OS: UB1804-64
Target: x86_64-gcc-static
FAILED: lib/76b5a35@@rte_vhost@sta/librte_vhost_vhost_user.c.o 
gcc -Ilib/76b5a35@@rte_vhost@sta -Ilib -I../lib -Ilib/librte_vhost -I../lib/librte_vhost -I. -I../ -Iconfig -I../config -Ilib/librte_eal/include -I../lib/librte_eal/include -Ilib/librte_eal/linux/include -I../lib/librte_eal/linux/include -Ilib/librte_eal/x86/include -I../lib/librte_eal/x86/include -Ilib/librte_eal/common -I../lib/librte_eal/common -Ilib/librte_eal -I../lib/librte_eal -Ilib/librte_kvargs -I../lib/librte_kvargs -Ilib/librte_telemetry/../librte_metrics -I../lib/librte_telemetry/../librte_metrics -Ilib/librte_telemetry -I../lib/librte_telemetry -Ilib/librte_ethdev -I../lib/librte_ethdev -Ilib/librte_net -I../lib/librte_net -Ilib/librte_mbuf -I../lib/librte_mbuf -Ilib/librte_mempool -I../lib/librte_mempool -Ilib/librte_ring -I../lib/librte_ring -Ilib/librte_meter -I../lib/librte_meter -Ilib/librte_cryptodev -I../lib/librte_cryptodev -Ilib/librte_hash -I../lib/librte_hash -Ilib/librte_pci -I../lib/librte_pci -fdiagnostics-color=always -pipe -D_FILE_OFFSET_BITS=64 -Wall -Winvalid-pch -Werror -O3 -include rte_config.h -Wextra -Wcast-qual -Wdeprecated -Wformat-nonliteral -Wformat-security -Wmissing-declarations -Wmissing-prototypes -Wnested-externs -Wold-style-definition -Wpointer-arith -Wsign-compare -Wstrict-prototypes -Wundef -Wwrite-strings -Wno-packed-not-aligned -Wno-missing-field-initializers -D_GNU_SOURCE -fPIC -march=native -mno-avx512f -DALLOW_EXPERIMENTAL_API -DALLOW_INTERNAL_API -Wno-format-truncation -DVHOST_GCC_UNROLL_PRAGMA -fno-strict-aliasing -MD -MQ 'lib/76b5a35@@rte_vhost@sta/librte_vhost_vhost_user.c.o' -MF 'lib/76b5a35@@rte_vhost@sta/librte_vhost_vhost_user.c.o.d' -o 'lib/76b5a35@@rte_vhost@sta/librte_vhost_vhost_user.c.o' -c ../lib/librte_vhost/vhost_user.c
../lib/librte_vhost/vhost_user.c: In function ‘free_mem_region’:
../lib/librte_vhost/vhost_user.c:142:26: error: unused variable ‘vq’ [-Werror=unused-variable]
  struct vhost_virtqueue *vq;
                          ^~
cc1: all warnings being treated as errors
[435/2571] Compiling C object 'lib/76b5a35@@rte_ipsec@sta/librte_ipsec_sa.c.o'.
[436/2571] Compiling C object 'lib/76b5a35@@rte_fib@sta/librte_fib_rte_fib6.c.o'.
[437/2571] Compiling C object 'lib/76b5a35@@rte_ipsec@sta/librte_ipsec_esp_outb.c.o'.
[438/2571] Generating symbol file 'lib/76b5a35@@rte_sched@sha/librte_sched.so.20.0.3.symbols'.
[439/2571] Compiling C object 'lib/76b5a35@@rte_ipsec@sta/librte_ipsec_ipsec_sad.c.o'.
[440/2571] Compiling C object 'lib/76b5a35@@rte_ipsec@sta/librte_ipsec_esp_inb.c.o'.
[441/2571] Compiling C object 'lib/76b5a35@@rte_fib@sta/librte_fib_dir24_8.c.o'.
[442/2571] Compiling C object 'lib/76b5a35@@rte_vhost@sta/librte_vhost_vhost_crypto.c.o'.
[443/2571] Compiling C object 'lib/76b5a35@@rte_vhost@sta/librte_vhost_virtio_net.c.o'.
ninja: build stopped: subcommand failed




*Build Failed #12:
OS: UB2004-32
Target: i686-gcc-static
FAILED: lib/76b5a35@@rte_vhost@sta/librte_vhost_vhost_user.c.o 
gcc -Ilib/76b5a35@@rte_vhost@sta -Ilib -I../lib -Ilib/librte_vhost -I../lib/librte_vhost -I. -I../ -Iconfig -I../config -Ilib/librte_eal/include -I../lib/librte_eal/include -Ilib/librte_eal/linux/include -I../lib/librte_eal/linux/include -Ilib/librte_eal/x86/include -I../lib/librte_eal/x86/include -Ilib/librte_eal/common -I../lib/librte_eal/common -Ilib/librte_eal -I../lib/librte_eal -Ilib/librte_kvargs -I../lib/librte_kvargs -Ilib/librte_telemetry/../librte_metrics -I../lib/librte_telemetry/../librte_metrics -Ilib/librte_telemetry -I../lib/librte_telemetry -Ilib/librte_ethdev -I../lib/librte_ethdev -Ilib/librte_net -I../lib/librte_net -Ilib/librte_mbuf -I../lib/librte_mbuf -Ilib/librte_mempool -I../lib/librte_mempool -Ilib/librte_ring -I../lib/librte_ring -Ilib/librte_meter -I../lib/librte_meter -Ilib/librte_cryptodev -I../lib/librte_cryptodev -Ilib/librte_hash -I../lib/librte_hash -Ilib/librte_pci -I../lib/librte_pci -fdiagnostics-color=always -pipe -D_FILE_OFFSET_BITS=64 -Wall -Winvalid-pch -Werror -O3 -include rte_config.h -Wextra -Wcast-qual -Wdeprecated -Wformat-nonliteral -Wformat-security -Wmissing-declarations -Wmissing-prototypes -Wnested-externs -Wold-style-definition -Wpointer-arith -Wsign-compare -Wstrict-prototypes -Wundef -Wwrite-strings -Wno-address-of-packed-member -Wno-packed-not-aligned -Wno-missing-field-initializers -Wno-pointer-to-int-cast -D_GNU_SOURCE -m32 -fPIC -march=native -DALLOW_EXPERIMENTAL_API -DALLOW_INTERNAL_API -Wno-format-truncation -DVHOST_GCC_UNROLL_PRAGMA -fno-strict-aliasing -MD -MQ 'lib/76b5a35@@rte_vhost@sta/librte_vhost_vhost_user.c.o' -MF 'lib/76b5a35@@rte_vhost@sta/librte_vhost_vhost_user.c.o.d' -o 'lib/76b5a35@@rte_vhost@sta/librte_vhost_vhost_user.c.o' -c ../lib/librte_vhost/vhost_user.c
../lib/librte_vhost/vhost_user.c: In function ‘free_mem_region’:
../lib/librte_vhost/vhost_user.c:142:26: error: unused variable ‘vq’ [-Werror=unused-variable]
  142 |  struct vhost_virtqueue *vq;
      |                          ^~
cc1: all warnings being treated as errors
[432/2332] Generating rte_fib_mingw with a custom command.
[433/2332] Generating symbol file 'lib/76b5a35@@rte_sched@sha/librte_sched.so.20.0.3.symbols'.
[434/2332] Compiling C object 'lib/76b5a35@@rte_ipsec@sta/librte_ipsec_ipsec_sad.c.o'.
[435/2332] Compiling C object 'lib/76b5a35@@rte_ipsec@sta/librte_ipsec_esp_outb.c.o'.
[436/2332] Compiling C object 'lib/76b5a35@@rte_fib@sta/librte_fib_dir24_8.c.o'.
[437/2332] Compiling C object 'lib/76b5a35@@rte_ipsec@sta/librte_ipsec_esp_inb.c.o'.
[438/2332] Compiling C object 'lib/76b5a35@@rte_fib@sta/librte_fib_trie.c.o'.
[439/2332] Compiling C object 'lib/76b5a35@@rte_vhost@sta/librte_vhost_vhost_crypto.c.o'.
[440/2332] Compiling C object 'lib/76b5a35@@rte_vhost@sta/librte_vhost_virtio_net.c.o'.
ninja: build stopped: subcommand failed




*Build Failed #13:
OS: UB2004-64
Target: x86_64-clang-static
FAILED: lib/76b5a35@@rte_vhost@sta/librte_vhost_vhost_user.c.o 
clang -Ilib/76b5a35@@rte_vhost@sta -Ilib -I../lib -Ilib/librte_vhost -I../lib/librte_vhost -I. -I../ -Iconfig -I../config -Ilib/librte_eal/include -I../lib/librte_eal/include -Ilib/librte_eal/linux/include -I../lib/librte_eal/linux/include -Ilib/librte_eal/x86/include -I../lib/librte_eal/x86/include -Ilib/librte_eal/common -I../lib/librte_eal/common -Ilib/librte_eal -I../lib/librte_eal -Ilib/librte_kvargs -I../lib/librte_kvargs -Ilib/librte_telemetry/../librte_metrics -I../lib/librte_telemetry/../librte_metrics -Ilib/librte_telemetry -I../lib/librte_telemetry -Ilib/librte_ethdev -I../lib/librte_ethdev -Ilib/librte_net -I../lib/librte_net -Ilib/librte_mbuf -I../lib/librte_mbuf -Ilib/librte_mempool -I../lib/librte_mempool -Ilib/librte_ring -I../lib/librte_ring -Ilib/librte_meter -I../lib/librte_meter -Ilib/librte_cryptodev -I../lib/librte_cryptodev -Ilib/librte_hash -I../lib/librte_hash -Ilib/librte_pci -I../lib/librte_pci -Xclang -fcolor-diagnostics -pipe -D_FILE_OFFSET_BITS=64 -Wall -Winvalid-pch -Werror -O3 -include rte_config.h -Wextra -Wcast-qual -Wdeprecated -Wformat-nonliteral -Wformat-security -Wmissing-declarations -Wmissing-prototypes -Wnested-externs -Wold-style-definition -Wpointer-arith -Wsign-compare -Wstrict-prototypes -Wundef -Wwrite-strings -Wno-address-of-packed-member -Wno-missing-field-initializers -D_GNU_SOURCE -fPIC -march=native -DALLOW_EXPERIMENTAL_API -DALLOW_INTERNAL_API -DVHOST_CLANG_UNROLL_PRAGMA -fno-strict-aliasing -MD -MQ 'lib/76b5a35@@rte_vhost@sta/librte_vhost_vhost_user.c.o' -MF 'lib/76b5a35@@rte_vhost@sta/librte_vhost_vhost_user.c.o.d' -o 'lib/76b5a35@@rte_vhost@sta/librte_vhost_vhost_user.c.o' -c ../lib/librte_vhost/vhost_user.c
../lib/librte_vhost/vhost_user.c:142:26: error: unused variable 'vq' [-Werror,-Wunused-variable]
        struct vhost_virtqueue *vq;
                                ^
1 error generated.
[426/2573] Linking target lib/librte_sched.so.20.0.3.
[427/2573] Generating symbol file 'lib/76b5a35@@rte_rib@sha/librte_rib.so.20.0.3.symbols'.
[428/2573] Generating symbol file 'lib/76b5a35@@rte_security@sha/librte_security.so.20.0.3.symbols'.
[429/2573] Compiling C object 'lib/76b5a35@@rte_ipsec@sta/librte_ipsec_ses.c.o'.
[430/2573] Compiling C object 'lib/76b5a35@@rte_vhost@sta/librte_vhost_vhost.c.o'.
[431/2573] Compiling C object 'lib/76b5a35@@rte_ipsec@sta/librte_ipsec_esp_inb.c.o'.
[432/2573] Compiling C object 'lib/76b5a35@@rte_ipsec@sta/librte_ipsec_esp_outb.c.o'.
[433/2573] Compiling C object 'lib/76b5a35@@rte_vhost@sta/librte_vhost_vhost_crypto.c.o'.
[434/2573] Compiling C object 'lib/76b5a35@@rte_vhost@sta/librte_vhost_virtio_net.c.o'.
ninja: build stopped: subcommand failed




*Build Failed #14:
OS: UB2004-64
Target: x86_64-gcc-static
FAILED: lib/76b5a35@@rte_vhost@sta/librte_vhost_vhost_user.c.o 
gcc -Ilib/76b5a35@@rte_vhost@sta -Ilib -I../lib -Ilib/librte_vhost -I../lib/librte_vhost -I. -I../ -Iconfig -I../config -Ilib/librte_eal/include -I../lib/librte_eal/include -Ilib/librte_eal/linux/include -I../lib/librte_eal/linux/include -Ilib/librte_eal/x86/include -I../lib/librte_eal/x86/include -Ilib/librte_eal/common -I../lib/librte_eal/common -Ilib/librte_eal -I../lib/librte_eal -Ilib/librte_kvargs -I../lib/librte_kvargs -Ilib/librte_telemetry/../librte_metrics -I../lib/librte_telemetry/../librte_metrics -Ilib/librte_telemetry -I../lib/librte_telemetry -Ilib/librte_ethdev -I../lib/librte_ethdev -Ilib/librte_net -I../lib/librte_net -Ilib/librte_mbuf -I../lib/librte_mbuf -Ilib/librte_mempool -I../lib/librte_mempool -Ilib/librte_ring -I../lib/librte_ring -Ilib/librte_meter -I../lib/librte_meter -Ilib/librte_cryptodev -I../lib/librte_cryptodev -Ilib/librte_hash -I../lib/librte_hash -Ilib/librte_pci -I../lib/librte_pci -fdiagnostics-color=always -pipe -D_FILE_OFFSET_BITS=64 -Wall -Winvalid-pch -Werror -O3 -include rte_config.h -Wextra -Wcast-qual -Wdeprecated -Wformat-nonliteral -Wformat-security -Wmissing-declarations -Wmissing-prototypes -Wnested-externs -Wold-style-definition -Wpointer-arith -Wsign-compare -Wstrict-prototypes -Wundef -Wwrite-strings -Wno-address-of-packed-member -Wno-packed-not-aligned -Wno-missing-field-initializers -Wno-zero-length-bounds -D_GNU_SOURCE -fPIC -march=native -DALLOW_EXPERIMENTAL_API -DALLOW_INTERNAL_API -Wno-format-truncation -DVHOST_GCC_UNROLL_PRAGMA -fno-strict-aliasing -MD -MQ 'lib/76b5a35@@rte_vhost@sta/librte_vhost_vhost_user.c.o' -MF 'lib/76b5a35@@rte_vhost@sta/librte_vhost_vhost_user.c.o.d' -o 'lib/76b5a35@@rte_vhost@sta/librte_vhost_vhost_user.c.o' -c ../lib/librte_vhost/vhost_user.c
../lib/librte_vhost/vhost_user.c: In function ‘free_mem_region’:
../lib/librte_vhost/vhost_user.c:142:26: error: unused variable ‘vq’ [-Werror=unused-variable]
  142 |  struct vhost_virtqueue *vq;
      |                          ^~
cc1: all warnings being treated as errors
[440/2573] Compiling C object 'lib/76b5a35@@rte_ipsec@sta/librte_ipsec_ipsec_sad.c.o'.
[441/2573] Compiling C object 'lib/76b5a35@@rte_ipsec@sta/librte_ipsec_esp_inb.c.o'.
[442/2573] Compiling C object 'lib/76b5a35@@rte_ipsec@sta/librte_ipsec_esp_outb.c.o'.
[443/2573] Compiling C object 'lib/76b5a35@@rte_fib@sta/librte_fib_dir24_8.c.o'.
[444/2573] Compiling C object 'lib/76b5a35@@rte_vhost@sta/librte_vhost_vhost_crypto.c.o'.
[445/2573] Compiling C object 'lib/76b5a35@@rte_fib@sta/librte_fib_trie.c.o'.
[446/2573] Compiling C object 'lib/76b5a35@@rte_port@sta/librte_port_rte_port_fd.c.o'.
[447/2573] Compiling C object 'lib/76b5a35@@rte_port@sta/librte_port_rte_port_ethdev.c.o'.
[448/2573] Compiling C object 'lib/76b5a35@@rte_vhost@sta/librte_vhost_virtio_net.c.o'.
ninja: build stopped: subcommand failed




*Build Failed #15:
OS: UB2004-64
Target: x86_64-gcc-doc
FAILED: lib/76b5a35@@rte_vhost@sta/librte_vhost_vhost_user.c.o 
gcc -Ilib/76b5a35@@rte_vhost@sta -Ilib -I../lib -Ilib/librte_vhost -I../lib/librte_vhost -I. -I../ -Iconfig -I../config -Ilib/librte_eal/include -I../lib/librte_eal/include -Ilib/librte_eal/linux/include -I../lib/librte_eal/linux/include -Ilib/librte_eal/x86/include -I../lib/librte_eal/x86/include -Ilib/librte_eal/common -I../lib/librte_eal/common -Ilib/librte_eal -I../lib/librte_eal -Ilib/librte_kvargs -I../lib/librte_kvargs -Ilib/librte_telemetry/../librte_metrics -I../lib/librte_telemetry/../librte_metrics -Ilib/librte_telemetry -I../lib/librte_telemetry -Ilib/librte_ethdev -I../lib/librte_ethdev -Ilib/librte_net -I../lib/librte_net -Ilib/librte_mbuf -I../lib/librte_mbuf -Ilib/librte_mempool -I../lib/librte_mempool -Ilib/librte_ring -I../lib/librte_ring -Ilib/librte_meter -I../lib/librte_meter -Ilib/librte_cryptodev -I../lib/librte_cryptodev -Ilib/librte_hash -I../lib/librte_hash -Ilib/librte_pci -I../lib/librte_pci -fdiagnostics-color=always -pipe -D_FILE_OFFSET_BITS=64 -Wall -Winvalid-pch -Werror -O3 -include rte_config.h -Wextra -Wcast-qual -Wdeprecated -Wformat-nonliteral -Wformat-security -Wmissing-declarations -Wmissing-prototypes -Wnested-externs -Wold-style-definition -Wpointer-arith -Wsign-compare -Wstrict-prototypes -Wundef -Wwrite-strings -Wno-address-of-packed-member -Wno-packed-not-aligned -Wno-missing-field-initializers -D_GNU_SOURCE -fPIC -march=native -DALLOW_EXPERIMENTAL_API -DALLOW_INTERNAL_API -Wno-format-truncation -DVHOST_GCC_UNROLL_PRAGMA -fno-strict-aliasing -MD -MQ 'lib/76b5a35@@rte_vhost@sta/librte_vhost_vhost_user.c.o' -MF 'lib/76b5a35@@rte_vhost@sta/librte_vhost_vhost_user.c.o.d' -o 'lib/76b5a35@@rte_vhost@sta/librte_vhost_vhost_user.c.o' -c ../lib/librte_vhost/vhost_user.c
../lib/librte_vhost/vhost_user.c: In function ‘free_mem_region’:
../lib/librte_vhost/vhost_user.c:142:26: error: unused variable ‘vq’ [-Werror=unused-variable]
  142 |  struct vhost_virtqueue *vq;
      |                          ^~
cc1: all warnings being treated as errors
[433/2432] Compiling C object 'lib/76b5a35@@rte_ipsec@sta/librte_ipsec_sa.c.o'.
[434/2432] Generating symbol file 'lib/76b5a35@@rte_sched@sha/librte_sched.so.20.0.3.symbols'.
[435/2432] Compiling C object 'lib/76b5a35@@rte_ipsec@sta/librte_ipsec_ipsec_sad.c.o'.
[436/2432] Compiling C object 'lib/76b5a35@@rte_ipsec@sta/librte_ipsec_esp_outb.c.o'.
[437/2432] Compiling C object 'lib/76b5a35@@rte_vhost@sta/librte_vhost_vhost_crypto.c.o'.
[438/2432] Compiling C object 'lib/76b5a35@@rte_ipsec@sta/librte_ipsec_esp_inb.c.o'.
[439/2432] Compiling C object 'lib/76b5a35@@rte_fib@sta/librte_fib_dir24_8.c.o'.
[440/2432] Compiling C object 'lib/76b5a35@@rte_fib@sta/librte_fib_trie.c.o'.
[441/2432] Compiling C object 'lib/76b5a35@@rte_vhost@sta/librte_vhost_virtio_net.c.o'.
ninja: build stopped: subcommand failed


DPDK STV team

^ permalink raw reply	[flat|nested] only message in thread

only message in thread, back to index

Thread overview: (only message) (download: mbox.gz / follow: Atom feed)
-- links below jump to the message on this page --
2020-09-16  2:18 [dpdk-test-report] |FAILURE| pw(77740) [4/4] vhost: remove dequeue zero-copy support sys_stv

automatic DPDK test reports

Archives are clonable:
	git clone --mirror http://inbox.dpdk.org/test-report/0 test-report/git/0.git

	# If you have public-inbox 1.1+ installed, you may
	# initialize and index your mirror using the following commands:
	public-inbox-init -V2 test-report test-report/ http://inbox.dpdk.org/test-report \
		test-report@dpdk.org
	public-inbox-index test-report


Newsgroup available over NNTP:
	nntp://inbox.dpdk.org/inbox.dpdk.test-report


AGPL code for this site: git clone https://public-inbox.org/ public-inbox