automatic DPDK test reports
 help / color / Atom feed
* [dpdk-test-report] |FAILURE| pw(77863) [v4] net/virtio: fix wrong variable assignment in helper macro
@ 2020-09-16  7:38 sys_stv
  0 siblings, 0 replies; only message in thread
From: sys_stv @ 2020-09-16  7:38 UTC (permalink / raw)
  To: test-report

[-- Attachment #1: Type: text/plain, Size: 202073 bytes --]


Test-Label: Intel-compilation
Test-Status: FAILURE
http://dpdk.org/patch/77863

_Compilation issues_

Submitter: Vipul Ashri <vipul.ashri@oracle.com>
Date: 2020-09-16 05:57:24
Reply_mail: 20200916055725.1473-1-vipul.ashri@oracle.com

DPDK git baseline: Repo:dpdk-next-virtio, CommitID: 89f6a4be217f22f7592b616d5d69c775530dce88


Build Summary: 22 Builds Done, 1 Successful, 21 Failures, 0 Blocked

+----------------+------------+--------------+------------+------------+-----------+----------+
| os             | gcc-static | clang-static | icc-static | gcc-shared | gcc-debug | document |
+----------------+------------+--------------+------------+------------+-----------+----------+
| CENTOS82-64    | FAIL       | FAIL         | FAIL       | FAIL       | FAIL      |          |
| RHEL82-64      | FAIL       |              |            |            |           |          |
| UB1804-64      | FAIL       |              |            |            |           |          |
| FC32-64        | FAIL       | FAIL         |            |            |           |          |
| CENTOS77-64    | FAIL       |              |            |            |           |          |
| UB2004-64      | FAIL       | FAIL         | FAIL       |            |           | FAIL     |
| WIN10-64       |            | pass         |            |            |           |          |
| UB2004-32      | FAIL       |              |            |            |           |          |
| FreeBSD1201-64 | FAIL       | FAIL         |            | FAIL       | FAIL      |          |
| SUSE15-64      | FAIL       | FAIL         |            |            |           |          |
+----------------+------------+--------------+------------+------------+-----------+----------+
Test environment and configuration as below:
** Meson build **



OS: CENTOS82-64
	Kernel Version: 4.18.0-193.el8.x86_64
	CPU info: Intel(R) Xeon(R) Platinum 8280M CPU @ 2.70GHz
	GCC Version: gcc (GCC) 8.3.1 20191121 (Red Hat 8.3.1-5)
	Clang Version: 9.0.1 (Red Hat 9.0.1-2.module_el8.2.0+309+0c7b6b03)
	x86_64-gcc-static
	x86_64-clang-static
	x86_64-icc-static
	x86_64-gcc-shared
	x86_64-gcc-debug


OS: RHEL82-64
	Kernel Version: 4.18.0-193.el8.x86_64
	CPU info: Intel(R) Xeon(R) Platinum 8280M CPU @ 2.70GHz
	GCC Version: gcc (GCC) 8.3.1 20191121 (Red Hat 8.3.1-5)
	Clang Version: 8.0.1 (Red Hat 8.0.1-1.module_el8.1.0+215+a01033fb)
	x86_64-gcc-static


OS: UB1804-64
	Kernel Version: 5.3.0-59-generic
	CPU info: Intel(R) Xeon(R) Platinum 8180 CPU @ 2.50GHz
	GCC Version: gcc (Ubuntu 8.4.0-1ubuntu1~18.04) 8.4.0
	Clang Version: 6.0.0-1ubuntu2 (tags/RELEASE_600/final)
	x86_64-gcc-static


OS: FC32-64
	Kernel Version: 5.6.0-0.rc7.git0.2.fc32.x86_64
	CPU info: Intel(R) Xeon(R) Platinum 8280M CPU @ 2.70GHz
	GCC Version: gcc (GCC) 10.0.1 20200311 (Red Hat 10.0.1-0.9)
	Clang Version: 10.0.0 (Fedora 10.0.0-0.3.rc4.fc32)
	x86_64-gcc-static
	x86_64-clang-static


OS: CENTOS77-64
	Kernel Version: 3.10.0-1062.9.1.el7.x86_64
	CPU info: Intel(R) Xeon(R) Platinum 8280M CPU @ 2.70GHz
	GCC Version: gcc (GCC) 4.8.5 20150623 (Red Hat 4.8.5-39)
	Clang Version: 3.4.2 (tags/RELEASE_34/dot2-final)
	x86_64-gcc-static


OS: UB2004-64
	Kernel Version: 5.4.0-26-generic
	CPU info: Intel(R) Xeon(R) Platinum 8180 CPU @ 2.50GHz
	GCC Version: gcc (Ubuntu 10-20200416-0ubuntu1) 10.0.1 20200416 (experimental) [master revision 3c3f12e2a76:dcee354ce56:44b326839d864fc10c459916abcc97f35a9ac3de]
	Clang Version: 10.0.0-4ubuntu1
	x86_64-clang-static
	x86_64-gcc-static
	x86_64-icc-static
	x86_64-gcc-doc


OS: WIN10-64
	Kernel Version: N/A
	CPU info: N/A
	GCC Version: N/A
	Clang Version: Clang 8.0.0
	x86_64-windows-clang


OS: UB2004-32
	Kernel Version: 5.4.0-26-generic
	CPU info: Intel(R) Xeon(R) Platinum 8180 CPU @ 2.50GHz
	GCC Version: gcc (Ubuntu 9.3.0-10ubuntu2) 9.3.0
	Clang Version: 10.0.0-4ubuntu1
	i686-gcc-static


OS: FreeBSD1201-64
	Kernel Version: 12.1-RELEASE
	CPU info: Intel(R) Xeon(R) CPU E5-2699 v3 @ 2.30GHz (2294.74-MHz K8-class CPU)
	GCC Version: gcc (FreeBSD Ports Collection) 9.2.0
	Clang Version: 8.0.1 (tags/RELEASE_801/final 366581) (based on LLVM 8.0.1)
	x86_64-gcc-static
	x86_64-clang-static
	x86_64-gcc-shared
	x86_64-gcc-debug


OS: SUSE15-64
	Kernel Version: 4.12.14-lp150.11-default
	CPU info: Intel(R) Xeon(R) CPU E5-2699 v4 @ 2.20GHz
	GCC Version: gcc (SUSE Linux) 7.3.1 20180323 [gcc-7-branch revision 258812]
	Clang Version: 5.0.1 (tags/RELEASE_501/final 312548)
	x86_64-clang-static
	x86_64-gcc-static



*Build Failed #1:
OS: CENTOS77-64
Target: x86_64-gcc-static
FAILED: drivers/a715181@@tmp_rte_pmd_virtio@sta/net_virtio_virtio_pci.c.o 
gcc -Idrivers/a715181@@tmp_rte_pmd_virtio@sta -Idrivers -I../drivers -Idrivers/net/virtio -I../drivers/net/virtio -Ilib/librte_ethdev -I../lib/librte_ethdev -I. -I../ -Iconfig -I../config -Ilib/librte_eal/include -I../lib/librte_eal/include -Ilib/librte_eal/linux/include -I../lib/librte_eal/linux/include -Ilib/librte_eal/x86/include -I../lib/librte_eal/x86/include -Ilib/librte_eal/common -I../lib/librte_eal/common -Ilib/librte_eal -I../lib/librte_eal -Ilib/librte_kvargs -I../lib/librte_kvargs -Ilib/librte_telemetry/../librte_metrics -I../lib/librte_telemetry/../librte_metrics -Ilib/librte_telemetry -I../lib/librte_telemetry -Ilib/librte_net -I../lib/librte_net -Ilib/librte_mbuf -I../lib/librte_mbuf -Ilib/librte_mempool -I../lib/librte_mempool -Ilib/librte_ring -I../lib/librte_ring -Ilib/librte_meter -I../lib/librte_meter -Idrivers/bus/pci -I../drivers/bus/pci -I../drivers/bus/pci/linux -Ilib/librte_pci -I../lib/librte_pci -Idrivers/bus/vdev -I../drivers/bus/vdev -pipe -D_FILE_OFFSET_BITS=64 -Wall -Winvalid-pch -Werror -O3 -include rte_config.h -Wextra -Wcast-qual -Wdeprecated -Wformat-nonliteral -Wformat-security -Wmissing-declarations -Wmissing-prototypes -Wnested-externs -Wold-style-definition -Wpointer-arith -Wsign-compare -Wstrict-prototypes -Wundef -Wwrite-strings -Wno-missing-field-initializers -D_GNU_SOURCE -fPIC -march=native -DALLOW_EXPERIMENTAL_API -DALLOW_INTERNAL_API -MD -MQ 'drivers/a715181@@tmp_rte_pmd_virtio@sta/net_virtio_virtio_pci.c.o' -MF 'drivers/a715181@@tmp_rte_pmd_virtio@sta/net_virtio_virtio_pci.c.o.d' -o 'drivers/a715181@@tmp_rte_pmd_virtio@sta/net_virtio_virtio_pci.c.o' -c ../drivers/net/virtio/virtio_pci.c
In file included from ../drivers/net/virtio/virtio_pci.c:16:0:
../drivers/net/virtio/virtqueue.h:615:1: error: expected identifier or ‘(’ before ‘}’ token
 } while (0)
 ^
../drivers/net/virtio/virtqueue.h:615:3: error: expected identifier or ‘(’ before ‘while’
 } while (0)
   ^
[1614/2549] Compiling C object 'drivers/a715181@@tmp_rte_pmd_virtio@sta/net_virtio_virtio_ethdev.c.o'.
FAILED: drivers/a715181@@tmp_rte_pmd_virtio@sta/net_virtio_virtio_ethdev.c.o 
gcc -Idrivers/a715181@@tmp_rte_pmd_virtio@sta -Idrivers -I../drivers -Idrivers/net/virtio -I../drivers/net/virtio -Ilib/librte_ethdev -I../lib/librte_ethdev -I. -I../ -Iconfig -I../config -Ilib/librte_eal/include -I../lib/librte_eal/include -Ilib/librte_eal/linux/include -I../lib/librte_eal/linux/include -Ilib/librte_eal/x86/include -I../lib/librte_eal/x86/include -Ilib/librte_eal/common -I../lib/librte_eal/common -Ilib/librte_eal -I../lib/librte_eal -Ilib/librte_kvargs -I../lib/librte_kvargs -Ilib/librte_telemetry/../librte_metrics -I../lib/librte_telemetry/../librte_metrics -Ilib/librte_telemetry -I../lib/librte_telemetry -Ilib/librte_net -I../lib/librte_net -Ilib/librte_mbuf -I../lib/librte_mbuf -Ilib/librte_mempool -I../lib/librte_mempool -Ilib/librte_ring -I../lib/librte_ring -Ilib/librte_meter -I../lib/librte_meter -Idrivers/bus/pci -I../drivers/bus/pci -I../drivers/bus/pci/linux -Ilib/librte_pci -I../lib/librte_pci -Idrivers/bus/vdev -I../drivers/bus/vdev -pipe -D_FILE_OFFSET_BITS=64 -Wall -Winvalid-pch -Werror -O3 -include rte_config.h -Wextra -Wcast-qual -Wdeprecated -Wformat-nonliteral -Wformat-security -Wmissing-declarations -Wmissing-prototypes -Wnested-externs -Wold-style-definition -Wpointer-arith -Wsign-compare -Wstrict-prototypes -Wundef -Wwrite-strings -Wno-missing-field-initializers -D_GNU_SOURCE -fPIC -march=native -DALLOW_EXPERIMENTAL_API -DALLOW_INTERNAL_API -MD -MQ 'drivers/a715181@@tmp_rte_pmd_virtio@sta/net_virtio_virtio_ethdev.c.o' -MF 'drivers/a715181@@tmp_rte_pmd_virtio@sta/net_virtio_virtio_ethdev.c.o.d' -o 'drivers/a715181@@tmp_rte_pmd_virtio@sta/net_virtio_virtio_ethdev.c.o' -c ../drivers/net/virtio/virtio_ethdev.c
In file included from ../drivers/net/virtio/virtio_ethdev.c:36:0:
../drivers/net/virtio/virtqueue.h:615:1: error: expected identifier or ‘(’ before ‘}’ token
 } while (0)
 ^
../drivers/net/virtio/virtqueue.h:615:3: error: expected identifier or ‘(’ before ‘while’
 } while (0)
   ^
[1615/2549] Compiling C object 'drivers/a715181@@tmp_rte_pmd_vdev_netvsc@sta/net_vdev_netvsc_vdev_netvsc.c.o'.
[1616/2549] Compiling C object 'drivers/a715181@@tmp_rte_pmd_virtio@sta/net_virtio_virtio_user_vhost_kernel_tap.c.o'.
[1617/2549] Generating rte_pmd_octeontx2.pmd.c with a custom command.
[1618/2549] Generating rte_pmd_sfc.sym_chk with a meson_exe.py custom command.
[1619/2549] Compiling C object 'drivers/a715181@@tmp_rte_pmd_softnic@sta/net_softnic_rte_eth_softnic_cli.c.o'.
[1620/2549] Compiling C object 'drivers/a715181@@tmp_rte_pmd_tap@sta/net_tap_rte_eth_tap.c.o'.
[1621/2549] Compiling C object 'drivers/a715181@@tmp_rte_pmd_vhost@sta/net_vhost_rte_eth_vhost.c.o'.
[1622/2549] Compiling C object 'drivers/a715181@@tmp_rte_pmd_thunderx@sta/net_thunderx_nicvf_ethdev.c.o'.
ninja: build stopped: subcommand failed




*Build Failed #2:
OS: CENTOS82-64
Target: x86_64-gcc-static
FAILED: drivers/a715181@@tmp_rte_pmd_virtio@sta/net_virtio_virtio_pci.c.o 
gcc -Idrivers/a715181@@tmp_rte_pmd_virtio@sta -Idrivers -I../drivers -Idrivers/net/virtio -I../drivers/net/virtio -Ilib/librte_ethdev -I../lib/librte_ethdev -I. -I../ -Iconfig -I../config -Ilib/librte_eal/include -I../lib/librte_eal/include -Ilib/librte_eal/linux/include -I../lib/librte_eal/linux/include -Ilib/librte_eal/x86/include -I../lib/librte_eal/x86/include -Ilib/librte_eal/common -I../lib/librte_eal/common -Ilib/librte_eal -I../lib/librte_eal -Ilib/librte_kvargs -I../lib/librte_kvargs -Ilib/librte_telemetry/../librte_metrics -I../lib/librte_telemetry/../librte_metrics -Ilib/librte_telemetry -I../lib/librte_telemetry -Ilib/librte_net -I../lib/librte_net -Ilib/librte_mbuf -I../lib/librte_mbuf -Ilib/librte_mempool -I../lib/librte_mempool -Ilib/librte_ring -I../lib/librte_ring -Ilib/librte_meter -I../lib/librte_meter -Idrivers/bus/pci -I../drivers/bus/pci -I../drivers/bus/pci/linux -Ilib/librte_pci -I../lib/librte_pci -Idrivers/bus/vdev -I../drivers/bus/vdev -fdiagnostics-color=always -pipe -D_FILE_OFFSET_BITS=64 -Wall -Winvalid-pch -Werror -O3 -include rte_config.h -Wextra -Wcast-qual -Wdeprecated -Wformat-nonliteral -Wformat-security -Wmissing-declarations -Wmissing-prototypes -Wnested-externs -Wold-style-definition -Wpointer-arith -Wsign-compare -Wstrict-prototypes -Wundef -Wwrite-strings -Wno-packed-not-aligned -Wno-missing-field-initializers -D_GNU_SOURCE -fPIC -march=native -mno-avx512f -DALLOW_EXPERIMENTAL_API -DALLOW_INTERNAL_API -Wno-format-truncation -MD -MQ 'drivers/a715181@@tmp_rte_pmd_virtio@sta/net_virtio_virtio_pci.c.o' -MF 'drivers/a715181@@tmp_rte_pmd_virtio@sta/net_virtio_virtio_pci.c.o.d' -o 'drivers/a715181@@tmp_rte_pmd_virtio@sta/net_virtio_virtio_pci.c.o' -c ../drivers/net/virtio/virtio_pci.c
In file included from ../drivers/net/virtio/virtio_pci.c:16:
../drivers/net/virtio/virtqueue.h:615:1: error: expected identifier or ‘(’ before ‘}’ token
 } while (0)
 ^
../drivers/net/virtio/virtqueue.h:615:3: error: expected identifier or ‘(’ before ‘while’
 } while (0)
   ^~~~~
[1619/2582] Compiling C object 'drivers/a715181@@tmp_rte_pmd_virtio@sta/net_virtio_virtio_ethdev.c.o'.
FAILED: drivers/a715181@@tmp_rte_pmd_virtio@sta/net_virtio_virtio_ethdev.c.o 
gcc -Idrivers/a715181@@tmp_rte_pmd_virtio@sta -Idrivers -I../drivers -Idrivers/net/virtio -I../drivers/net/virtio -Ilib/librte_ethdev -I../lib/librte_ethdev -I. -I../ -Iconfig -I../config -Ilib/librte_eal/include -I../lib/librte_eal/include -Ilib/librte_eal/linux/include -I../lib/librte_eal/linux/include -Ilib/librte_eal/x86/include -I../lib/librte_eal/x86/include -Ilib/librte_eal/common -I../lib/librte_eal/common -Ilib/librte_eal -I../lib/librte_eal -Ilib/librte_kvargs -I../lib/librte_kvargs -Ilib/librte_telemetry/../librte_metrics -I../lib/librte_telemetry/../librte_metrics -Ilib/librte_telemetry -I../lib/librte_telemetry -Ilib/librte_net -I../lib/librte_net -Ilib/librte_mbuf -I../lib/librte_mbuf -Ilib/librte_mempool -I../lib/librte_mempool -Ilib/librte_ring -I../lib/librte_ring -Ilib/librte_meter -I../lib/librte_meter -Idrivers/bus/pci -I../drivers/bus/pci -I../drivers/bus/pci/linux -Ilib/librte_pci -I../lib/librte_pci -Idrivers/bus/vdev -I../drivers/bus/vdev -fdiagnostics-color=always -pipe -D_FILE_OFFSET_BITS=64 -Wall -Winvalid-pch -Werror -O3 -include rte_config.h -Wextra -Wcast-qual -Wdeprecated -Wformat-nonliteral -Wformat-security -Wmissing-declarations -Wmissing-prototypes -Wnested-externs -Wold-style-definition -Wpointer-arith -Wsign-compare -Wstrict-prototypes -Wundef -Wwrite-strings -Wno-packed-not-aligned -Wno-missing-field-initializers -D_GNU_SOURCE -fPIC -march=native -mno-avx512f -DALLOW_EXPERIMENTAL_API -DALLOW_INTERNAL_API -Wno-format-truncation -MD -MQ 'drivers/a715181@@tmp_rte_pmd_virtio@sta/net_virtio_virtio_ethdev.c.o' -MF 'drivers/a715181@@tmp_rte_pmd_virtio@sta/net_virtio_virtio_ethdev.c.o.d' -o 'drivers/a715181@@tmp_rte_pmd_virtio@sta/net_virtio_virtio_ethdev.c.o' -c ../drivers/net/virtio/virtio_ethdev.c
In file included from ../drivers/net/virtio/virtio_ethdev.c:36:
../drivers/net/virtio/virtqueue.h:615:1: error: expected identifier or ‘(’ before ‘}’ token
 } while (0)
 ^
../drivers/net/virtio/virtqueue.h:615:3: error: expected identifier or ‘(’ before ‘while’
 } while (0)
   ^~~~~
[1620/2582] Generating rte_pmd_vdev_netvsc.pmd.c with a custom command.
[1621/2582] Generating rte_pmd_softnic.pmd.c with a custom command.
[1622/2582] Generating rte_pmd_sfc.sym_chk with a meson_exe.py custom command.
[1623/2582] Compiling C object 'drivers/a715181@@tmp_rte_pmd_virtio@sta/net_virtio_virtio_rxtx.c.o'.
FAILED: drivers/a715181@@tmp_rte_pmd_virtio@sta/net_virtio_virtio_rxtx.c.o 
gcc -Idrivers/a715181@@tmp_rte_pmd_virtio@sta -Idrivers -I../drivers -Idrivers/net/virtio -I../drivers/net/virtio -Ilib/librte_ethdev -I../lib/librte_ethdev -I. -I../ -Iconfig -I../config -Ilib/librte_eal/include -I../lib/librte_eal/include -Ilib/librte_eal/linux/include -I../lib/librte_eal/linux/include -Ilib/librte_eal/x86/include -I../lib/librte_eal/x86/include -Ilib/librte_eal/common -I../lib/librte_eal/common -Ilib/librte_eal -I../lib/librte_eal -Ilib/librte_kvargs -I../lib/librte_kvargs -Ilib/librte_telemetry/../librte_metrics -I../lib/librte_telemetry/../librte_metrics -Ilib/librte_telemetry -I../lib/librte_telemetry -Ilib/librte_net -I../lib/librte_net -Ilib/librte_mbuf -I../lib/librte_mbuf -Ilib/librte_mempool -I../lib/librte_mempool -Ilib/librte_ring -I../lib/librte_ring -Ilib/librte_meter -I../lib/librte_meter -Idrivers/bus/pci -I../drivers/bus/pci -I../drivers/bus/pci/linux -Ilib/librte_pci -I../lib/librte_pci -Idrivers/bus/vdev -I../drivers/bus/vdev -fdiagnostics-color=always -pipe -D_FILE_OFFSET_BITS=64 -Wall -Winvalid-pch -Werror -O3 -include rte_config.h -Wextra -Wcast-qual -Wdeprecated -Wformat-nonliteral -Wformat-security -Wmissing-declarations -Wmissing-prototypes -Wnested-externs -Wold-style-definition -Wpointer-arith -Wsign-compare -Wstrict-prototypes -Wundef -Wwrite-strings -Wno-packed-not-aligned -Wno-missing-field-initializers -D_GNU_SOURCE -fPIC -march=native -mno-avx512f -DALLOW_EXPERIMENTAL_API -DALLOW_INTERNAL_API -Wno-format-truncation -MD -MQ 'drivers/a715181@@tmp_rte_pmd_virtio@sta/net_virtio_virtio_rxtx.c.o' -MF 'drivers/a715181@@tmp_rte_pmd_virtio@sta/net_virtio_virtio_rxtx.c.o.d' -o 'drivers/a715181@@tmp_rte_pmd_virtio@sta/net_virtio_virtio_rxtx.c.o' -c ../drivers/net/virtio/virtio_rxtx.c
In file included from ../drivers/net/virtio/virtio_rxtx.c:31:
../drivers/net/virtio/virtqueue.h:615:1: error: expected identifier or ‘(’ before ‘}’ token
 } while (0)
 ^
../drivers/net/virtio/virtqueue.h:615:3: error: expected identifier or ‘(’ before ‘while’
 } while (0)
   ^~~~~
[1624/2582] Compiling C object 'drivers/a715181@@tmp_rte_pmd_virtio@sta/net_virtio_virtio_user_vhost_kernel_tap.c.o'.
[1625/2582] Compiling C object 'drivers/a715181@@tmp_rte_pmd_tap@sta/net_tap_rte_eth_tap.c.o'.
[1626/2582] Compiling C object 'drivers/a715181@@tmp_rte_pmd_thunderx@sta/net_thunderx_nicvf_ethdev.c.o'.
[1627/2582] Compiling C object 'drivers/a715181@@tmp_rte_pmd_vhost@sta/net_vhost_rte_eth_vhost.c.o'.
ninja: build stopped: subcommand failed




*Build Failed #3:
OS: CENTOS82-64
Target: x86_64-clang-static
FAILED: drivers/a715181@@tmp_rte_pmd_virtio@sta/net_virtio_virtio_ethdev.c.o 
clang -Idrivers/a715181@@tmp_rte_pmd_virtio@sta -Idrivers -I../drivers -Idrivers/net/virtio -I../drivers/net/virtio -Ilib/librte_ethdev -I../lib/librte_ethdev -I. -I../ -Iconfig -I../config -Ilib/librte_eal/include -I../lib/librte_eal/include -Ilib/librte_eal/linux/include -I../lib/librte_eal/linux/include -Ilib/librte_eal/x86/include -I../lib/librte_eal/x86/include -Ilib/librte_eal/common -I../lib/librte_eal/common -Ilib/librte_eal -I../lib/librte_eal -Ilib/librte_kvargs -I../lib/librte_kvargs -Ilib/librte_telemetry/../librte_metrics -I../lib/librte_telemetry/../librte_metrics -Ilib/librte_telemetry -I../lib/librte_telemetry -Ilib/librte_net -I../lib/librte_net -Ilib/librte_mbuf -I../lib/librte_mbuf -Ilib/librte_mempool -I../lib/librte_mempool -Ilib/librte_ring -I../lib/librte_ring -Ilib/librte_meter -I../lib/librte_meter -Idrivers/bus/pci -I../drivers/bus/pci -I../drivers/bus/pci/linux -Ilib/librte_pci -I../lib/librte_pci -Idrivers/bus/vdev -I../drivers/bus/vdev -Xclang -fcolor-diagnostics -pipe -D_FILE_OFFSET_BITS=64 -Wall -Winvalid-pch -Werror -O3 -include rte_config.h -Wextra -Wcast-qual -Wdeprecated -Wformat-nonliteral -Wformat-security -Wmissing-declarations -Wmissing-prototypes -Wnested-externs -Wold-style-definition -Wpointer-arith -Wsign-compare -Wstrict-prototypes -Wundef -Wwrite-strings -Wno-address-of-packed-member -Wno-missing-field-initializers -D_GNU_SOURCE -fPIC -march=native -mno-avx512f -DALLOW_EXPERIMENTAL_API -DALLOW_INTERNAL_API -MD -MQ 'drivers/a715181@@tmp_rte_pmd_virtio@sta/net_virtio_virtio_ethdev.c.o' -MF 'drivers/a715181@@tmp_rte_pmd_virtio@sta/net_virtio_virtio_ethdev.c.o.d' -o 'drivers/a715181@@tmp_rte_pmd_virtio@sta/net_virtio_virtio_ethdev.c.o' -c ../drivers/net/virtio/virtio_ethdev.c
In file included from ../drivers/net/virtio/virtio_ethdev.c:36:
../drivers/net/virtio/virtqueue.h:615:1: error: extraneous closing brace ('}')
} while (0)
^
../drivers/net/virtio/virtqueue.h:615:3: error: expected identifier or '('
} while (0)
  ^
2 errors generated.
[1627/2582] Generating rte_pmd_tap.pmd.c with a custom command.
[1628/2582] Generating rte_pmd_softnic.sym_chk with a meson_exe.py custom command.
[1629/2582] Compiling C object 'drivers/a715181@@tmp_rte_pmd_virtio@sta/net_virtio_virtio_pci.c.o'.
FAILED: drivers/a715181@@tmp_rte_pmd_virtio@sta/net_virtio_virtio_pci.c.o 
clang -Idrivers/a715181@@tmp_rte_pmd_virtio@sta -Idrivers -I../drivers -Idrivers/net/virtio -I../drivers/net/virtio -Ilib/librte_ethdev -I../lib/librte_ethdev -I. -I../ -Iconfig -I../config -Ilib/librte_eal/include -I../lib/librte_eal/include -Ilib/librte_eal/linux/include -I../lib/librte_eal/linux/include -Ilib/librte_eal/x86/include -I../lib/librte_eal/x86/include -Ilib/librte_eal/common -I../lib/librte_eal/common -Ilib/librte_eal -I../lib/librte_eal -Ilib/librte_kvargs -I../lib/librte_kvargs -Ilib/librte_telemetry/../librte_metrics -I../lib/librte_telemetry/../librte_metrics -Ilib/librte_telemetry -I../lib/librte_telemetry -Ilib/librte_net -I../lib/librte_net -Ilib/librte_mbuf -I../lib/librte_mbuf -Ilib/librte_mempool -I../lib/librte_mempool -Ilib/librte_ring -I../lib/librte_ring -Ilib/librte_meter -I../lib/librte_meter -Idrivers/bus/pci -I../drivers/bus/pci -I../drivers/bus/pci/linux -Ilib/librte_pci -I../lib/librte_pci -Idrivers/bus/vdev -I../drivers/bus/vdev -Xclang -fcolor-diagnostics -pipe -D_FILE_OFFSET_BITS=64 -Wall -Winvalid-pch -Werror -O3 -include rte_config.h -Wextra -Wcast-qual -Wdeprecated -Wformat-nonliteral -Wformat-security -Wmissing-declarations -Wmissing-prototypes -Wnested-externs -Wold-style-definition -Wpointer-arith -Wsign-compare -Wstrict-prototypes -Wundef -Wwrite-strings -Wno-address-of-packed-member -Wno-missing-field-initializers -D_GNU_SOURCE -fPIC -march=native -mno-avx512f -DALLOW_EXPERIMENTAL_API -DALLOW_INTERNAL_API -MD -MQ 'drivers/a715181@@tmp_rte_pmd_virtio@sta/net_virtio_virtio_pci.c.o' -MF 'drivers/a715181@@tmp_rte_pmd_virtio@sta/net_virtio_virtio_pci.c.o.d' -o 'drivers/a715181@@tmp_rte_pmd_virtio@sta/net_virtio_virtio_pci.c.o' -c ../drivers/net/virtio/virtio_pci.c
In file included from ../drivers/net/virtio/virtio_pci.c:16:
../drivers/net/virtio/virtqueue.h:615:1: error: extraneous closing brace ('}')
} while (0)
^
../drivers/net/virtio/virtqueue.h:615:3: error: expected identifier or '('
} while (0)
  ^
2 errors generated.
[1630/2582] Compiling C object 'drivers/a715181@@tmp_rte_pmd_virtio@sta/net_virtio_virtio_rxtx.c.o'.
FAILED: drivers/a715181@@tmp_rte_pmd_virtio@sta/net_virtio_virtio_rxtx.c.o 
clang -Idrivers/a715181@@tmp_rte_pmd_virtio@sta -Idrivers -I../drivers -Idrivers/net/virtio -I../drivers/net/virtio -Ilib/librte_ethdev -I../lib/librte_ethdev -I. -I../ -Iconfig -I../config -Ilib/librte_eal/include -I../lib/librte_eal/include -Ilib/librte_eal/linux/include -I../lib/librte_eal/linux/include -Ilib/librte_eal/x86/include -I../lib/librte_eal/x86/include -Ilib/librte_eal/common -I../lib/librte_eal/common -Ilib/librte_eal -I../lib/librte_eal -Ilib/librte_kvargs -I../lib/librte_kvargs -Ilib/librte_telemetry/../librte_metrics -I../lib/librte_telemetry/../librte_metrics -Ilib/librte_telemetry -I../lib/librte_telemetry -Ilib/librte_net -I../lib/librte_net -Ilib/librte_mbuf -I../lib/librte_mbuf -Ilib/librte_mempool -I../lib/librte_mempool -Ilib/librte_ring -I../lib/librte_ring -Ilib/librte_meter -I../lib/librte_meter -Idrivers/bus/pci -I../drivers/bus/pci -I../drivers/bus/pci/linux -Ilib/librte_pci -I../lib/librte_pci -Idrivers/bus/vdev -I../drivers/bus/vdev -Xclang -fcolor-diagnostics -pipe -D_FILE_OFFSET_BITS=64 -Wall -Winvalid-pch -Werror -O3 -include rte_config.h -Wextra -Wcast-qual -Wdeprecated -Wformat-nonliteral -Wformat-security -Wmissing-declarations -Wmissing-prototypes -Wnested-externs -Wold-style-definition -Wpointer-arith -Wsign-compare -Wstrict-prototypes -Wundef -Wwrite-strings -Wno-address-of-packed-member -Wno-missing-field-initializers -D_GNU_SOURCE -fPIC -march=native -mno-avx512f -DALLOW_EXPERIMENTAL_API -DALLOW_INTERNAL_API -MD -MQ 'drivers/a715181@@tmp_rte_pmd_virtio@sta/net_virtio_virtio_rxtx.c.o' -MF 'drivers/a715181@@tmp_rte_pmd_virtio@sta/net_virtio_virtio_rxtx.c.o.d' -o 'drivers/a715181@@tmp_rte_pmd_virtio@sta/net_virtio_virtio_rxtx.c.o' -c ../drivers/net/virtio/virtio_rxtx.c
In file included from ../drivers/net/virtio/virtio_rxtx.c:31:
../drivers/net/virtio/virtqueue.h:615:1: error: extraneous closing brace ('}')
} while (0)
^
../drivers/net/virtio/virtqueue.h:615:3: error: expected identifier or '('
} while (0)
  ^
2 errors generated.
[1631/2582] Compiling C object 'drivers/a715181@@tmp_rte_pmd_vhost@sta/net_vhost_rte_eth_vhost.c.o'.
[1632/2582] Compiling C object 'drivers/a715181@@tmp_rte_pmd_virtio@sta/net_virtio_virtio_user_vhost_kernel_tap.c.o'.
[1633/2582] Generating rte_pmd_vdev_netvsc.sym_chk with a meson_exe.py custom command.
[1634/2582] Compiling C object 'drivers/a715181@@tmp_rte_pmd_virtio@sta/net_virtio_virtio_rxtx_simple.c.o'.
FAILED: drivers/a715181@@tmp_rte_pmd_virtio@sta/net_virtio_virtio_rxtx_simple.c.o 
clang -Idrivers/a715181@@tmp_rte_pmd_virtio@sta -Idrivers -I../drivers -Idrivers/net/virtio -I../drivers/net/virtio -Ilib/librte_ethdev -I../lib/librte_ethdev -I. -I../ -Iconfig -I../config -Ilib/librte_eal/include -I../lib/librte_eal/include -Ilib/librte_eal/linux/include -I../lib/librte_eal/linux/include -Ilib/librte_eal/x86/include -I../lib/librte_eal/x86/include -Ilib/librte_eal/common -I../lib/librte_eal/common -Ilib/librte_eal -I../lib/librte_eal -Ilib/librte_kvargs -I../lib/librte_kvargs -Ilib/librte_telemetry/../librte_metrics -I../lib/librte_telemetry/../librte_metrics -Ilib/librte_telemetry -I../lib/librte_telemetry -Ilib/librte_net -I../lib/librte_net -Ilib/librte_mbuf -I../lib/librte_mbuf -Ilib/librte_mempool -I../lib/librte_mempool -Ilib/librte_ring -I../lib/librte_ring -Ilib/librte_meter -I../lib/librte_meter -Idrivers/bus/pci -I../drivers/bus/pci -I../drivers/bus/pci/linux -Ilib/librte_pci -I../lib/librte_pci -Idrivers/bus/vdev -I../drivers/bus/vdev -Xclang -fcolor-diagnostics -pipe -D_FILE_OFFSET_BITS=64 -Wall -Winvalid-pch -Werror -O3 -include rte_config.h -Wextra -Wcast-qual -Wdeprecated -Wformat-nonliteral -Wformat-security -Wmissing-declarations -Wmissing-prototypes -Wnested-externs -Wold-style-definition -Wpointer-arith -Wsign-compare -Wstrict-prototypes -Wundef -Wwrite-strings -Wno-address-of-packed-member -Wno-missing-field-initializers -D_GNU_SOURCE -fPIC -march=native -mno-avx512f -DALLOW_EXPERIMENTAL_API -DALLOW_INTERNAL_API -MD -MQ 'drivers/a715181@@tmp_rte_pmd_virtio@sta/net_virtio_virtio_rxtx_simple.c.o' -MF 'drivers/a715181@@tmp_rte_pmd_virtio@sta/net_virtio_virtio_rxtx_simple.c.o.d' -o 'drivers/a715181@@tmp_rte_pmd_virtio@sta/net_virtio_virtio_rxtx_simple.c.o' -c ../drivers/net/virtio/virtio_rxtx_simple.c
In file included from ../drivers/net/virtio/virtio_rxtx_simple.c:24:
In file included from ../drivers/net/virtio/virtio_rxtx_simple.h:12:
../drivers/net/virtio/virtqueue.h:615:1: error: extraneous closing brace ('}')
} while (0)
^
../drivers/net/virtio/virtqueue.h:615:3: error: expected identifier or '('
} while (0)
  ^
2 errors generated.
[1635/2582] Compiling C object 'drivers/a715181@@tmp_rte_pmd_thunderx@sta/net_thunderx_nicvf_ethdev.c.o'.
ninja: build stopped: subcommand failed




*Build Failed #4:
OS: CENTOS82-64
Target: x86_64-icc-static
FAILED: drivers/a715181@@tmp_rte_pmd_virtio@sta/net_virtio_virtio_ethdev.c.o 
icc -Idrivers/a715181@@tmp_rte_pmd_virtio@sta -Idrivers -I../drivers -Idrivers/net/virtio -I../drivers/net/virtio -Ilib/librte_ethdev -I../lib/librte_ethdev -I. -I../ -Iconfig -I../config -Ilib/librte_eal/include -I../lib/librte_eal/include -Ilib/librte_eal/linux/include -I../lib/librte_eal/linux/include -Ilib/librte_eal/x86/include -I../lib/librte_eal/x86/include -Ilib/librte_eal/common -I../lib/librte_eal/common -Ilib/librte_eal -I../lib/librte_eal -Ilib/librte_kvargs -I../lib/librte_kvargs -Ilib/librte_telemetry/../librte_metrics -I../lib/librte_telemetry/../librte_metrics -Ilib/librte_telemetry -I../lib/librte_telemetry -Ilib/librte_net -I../lib/librte_net -Ilib/librte_mbuf -I../lib/librte_mbuf -Ilib/librte_mempool -I../lib/librte_mempool -Ilib/librte_ring -I../lib/librte_ring -Ilib/librte_meter -I../lib/librte_meter -Idrivers/bus/pci -I../drivers/bus/pci -I../drivers/bus/pci/linux -Ilib/librte_pci -I../lib/librte_pci -Idrivers/bus/vdev -I../drivers/bus/vdev -pipe -D_FILE_OFFSET_BITS=64 -Wall -w3 -diag-disable:remark -Werror -O3 -include rte_config.h -Wextra -Wcast-qual -Wdeprecated -Wformat-security -Wmissing-declarations -Wmissing-prototypes -Wold-style-definition -Wpointer-arith -Wsign-compare -Wstrict-prototypes -Wundef -Wwrite-strings -Wno-missing-field-initializers -diag-disable=188 -diag-disable=2203 -diag-disable=2279 -diag-disable=2557 -diag-disable=3179 -diag-disable=3656 -D_GNU_SOURCE -fPIC -march=native -mno-avx512f -DALLOW_EXPERIMENTAL_API -DALLOW_INTERNAL_API -MD -MQ 'drivers/a715181@@tmp_rte_pmd_virtio@sta/net_virtio_virtio_ethdev.c.o' -MF 'drivers/a715181@@tmp_rte_pmd_virtio@sta/net_virtio_virtio_ethdev.c.o.d' -o 'drivers/a715181@@tmp_rte_pmd_virtio@sta/net_virtio_virtio_ethdev.c.o' -c ../drivers/net/virtio/virtio_ethdev.c
In file included from ../drivers/net/virtio/virtio_ethdev.c(36):
../drivers/net/virtio/virtqueue.h(615): error: expected a declaration
  } while (0)
  ^

In file included from ../drivers/net/virtio/virtio_ethdev.c(36):
../drivers/net/virtio/virtqueue.h(700): error #12: parsing restarts here after previous syntax error
  	head_dp = &vq->vq_packed.ring.desc[idx];
  	                                       ^

In file included from ../drivers/net/virtio/virtio_ethdev.c(36):
../drivers/net/virtio/virtqueue.h(701): error #77: this declaration has no storage class or type specifier
  	head_flags = cookie->next ? VRING_DESC_F_NEXT : 0;
  	^

In file included from ../drivers/net/virtio/virtio_ethdev.c(36):
../drivers/net/virtio/virtqueue.h(701): error: identifier "cookie" is undefined
  	head_flags = cookie->next ? VRING_DESC_F_NEXT : 0;
  	             ^

In file included from ../drivers/net/virtio/virtio_ethdev.c(36):
../drivers/net/virtio/virtqueue.h(702): error #77: this declaration has no storage class or type specifier
  	head_flags |= vq->vq_packed.cached_flags;
  	^

In file included from ../drivers/net/virtio/virtio_ethdev.c(36):
../drivers/net/virtio/virtqueue.h(702): error: expected a ";"
  	head_flags |= vq->vq_packed.cached_flags;
  	           ^

In file included from ../drivers/net/virtio/virtio_ethdev.c(36):
../drivers/net/virtio/virtqueue.h(704): error: expected a declaration
  	if (can_push) {
  	^

In file included from ../drivers/net/virtio/virtio_ethdev.c(36):
../drivers/net/virtio/virtqueue.h(725): error #12: parsing restarts here after previous syntax error
  				VRING_PACKED_DESC_F_AVAIL_USED;
  				                              ^

In file included from ../drivers/net/virtio/virtio_ethdev.c(36):
../drivers/net/virtio/virtqueue.h(726): error: expected a declaration
  		}
  		^

In file included from ../drivers/net/virtio/virtio_ethdev.c(36):
../drivers/net/virtio/virtqueue.h(729): error #12: parsing restarts here after previous syntax error
  	virtqueue_xmit_offload(hdr, cookie, vq->hw->has_tx_offload);
  	                                                           ^

In file included from ../drivers/net/virtio/virtio_ethdev.c(36):
../drivers/net/virtio/virtqueue.h(731): error: expected a declaration
  	do {
  	^

In file included from ../drivers/net/virtio/virtio_ethdev.c(36):
../drivers/net/virtio/virtqueue.h(752): error #12: parsing restarts here after previous syntax error
  				VRING_PACKED_DESC_F_AVAIL_USED;
  				                              ^

In file included from ../drivers/net/virtio/virtio_ethdev.c(36):
../drivers/net/virtio/virtqueue.h(753): error: expected a declaration
  		}
  		^

In file included from ../drivers/net/virtio/virtio_ethdev.c(36):
../drivers/net/virtio/virtqueue.h(756): error: identifier "prev" is undefined
  	start_dp[prev].id = id;
  	         ^

In file included from ../drivers/net/virtio/virtio_ethdev.c(36):
../drivers/net/virtio/virtqueue.h(756): error: expected a ";"
  	start_dp[prev].id = id;
  	              ^

In file included from ../drivers/net/virtio/virtio_ethdev.c(36):
../drivers/net/virtio/virtqueue.h(758): error #77: this declaration has no storage class or type specifier
  	vq->vq_free_cnt = (uint16_t)(vq->vq_free_cnt - needed);
  	^

In file included from ../drivers/net/virtio/virtio_ethdev.c(36):
../drivers/net/virtio/virtqueue.h(758): error: expected a ";"
  	vq->vq_free_cnt = (uint16_t)(vq->vq_free_cnt - needed);
  	  ^

In file included from ../drivers/net/virtio/virtio_ethdev.c(36):
../drivers/net/virtio/virtqueue.h(759): error #77: this declaration has no storage class or type specifier
  	vq->vq_avail_idx = idx;
  	^

In file included from ../drivers/net/virtio/virtio_ethdev.c(36):
../drivers/net/virtio/virtqueue.h(759): error: expected a ";"
  	vq->vq_avail_idx = idx;
  	  ^

In file included from ../drivers/net/virtio/virtio_ethdev.c(36):
../drivers/net/virtio/virtqueue.h(761): error: expected a declaration
  	if (!in_order) {
  	^

In file included from ../drivers/net/virtio/virtio_ethdev.c(36):
../drivers/net/virtio/virtqueue.h(768): error #12: parsing restarts here after previous syntax error
  				     vq->hw->weak_barriers);
  				                           ^

In file included from ../drivers/net/virtio/virtio_ethdev.c(36):
../drivers/net/virtio/virtqueue.h(769): error: expected a declaration
  }
  ^

In file included from ../drivers/net/virtio/virtio_ethdev.c(36):
../drivers/net/virtio/virtqueue.h(816): error #12: parsing restarts here after previous syntax error
  		} while (curr_id != id);
  		                       ^

In file included from ../drivers/net/virtio/virtio_ethdev.c(36):
../drivers/net/virtio/virtqueue.h(817): error: expected a declaration
  	}
  	^

In file included from ../drivers/net/virtio/virtio_ethdev.c(36):
../drivers/net/virtio/virtqueue.h(819): error #77: this declaration has no storage class or type specifier
  	vq->vq_free_cnt += free_cnt;
  	^

In file included from ../drivers/net/virtio/virtio_ethdev.c(36):
../drivers/net/virtio/virtqueue.h(819): error: expected a ";"
  	vq->vq_free_cnt += free_cnt;
  	  ^

In file included from ../drivers/net/virtio/virtio_ethdev.c(36):
../drivers/net/virtio/virtqueue.h(820): error: expected a declaration
  }
  ^

In file included from ../drivers/net/virtio/virtio_ethdev.c(36):
../drivers/net/virtio/virtqueue.h(845): error #12: parsing restarts here after previous syntax error
  			dxp->cookie = NULL;
  			                  ^

In file included from ../drivers/net/virtio/virtio_ethdev.c(36):
../drivers/net/virtio/virtqueue.h(846): error: expected a declaration
  		}
  		^

In file included from ../drivers/net/virtio/virtio_ethdev.c(36):
../drivers/net/virtio/virtqueue.h(848): error: expected a declaration
  	}
  	^

In file included from ../drivers/net/virtio/virtio_ethdev.c(38):
../drivers/net/virtio/virtio_user/virtio_user_dev.h(17): error #12: parsing restarts here after previous syntax error
  };
   ^

In file included from ../drivers/net/virtio/virtio_ethdev.c(38):
../drivers/net/virtio/virtio_user/virtio_user_dev.h(55): error: incomplete type is not allowed
  	struct virtio_user_queue packed_queues[VIRTIO_MAX_VIRTQUEUES];
  	                         ^

compilation aborted for ../drivers/net/virtio/virtio_ethdev.c (code 2)
[1612/2582] Compiling C object 'drivers/a715181@@tmp_rte_pmd_virtio@sta/net_virtio_virtio_pci.c.o'.
FAILED: drivers/a715181@@tmp_rte_pmd_virtio@sta/net_virtio_virtio_pci.c.o 
icc -Idrivers/a715181@@tmp_rte_pmd_virtio@sta -Idrivers -I../drivers -Idrivers/net/virtio -I../drivers/net/virtio -Ilib/librte_ethdev -I../lib/librte_ethdev -I. -I../ -Iconfig -I../config -Ilib/librte_eal/include -I../lib/librte_eal/include -Ilib/librte_eal/linux/include -I../lib/librte_eal/linux/include -Ilib/librte_eal/x86/include -I../lib/librte_eal/x86/include -Ilib/librte_eal/common -I../lib/librte_eal/common -Ilib/librte_eal -I../lib/librte_eal -Ilib/librte_kvargs -I../lib/librte_kvargs -Ilib/librte_telemetry/../librte_metrics -I../lib/librte_telemetry/../librte_metrics -Ilib/librte_telemetry -I../lib/librte_telemetry -Ilib/librte_net -I../lib/librte_net -Ilib/librte_mbuf -I../lib/librte_mbuf -Ilib/librte_mempool -I../lib/librte_mempool -Ilib/librte_ring -I../lib/librte_ring -Ilib/librte_meter -I../lib/librte_meter -Idrivers/bus/pci -I../drivers/bus/pci -I../drivers/bus/pci/linux -Ilib/librte_pci -I../lib/librte_pci -Idrivers/bus/vdev -I../drivers/bus/vdev -pipe -D_FILE_OFFSET_BITS=64 -Wall -w3 -diag-disable:remark -Werror -O3 -include rte_config.h -Wextra -Wcast-qual -Wdeprecated -Wformat-security -Wmissing-declarations -Wmissing-prototypes -Wold-style-definition -Wpointer-arith -Wsign-compare -Wstrict-prototypes -Wundef -Wwrite-strings -Wno-missing-field-initializers -diag-disable=188 -diag-disable=2203 -diag-disable=2279 -diag-disable=2557 -diag-disable=3179 -diag-disable=3656 -D_GNU_SOURCE -fPIC -march=native -mno-avx512f -DALLOW_EXPERIMENTAL_API -DALLOW_INTERNAL_API -MD -MQ 'drivers/a715181@@tmp_rte_pmd_virtio@sta/net_virtio_virtio_pci.c.o' -MF 'drivers/a715181@@tmp_rte_pmd_virtio@sta/net_virtio_virtio_pci.c.o.d' -o 'drivers/a715181@@tmp_rte_pmd_virtio@sta/net_virtio_virtio_pci.c.o' -c ../drivers/net/virtio/virtio_pci.c
In file included from ../drivers/net/virtio/virtio_pci.c(16):
../drivers/net/virtio/virtqueue.h(615): error: expected a declaration
  } while (0)
  ^

In file included from ../drivers/net/virtio/virtio_pci.c(16):
../drivers/net/virtio/virtqueue.h(700): error #12: parsing restarts here after previous syntax error
  	head_dp = &vq->vq_packed.ring.desc[idx];
  	                                       ^

In file included from ../drivers/net/virtio/virtio_pci.c(16):
../drivers/net/virtio/virtqueue.h(701): error #77: this declaration has no storage class or type specifier
  	head_flags = cookie->next ? VRING_DESC_F_NEXT : 0;
  	^

In file included from ../drivers/net/virtio/virtio_pci.c(16):
../drivers/net/virtio/virtqueue.h(701): error: identifier "cookie" is undefined
  	head_flags = cookie->next ? VRING_DESC_F_NEXT : 0;
  	             ^

In file included from ../drivers/net/virtio/virtio_pci.c(16):
../drivers/net/virtio/virtqueue.h(702): error #77: this declaration has no storage class or type specifier
  	head_flags |= vq->vq_packed.cached_flags;
  	^

In file included from ../drivers/net/virtio/virtio_pci.c(16):
../drivers/net/virtio/virtqueue.h(702): error: expected a ";"
  	head_flags |= vq->vq_packed.cached_flags;
  	           ^

In file included from ../drivers/net/virtio/virtio_pci.c(16):
../drivers/net/virtio/virtqueue.h(704): error: expected a declaration
  	if (can_push) {
  	^

In file included from ../drivers/net/virtio/virtio_pci.c(16):
../drivers/net/virtio/virtqueue.h(725): error #12: parsing restarts here after previous syntax error
  				VRING_PACKED_DESC_F_AVAIL_USED;
  				                              ^

In file included from ../drivers/net/virtio/virtio_pci.c(16):
../drivers/net/virtio/virtqueue.h(726): error: expected a declaration
  		}
  		^

In file included from ../drivers/net/virtio/virtio_pci.c(16):
../drivers/net/virtio/virtqueue.h(729): error #12: parsing restarts here after previous syntax error
  	virtqueue_xmit_offload(hdr, cookie, vq->hw->has_tx_offload);
  	                                                           ^

In file included from ../drivers/net/virtio/virtio_pci.c(16):
../drivers/net/virtio/virtqueue.h(731): error: expected a declaration
  	do {
  	^

In file included from ../drivers/net/virtio/virtio_pci.c(16):
../drivers/net/virtio/virtqueue.h(752): error #12: parsing restarts here after previous syntax error
  				VRING_PACKED_DESC_F_AVAIL_USED;
  				                              ^

In file included from ../drivers/net/virtio/virtio_pci.c(16):
../drivers/net/virtio/virtqueue.h(753): error: expected a declaration
  		}
  		^

In file included from ../drivers/net/virtio/virtio_pci.c(16):
../drivers/net/virtio/virtqueue.h(756): error: identifier "prev" is undefined
  	start_dp[prev].id = id;
  	         ^

In file included from ../drivers/net/virtio/virtio_pci.c(16):
../drivers/net/virtio/virtqueue.h(756): error: expected a ";"
  	start_dp[prev].id = id;
  	              ^

In file included from ../drivers/net/virtio/virtio_pci.c(16):
../drivers/net/virtio/virtqueue.h(758): error #77: this declaration has no storage class or type specifier
  	vq->vq_free_cnt = (uint16_t)(vq->vq_free_cnt - needed);
  	^

In file included from ../drivers/net/virtio/virtio_pci.c(16):
../drivers/net/virtio/virtqueue.h(758): error: expected a ";"
  	vq->vq_free_cnt = (uint16_t)(vq->vq_free_cnt - needed);
  	  ^

In file included from ../drivers/net/virtio/virtio_pci.c(16):
../drivers/net/virtio/virtqueue.h(759): error #77: this declaration has no storage class or type specifier
  	vq->vq_avail_idx = idx;
  	^

In file included from ../drivers/net/virtio/virtio_pci.c(16):
../drivers/net/virtio/virtqueue.h(759): error: expected a ";"
  	vq->vq_avail_idx = idx;
  	  ^

In file included from ../drivers/net/virtio/virtio_pci.c(16):
../drivers/net/virtio/virtqueue.h(761): error: expected a declaration
  	if (!in_order) {
  	^

In file included from ../drivers/net/virtio/virtio_pci.c(16):
../drivers/net/virtio/virtqueue.h(768): error #12: parsing restarts here after previous syntax error
  				     vq->hw->weak_barriers);
  				                           ^

In file included from ../drivers/net/virtio/virtio_pci.c(16):
../drivers/net/virtio/virtqueue.h(769): error: expected a declaration
  }
  ^

In file included from ../drivers/net/virtio/virtio_pci.c(16):
../drivers/net/virtio/virtqueue.h(816): error #12: parsing restarts here after previous syntax error
  		} while (curr_id != id);
  		                       ^

In file included from ../drivers/net/virtio/virtio_pci.c(16):
../drivers/net/virtio/virtqueue.h(817): error: expected a declaration
  	}
  	^

In file included from ../drivers/net/virtio/virtio_pci.c(16):
../drivers/net/virtio/virtqueue.h(819): error #77: this declaration has no storage class or type specifier
  	vq->vq_free_cnt += free_cnt;
  	^

In file included from ../drivers/net/virtio/virtio_pci.c(16):
../drivers/net/virtio/virtqueue.h(819): error: expected a ";"
  	vq->vq_free_cnt += free_cnt;
  	  ^

In file included from ../drivers/net/virtio/virtio_pci.c(16):
../drivers/net/virtio/virtqueue.h(820): error: expected a declaration
  }
  ^

In file included from ../drivers/net/virtio/virtio_pci.c(16):
../drivers/net/virtio/virtqueue.h(845): error #12: parsing restarts here after previous syntax error
  			dxp->cookie = NULL;
  			                  ^

In file included from ../drivers/net/virtio/virtio_pci.c(16):
../drivers/net/virtio/virtqueue.h(846): error: expected a declaration
  		}
  		^

In file included from ../drivers/net/virtio/virtio_pci.c(16):
../drivers/net/virtio/virtqueue.h(848): error: expected a declaration
  	}
  	^

../drivers/net/virtio/virtio_pci.c(91): error #12: parsing restarts here after previous syntax error
  		VIRTIO_PCI_CONFIG(hw) + offset);
  		                               ^

../drivers/net/virtio/virtio_pci.c(93): error: expected a declaration
  }
  ^

../drivers/net/virtio/virtio_pci.c(129): error #12: parsing restarts here after previous syntax error
  		VIRTIO_PCI_CONFIG(hw) + offset);
  		                               ^

../drivers/net/virtio/virtio_pci.c(131): error: expected a declaration
  }
  ^

../drivers/net/virtio/virtio_pci.c(258): error #12: parsing restarts here after previous syntax error
  };
   ^

../drivers/net/virtio/virtio_pci.c(369): error #266: function "check_vq_phys_addr_ok" declared implicitly
  	if (!check_vq_phys_addr_ok(vq))
  	     ^

compilation aborted for ../drivers/net/virtio/virtio_pci.c (code 2)
[1613/2582] Compiling C object 'drivers/a715181@@rte_pmd_softnic@sta/meson-generated_.._rte_pmd_softnic.pmd.c.o'.
[1614/2582] Compiling C object 'drivers/a715181@@rte_pmd_softnic@sha/meson-generated_.._rte_pmd_softnic.pmd.c.o'.
[1615/2582] Compiling C object 'drivers/a715181@@tmp_rte_pmd_virtio@sta/net_virtio_virtio_user_vhost_kernel_tap.c.o'.
[1616/2582] Compiling C object 'drivers/a715181@@rte_pmd_vdev_netvsc@sta/meson-generated_.._rte_pmd_vdev_netvsc.pmd.c.o'.
[1617/2582] Compiling C object 'drivers/a715181@@tmp_rte_pmd_vhost@sta/net_vhost_rte_eth_vhost.c.o'.
[1618/2582] Compiling C object 'drivers/a715181@@tmp_rte_pmd_tap@sta/net_tap_rte_eth_tap.c.o'.
[1619/2582] Compiling C object 'drivers/a715181@@tmp_rte_pmd_thunderx@sta/net_thunderx_nicvf_ethdev.c.o'.
[1620/2582] Compiling C object 'drivers/a715181@@tmp_rte_pmd_octeontx2@sta/net_octeontx2_otx2_tx.c.o'.
ninja: build stopped: subcommand failed




*Build Failed #5:
OS: CENTOS82-64
Target: x86_64-gcc-shared
FAILED: drivers/a715181@@tmp_rte_pmd_virtio@sta/net_virtio_virtio_pci.c.o 
gcc -Idrivers/a715181@@tmp_rte_pmd_virtio@sta -Idrivers -I../drivers -Idrivers/net/virtio -I../drivers/net/virtio -Ilib/librte_ethdev -I../lib/librte_ethdev -I. -I../ -Iconfig -I../config -Ilib/librte_eal/include -I../lib/librte_eal/include -Ilib/librte_eal/linux/include -I../lib/librte_eal/linux/include -Ilib/librte_eal/x86/include -I../lib/librte_eal/x86/include -Ilib/librte_eal/common -I../lib/librte_eal/common -Ilib/librte_eal -I../lib/librte_eal -Ilib/librte_kvargs -I../lib/librte_kvargs -Ilib/librte_telemetry/../librte_metrics -I../lib/librte_telemetry/../librte_metrics -Ilib/librte_telemetry -I../lib/librte_telemetry -Ilib/librte_net -I../lib/librte_net -Ilib/librte_mbuf -I../lib/librte_mbuf -Ilib/librte_mempool -I../lib/librte_mempool -Ilib/librte_ring -I../lib/librte_ring -Ilib/librte_meter -I../lib/librte_meter -Idrivers/bus/pci -I../drivers/bus/pci -I../drivers/bus/pci/linux -Ilib/librte_pci -I../lib/librte_pci -Idrivers/bus/vdev -I../drivers/bus/vdev -fdiagnostics-color=always -pipe -D_FILE_OFFSET_BITS=64 -Wall -Winvalid-pch -Werror -O3 -include rte_config.h -Wextra -Wcast-qual -Wdeprecated -Wformat-nonliteral -Wformat-security -Wmissing-declarations -Wmissing-prototypes -Wnested-externs -Wold-style-definition -Wpointer-arith -Wsign-compare -Wstrict-prototypes -Wundef -Wwrite-strings -Wno-packed-not-aligned -Wno-missing-field-initializers -D_GNU_SOURCE -fPIC -march=native -mno-avx512f -DALLOW_EXPERIMENTAL_API -DALLOW_INTERNAL_API -Wno-format-truncation -MD -MQ 'drivers/a715181@@tmp_rte_pmd_virtio@sta/net_virtio_virtio_pci.c.o' -MF 'drivers/a715181@@tmp_rte_pmd_virtio@sta/net_virtio_virtio_pci.c.o.d' -o 'drivers/a715181@@tmp_rte_pmd_virtio@sta/net_virtio_virtio_pci.c.o' -c ../drivers/net/virtio/virtio_pci.c
In file included from ../drivers/net/virtio/virtio_pci.c:16:
../drivers/net/virtio/virtqueue.h:615:1: error: expected identifier or ‘(’ before ‘}’ token
 } while (0)
 ^
../drivers/net/virtio/virtqueue.h:615:3: error: expected identifier or ‘(’ before ‘while’
 } while (0)
   ^~~~~
[1668/2611] Compiling C object 'drivers/a715181@@rte_pmd_thunderx@sha/meson-generated_.._rte_pmd_thunderx.pmd.c.o'.
[1669/2611] Generating rte_pmd_vhost.pmd.c with a custom command.
[1670/2611] Generating rte_pmd_vdev_netvsc.sym_chk with a meson_exe.py custom command.
[1671/2611] Compiling C object 'drivers/a715181@@tmp_rte_pmd_virtio@sta/net_virtio_virtio_ethdev.c.o'.
FAILED: drivers/a715181@@tmp_rte_pmd_virtio@sta/net_virtio_virtio_ethdev.c.o 
gcc -Idrivers/a715181@@tmp_rte_pmd_virtio@sta -Idrivers -I../drivers -Idrivers/net/virtio -I../drivers/net/virtio -Ilib/librte_ethdev -I../lib/librte_ethdev -I. -I../ -Iconfig -I../config -Ilib/librte_eal/include -I../lib/librte_eal/include -Ilib/librte_eal/linux/include -I../lib/librte_eal/linux/include -Ilib/librte_eal/x86/include -I../lib/librte_eal/x86/include -Ilib/librte_eal/common -I../lib/librte_eal/common -Ilib/librte_eal -I../lib/librte_eal -Ilib/librte_kvargs -I../lib/librte_kvargs -Ilib/librte_telemetry/../librte_metrics -I../lib/librte_telemetry/../librte_metrics -Ilib/librte_telemetry -I../lib/librte_telemetry -Ilib/librte_net -I../lib/librte_net -Ilib/librte_mbuf -I../lib/librte_mbuf -Ilib/librte_mempool -I../lib/librte_mempool -Ilib/librte_ring -I../lib/librte_ring -Ilib/librte_meter -I../lib/librte_meter -Idrivers/bus/pci -I../drivers/bus/pci -I../drivers/bus/pci/linux -Ilib/librte_pci -I../lib/librte_pci -Idrivers/bus/vdev -I../drivers/bus/vdev -fdiagnostics-color=always -pipe -D_FILE_OFFSET_BITS=64 -Wall -Winvalid-pch -Werror -O3 -include rte_config.h -Wextra -Wcast-qual -Wdeprecated -Wformat-nonliteral -Wformat-security -Wmissing-declarations -Wmissing-prototypes -Wnested-externs -Wold-style-definition -Wpointer-arith -Wsign-compare -Wstrict-prototypes -Wundef -Wwrite-strings -Wno-packed-not-aligned -Wno-missing-field-initializers -D_GNU_SOURCE -fPIC -march=native -mno-avx512f -DALLOW_EXPERIMENTAL_API -DALLOW_INTERNAL_API -Wno-format-truncation -MD -MQ 'drivers/a715181@@tmp_rte_pmd_virtio@sta/net_virtio_virtio_ethdev.c.o' -MF 'drivers/a715181@@tmp_rte_pmd_virtio@sta/net_virtio_virtio_ethdev.c.o.d' -o 'drivers/a715181@@tmp_rte_pmd_virtio@sta/net_virtio_virtio_ethdev.c.o' -c ../drivers/net/virtio/virtio_ethdev.c
In file included from ../drivers/net/virtio/virtio_ethdev.c:36:
../drivers/net/virtio/virtqueue.h:615:1: error: expected identifier or ‘(’ before ‘}’ token
 } while (0)
 ^
../drivers/net/virtio/virtqueue.h:615:3: error: expected identifier or ‘(’ before ‘while’
 } while (0)
   ^~~~~
[1672/2611] Compiling C object 'drivers/a715181@@tmp_rte_pmd_virtio@sta/net_virtio_virtio_user_vhost_kernel_tap.c.o'.
ninja: build stopped: subcommand failed




*Build Failed #6:
OS: CENTOS82-64
Target: x86_64-gcc-debug
FAILED: drivers/a715181@@tmp_rte_pmd_virtio@sta/net_virtio_virtio_pci.c.o 
gcc -Idrivers/a715181@@tmp_rte_pmd_virtio@sta -Idrivers -I../drivers -Idrivers/net/virtio -I../drivers/net/virtio -Ilib/librte_ethdev -I../lib/librte_ethdev -I. -I../ -Iconfig -I../config -Ilib/librte_eal/include -I../lib/librte_eal/include -Ilib/librte_eal/linux/include -I../lib/librte_eal/linux/include -Ilib/librte_eal/x86/include -I../lib/librte_eal/x86/include -Ilib/librte_eal/common -I../lib/librte_eal/common -Ilib/librte_eal -I../lib/librte_eal -Ilib/librte_kvargs -I../lib/librte_kvargs -Ilib/librte_telemetry/../librte_metrics -I../lib/librte_telemetry/../librte_metrics -Ilib/librte_telemetry -I../lib/librte_telemetry -Ilib/librte_net -I../lib/librte_net -Ilib/librte_mbuf -I../lib/librte_mbuf -Ilib/librte_mempool -I../lib/librte_mempool -Ilib/librte_ring -I../lib/librte_ring -Ilib/librte_meter -I../lib/librte_meter -Idrivers/bus/pci -I../drivers/bus/pci -I../drivers/bus/pci/linux -Ilib/librte_pci -I../lib/librte_pci -Idrivers/bus/vdev -I../drivers/bus/vdev -fdiagnostics-color=always -pipe -D_FILE_OFFSET_BITS=64 -Wall -Winvalid-pch -Werror -O2 -g -include rte_config.h -Wextra -Wcast-qual -Wdeprecated -Wformat-nonliteral -Wformat-security -Wmissing-declarations -Wmissing-prototypes -Wnested-externs -Wold-style-definition -Wpointer-arith -Wsign-compare -Wstrict-prototypes -Wundef -Wwrite-strings -Wno-packed-not-aligned -Wno-missing-field-initializers -D_GNU_SOURCE -fPIC -march=native -mno-avx512f -DALLOW_EXPERIMENTAL_API -DALLOW_INTERNAL_API -Wno-format-truncation -MD -MQ 'drivers/a715181@@tmp_rte_pmd_virtio@sta/net_virtio_virtio_pci.c.o' -MF 'drivers/a715181@@tmp_rte_pmd_virtio@sta/net_virtio_virtio_pci.c.o.d' -o 'drivers/a715181@@tmp_rte_pmd_virtio@sta/net_virtio_virtio_pci.c.o' -c ../drivers/net/virtio/virtio_pci.c
In file included from ../drivers/net/virtio/virtio_pci.c:16:
../drivers/net/virtio/virtqueue.h:615:1: error: expected identifier or ‘(’ before ‘}’ token
 } while (0)
 ^
../drivers/net/virtio/virtqueue.h:615:3: error: expected identifier or ‘(’ before ‘while’
 } while (0)
   ^~~~~
[1624/2582] Compiling C object 'drivers/a715181@@tmp_rte_pmd_vdev_netvsc@sta/net_vdev_netvsc_vdev_netvsc.c.o'.
[1625/2582] Generating rte_pmd_softnic.sym_chk with a meson_exe.py custom command.
[1626/2582] Generating rte_pmd_tap.sym_chk with a meson_exe.py custom command.
[1627/2582] Compiling C object 'drivers/a715181@@tmp_rte_pmd_vhost@sta/net_vhost_rte_eth_vhost.c.o'.
[1628/2582] Compiling C object 'drivers/a715181@@tmp_rte_pmd_thunderx@sta/net_thunderx_nicvf_ethdev.c.o'.
ninja: build stopped: subcommand failed




*Build Failed #7:
OS: FC32-64
Target: x86_64-gcc-static
FAILED: drivers/net/virtio/20670f1@@virtio_avx512_lib@sta/virtio_rxtx_packed_avx.c.o 
gcc -Idrivers/net/virtio/20670f1@@virtio_avx512_lib@sta -Idrivers/net/virtio -I../drivers/net/virtio -Ilib/librte_ethdev -I../lib/librte_ethdev -I. -I../ -Iconfig -I../config -Ilib/librte_eal/include -I../lib/librte_eal/include -Ilib/librte_eal/linux/include -I../lib/librte_eal/linux/include -Ilib/librte_eal/x86/include -I../lib/librte_eal/x86/include -Ilib/librte_eal/common -I../lib/librte_eal/common -Ilib/librte_eal -I../lib/librte_eal -Ilib/librte_kvargs -I../lib/librte_kvargs -Ilib/librte_telemetry/../librte_metrics -I../lib/librte_telemetry/../librte_metrics -Ilib/librte_telemetry -I../lib/librte_telemetry -Ilib/librte_net -I../lib/librte_net -Ilib/librte_mbuf -I../lib/librte_mbuf -Ilib/librte_mempool -I../lib/librte_mempool -Ilib/librte_ring -I../lib/librte_ring -Ilib/librte_meter -I../lib/librte_meter -Idrivers/bus/pci -I../drivers/bus/pci -I../drivers/bus/pci/linux -Ilib/librte_pci -I../lib/librte_pci -fdiagnostics-color=always -pipe -D_FILE_OFFSET_BITS=64 -Wall -Winvalid-pch -Werror -O3 -include rte_config.h -Wextra -Wcast-qual -Wdeprecated -Wformat-nonliteral -Wformat-security -Wmissing-declarations -Wmissing-prototypes -Wnested-externs -Wold-style-definition -Wpointer-arith -Wsign-compare -Wstrict-prototypes -Wundef -Wwrite-strings -Wno-address-of-packed-member -Wno-packed-not-aligned -Wno-missing-field-initializers -Wno-zero-length-bounds -D_GNU_SOURCE -fPIC -march=native -DALLOW_EXPERIMENTAL_API -DALLOW_INTERNAL_API -Wno-format-truncation -DCC_AVX512_SUPPORT -mavx512f -mavx512bw -mavx512vl -MD -MQ 'drivers/net/virtio/20670f1@@virtio_avx512_lib@sta/virtio_rxtx_packed_avx.c.o' -MF 'drivers/net/virtio/20670f1@@virtio_avx512_lib@sta/virtio_rxtx_packed_avx.c.o.d' -o 'drivers/net/virtio/20670f1@@virtio_avx512_lib@sta/virtio_rxtx_packed_avx.c.o' -c ../drivers/net/virtio/virtio_rxtx_packed_avx.c
In file included from ../drivers/net/virtio/virtio_rxtx_packed_avx.c:16:
../drivers/net/virtio/virtqueue.h:615:1: error: expected identifier or ‘(’ before ‘}’ token
  615 | } while (0)
      | ^
../drivers/net/virtio/virtqueue.h:615:3: error: expected identifier or ‘(’ before ‘while’
  615 | } while (0)
      |   ^~~~~
[1624/2583] Compiling C object 'drivers/a715181@@tmp_rte_pmd_virtio@sta/net_virtio_virtio_ethdev.c.o'.
FAILED: drivers/a715181@@tmp_rte_pmd_virtio@sta/net_virtio_virtio_ethdev.c.o 
gcc -Idrivers/a715181@@tmp_rte_pmd_virtio@sta -Idrivers -I../drivers -Idrivers/net/virtio -I../drivers/net/virtio -Ilib/librte_ethdev -I../lib/librte_ethdev -I. -I../ -Iconfig -I../config -Ilib/librte_eal/include -I../lib/librte_eal/include -Ilib/librte_eal/linux/include -I../lib/librte_eal/linux/include -Ilib/librte_eal/x86/include -I../lib/librte_eal/x86/include -Ilib/librte_eal/common -I../lib/librte_eal/common -Ilib/librte_eal -I../lib/librte_eal -Ilib/librte_kvargs -I../lib/librte_kvargs -Ilib/librte_telemetry/../librte_metrics -I../lib/librte_telemetry/../librte_metrics -Ilib/librte_telemetry -I../lib/librte_telemetry -Ilib/librte_net -I../lib/librte_net -Ilib/librte_mbuf -I../lib/librte_mbuf -Ilib/librte_mempool -I../lib/librte_mempool -Ilib/librte_ring -I../lib/librte_ring -Ilib/librte_meter -I../lib/librte_meter -Idrivers/bus/pci -I../drivers/bus/pci -I../drivers/bus/pci/linux -Ilib/librte_pci -I../lib/librte_pci -Idrivers/bus/vdev -I../drivers/bus/vdev -fdiagnostics-color=always -pipe -D_FILE_OFFSET_BITS=64 -Wall -Winvalid-pch -Werror -O3 -include rte_config.h -Wextra -Wcast-qual -Wdeprecated -Wformat-nonliteral -Wformat-security -Wmissing-declarations -Wmissing-prototypes -Wnested-externs -Wold-style-definition -Wpointer-arith -Wsign-compare -Wstrict-prototypes -Wundef -Wwrite-strings -Wno-address-of-packed-member -Wno-packed-not-aligned -Wno-missing-field-initializers -Wno-zero-length-bounds -D_GNU_SOURCE -fPIC -march=native -DALLOW_EXPERIMENTAL_API -DALLOW_INTERNAL_API -Wno-format-truncation -DCC_AVX512_SUPPORT -DVHOST_GCC_UNROLL_PRAGMA -MD -MQ 'drivers/a715181@@tmp_rte_pmd_virtio@sta/net_virtio_virtio_ethdev.c.o' -MF 'drivers/a715181@@tmp_rte_pmd_virtio@sta/net_virtio_virtio_ethdev.c.o.d' -o 'drivers/a715181@@tmp_rte_pmd_virtio@sta/net_virtio_virtio_ethdev.c.o' -c ../drivers/net/virtio/virtio_ethdev.c
In file included from ../drivers/net/virtio/virtio_ethdev.c:36:
../drivers/net/virtio/virtqueue.h:615:1: error: expected identifier or ‘(’ before ‘}’ token
  615 | } while (0)
      | ^
../drivers/net/virtio/virtqueue.h:615:3: error: expected identifier or ‘(’ before ‘while’
  615 | } while (0)
      |   ^~~~~
[1625/2583] Compiling C object 'drivers/net/thunderx/base/80ab7c6@@nicvf_base@sta/nicvf_mbox.c.o'.
[1626/2583] Compiling C object 'drivers/a715181@@tmp_rte_pmd_virtio@sta/net_virtio_virtio_pci.c.o'.
FAILED: drivers/a715181@@tmp_rte_pmd_virtio@sta/net_virtio_virtio_pci.c.o 
gcc -Idrivers/a715181@@tmp_rte_pmd_virtio@sta -Idrivers -I../drivers -Idrivers/net/virtio -I../drivers/net/virtio -Ilib/librte_ethdev -I../lib/librte_ethdev -I. -I../ -Iconfig -I../config -Ilib/librte_eal/include -I../lib/librte_eal/include -Ilib/librte_eal/linux/include -I../lib/librte_eal/linux/include -Ilib/librte_eal/x86/include -I../lib/librte_eal/x86/include -Ilib/librte_eal/common -I../lib/librte_eal/common -Ilib/librte_eal -I../lib/librte_eal -Ilib/librte_kvargs -I../lib/librte_kvargs -Ilib/librte_telemetry/../librte_metrics -I../lib/librte_telemetry/../librte_metrics -Ilib/librte_telemetry -I../lib/librte_telemetry -Ilib/librte_net -I../lib/librte_net -Ilib/librte_mbuf -I../lib/librte_mbuf -Ilib/librte_mempool -I../lib/librte_mempool -Ilib/librte_ring -I../lib/librte_ring -Ilib/librte_meter -I../lib/librte_meter -Idrivers/bus/pci -I../drivers/bus/pci -I../drivers/bus/pci/linux -Ilib/librte_pci -I../lib/librte_pci -Idrivers/bus/vdev -I../drivers/bus/vdev -fdiagnostics-color=always -pipe -D_FILE_OFFSET_BITS=64 -Wall -Winvalid-pch -Werror -O3 -include rte_config.h -Wextra -Wcast-qual -Wdeprecated -Wformat-nonliteral -Wformat-security -Wmissing-declarations -Wmissing-prototypes -Wnested-externs -Wold-style-definition -Wpointer-arith -Wsign-compare -Wstrict-prototypes -Wundef -Wwrite-strings -Wno-address-of-packed-member -Wno-packed-not-aligned -Wno-missing-field-initializers -Wno-zero-length-bounds -D_GNU_SOURCE -fPIC -march=native -DALLOW_EXPERIMENTAL_API -DALLOW_INTERNAL_API -Wno-format-truncation -DCC_AVX512_SUPPORT -DVHOST_GCC_UNROLL_PRAGMA -MD -MQ 'drivers/a715181@@tmp_rte_pmd_virtio@sta/net_virtio_virtio_pci.c.o' -MF 'drivers/a715181@@tmp_rte_pmd_virtio@sta/net_virtio_virtio_pci.c.o.d' -o 'drivers/a715181@@tmp_rte_pmd_virtio@sta/net_virtio_virtio_pci.c.o' -c ../drivers/net/virtio/virtio_pci.c
In file included from ../drivers/net/virtio/virtio_pci.c:16:
../drivers/net/virtio/virtqueue.h:615:1: error: expected identifier or ‘(’ before ‘}’ token
  615 | } while (0)
      | ^
../drivers/net/virtio/virtqueue.h:615:3: error: expected identifier or ‘(’ before ‘while’
  615 | } while (0)
      |   ^~~~~
[1627/2583] Compiling C object 'drivers/a715181@@tmp_rte_pmd_virtio@sta/net_virtio_virtio_user_vhost_kernel_tap.c.o'.
[1628/2583] Compiling C object 'drivers/a715181@@tmp_rte_pmd_virtio@sta/net_virtio_virtio_rxtx.c.o'.
FAILED: drivers/a715181@@tmp_rte_pmd_virtio@sta/net_virtio_virtio_rxtx.c.o 
gcc -Idrivers/a715181@@tmp_rte_pmd_virtio@sta -Idrivers -I../drivers -Idrivers/net/virtio -I../drivers/net/virtio -Ilib/librte_ethdev -I../lib/librte_ethdev -I. -I../ -Iconfig -I../config -Ilib/librte_eal/include -I../lib/librte_eal/include -Ilib/librte_eal/linux/include -I../lib/librte_eal/linux/include -Ilib/librte_eal/x86/include -I../lib/librte_eal/x86/include -Ilib/librte_eal/common -I../lib/librte_eal/common -Ilib/librte_eal -I../lib/librte_eal -Ilib/librte_kvargs -I../lib/librte_kvargs -Ilib/librte_telemetry/../librte_metrics -I../lib/librte_telemetry/../librte_metrics -Ilib/librte_telemetry -I../lib/librte_telemetry -Ilib/librte_net -I../lib/librte_net -Ilib/librte_mbuf -I../lib/librte_mbuf -Ilib/librte_mempool -I../lib/librte_mempool -Ilib/librte_ring -I../lib/librte_ring -Ilib/librte_meter -I../lib/librte_meter -Idrivers/bus/pci -I../drivers/bus/pci -I../drivers/bus/pci/linux -Ilib/librte_pci -I../lib/librte_pci -Idrivers/bus/vdev -I../drivers/bus/vdev -fdiagnostics-color=always -pipe -D_FILE_OFFSET_BITS=64 -Wall -Winvalid-pch -Werror -O3 -include rte_config.h -Wextra -Wcast-qual -Wdeprecated -Wformat-nonliteral -Wformat-security -Wmissing-declarations -Wmissing-prototypes -Wnested-externs -Wold-style-definition -Wpointer-arith -Wsign-compare -Wstrict-prototypes -Wundef -Wwrite-strings -Wno-address-of-packed-member -Wno-packed-not-aligned -Wno-missing-field-initializers -Wno-zero-length-bounds -D_GNU_SOURCE -fPIC -march=native -DALLOW_EXPERIMENTAL_API -DALLOW_INTERNAL_API -Wno-format-truncation -DCC_AVX512_SUPPORT -DVHOST_GCC_UNROLL_PRAGMA -MD -MQ 'drivers/a715181@@tmp_rte_pmd_virtio@sta/net_virtio_virtio_rxtx.c.o' -MF 'drivers/a715181@@tmp_rte_pmd_virtio@sta/net_virtio_virtio_rxtx.c.o.d' -o 'drivers/a715181@@tmp_rte_pmd_virtio@sta/net_virtio_virtio_rxtx.c.o' -c ../drivers/net/virtio/virtio_rxtx.c
In file included from ../drivers/net/virtio/virtio_rxtx.c:31:
../drivers/net/virtio/virtqueue.h:615:1: error: expected identifier or ‘(’ before ‘}’ token
  615 | } while (0)
      | ^
../drivers/net/virtio/virtqueue.h:615:3: error: expected identifier or ‘(’ before ‘while’
  615 | } while (0)
      |   ^~~~~
[1629/2583] Compiling C object 'drivers/a715181@@tmp_rte_pmd_vhost@sta/net_vhost_rte_eth_vhost.c.o'.
[1630/2583] Generating rte_pmd_softnic.sym_chk with a meson_exe.py custom command.
[1631/2583] Compiling C object 'drivers/a715181@@tmp_rte_pmd_virtio@sta/net_virtio_virtio_rxtx_simple.c.o'.
FAILED: drivers/a715181@@tmp_rte_pmd_virtio@sta/net_virtio_virtio_rxtx_simple.c.o 
gcc -Idrivers/a715181@@tmp_rte_pmd_virtio@sta -Idrivers -I../drivers -Idrivers/net/virtio -I../drivers/net/virtio -Ilib/librte_ethdev -I../lib/librte_ethdev -I. -I../ -Iconfig -I../config -Ilib/librte_eal/include -I../lib/librte_eal/include -Ilib/librte_eal/linux/include -I../lib/librte_eal/linux/include -Ilib/librte_eal/x86/include -I../lib/librte_eal/x86/include -Ilib/librte_eal/common -I../lib/librte_eal/common -Ilib/librte_eal -I../lib/librte_eal -Ilib/librte_kvargs -I../lib/librte_kvargs -Ilib/librte_telemetry/../librte_metrics -I../lib/librte_telemetry/../librte_metrics -Ilib/librte_telemetry -I../lib/librte_telemetry -Ilib/librte_net -I../lib/librte_net -Ilib/librte_mbuf -I../lib/librte_mbuf -Ilib/librte_mempool -I../lib/librte_mempool -Ilib/librte_ring -I../lib/librte_ring -Ilib/librte_meter -I../lib/librte_meter -Idrivers/bus/pci -I../drivers/bus/pci -I../drivers/bus/pci/linux -Ilib/librte_pci -I../lib/librte_pci -Idrivers/bus/vdev -I../drivers/bus/vdev -fdiagnostics-color=always -pipe -D_FILE_OFFSET_BITS=64 -Wall -Winvalid-pch -Werror -O3 -include rte_config.h -Wextra -Wcast-qual -Wdeprecated -Wformat-nonliteral -Wformat-security -Wmissing-declarations -Wmissing-prototypes -Wnested-externs -Wold-style-definition -Wpointer-arith -Wsign-compare -Wstrict-prototypes -Wundef -Wwrite-strings -Wno-address-of-packed-member -Wno-packed-not-aligned -Wno-missing-field-initializers -Wno-zero-length-bounds -D_GNU_SOURCE -fPIC -march=native -DALLOW_EXPERIMENTAL_API -DALLOW_INTERNAL_API -Wno-format-truncation -DCC_AVX512_SUPPORT -DVHOST_GCC_UNROLL_PRAGMA -MD -MQ 'drivers/a715181@@tmp_rte_pmd_virtio@sta/net_virtio_virtio_rxtx_simple.c.o' -MF 'drivers/a715181@@tmp_rte_pmd_virtio@sta/net_virtio_virtio_rxtx_simple.c.o.d' -o 'drivers/a715181@@tmp_rte_pmd_virtio@sta/net_virtio_virtio_rxtx_simple.c.o' -c ../drivers/net/virtio/virtio_rxtx_simple.c
In file included from ../drivers/net/virtio/virtio_rxtx_simple.h:12,
                 from ../drivers/net/virtio/virtio_rxtx_simple.c:24:
../drivers/net/virtio/virtqueue.h:615:1: error: expected identifier or ‘(’ before ‘}’ token
  615 | } while (0)
      | ^
../drivers/net/virtio/virtqueue.h:615:3: error: expected identifier or ‘(’ before ‘while’
  615 | } while (0)
      |   ^~~~~
[1632/2583] Generating rte_pmd_vdev_netvsc.sym_chk with a meson_exe.py custom command.
[1633/2583] Compiling C object 'drivers/a715181@@tmp_rte_pmd_thunderx@sta/net_thunderx_nicvf_ethdev.c.o'.
[1634/2583] Compiling C object 'drivers/a715181@@tmp_rte_pmd_tap@sta/net_tap_rte_eth_tap.c.o'.
ninja: build stopped: subcommand failed




*Build Failed #8:
OS: FC32-64
Target: x86_64-clang-static
FAILED: drivers/a715181@@tmp_rte_pmd_virtio@sta/net_virtio_virtio_ethdev.c.o 
clang -Idrivers/a715181@@tmp_rte_pmd_virtio@sta -Idrivers -I../drivers -Idrivers/net/virtio -I../drivers/net/virtio -Ilib/librte_ethdev -I../lib/librte_ethdev -I. -I../ -Iconfig -I../config -Ilib/librte_eal/include -I../lib/librte_eal/include -Ilib/librte_eal/linux/include -I../lib/librte_eal/linux/include -Ilib/librte_eal/x86/include -I../lib/librte_eal/x86/include -Ilib/librte_eal/common -I../lib/librte_eal/common -Ilib/librte_eal -I../lib/librte_eal -Ilib/librte_kvargs -I../lib/librte_kvargs -Ilib/librte_telemetry/../librte_metrics -I../lib/librte_telemetry/../librte_metrics -Ilib/librte_telemetry -I../lib/librte_telemetry -Ilib/librte_net -I../lib/librte_net -Ilib/librte_mbuf -I../lib/librte_mbuf -Ilib/librte_mempool -I../lib/librte_mempool -Ilib/librte_ring -I../lib/librte_ring -Ilib/librte_meter -I../lib/librte_meter -Idrivers/bus/pci -I../drivers/bus/pci -I../drivers/bus/pci/linux -Ilib/librte_pci -I../lib/librte_pci -Idrivers/bus/vdev -I../drivers/bus/vdev -Xclang -fcolor-diagnostics -pipe -D_FILE_OFFSET_BITS=64 -Wall -Winvalid-pch -Werror -O3 -include rte_config.h -Wextra -Wcast-qual -Wdeprecated -Wformat-nonliteral -Wformat-security -Wmissing-declarations -Wmissing-prototypes -Wnested-externs -Wold-style-definition -Wpointer-arith -Wsign-compare -Wstrict-prototypes -Wundef -Wwrite-strings -Wno-address-of-packed-member -Wno-missing-field-initializers -D_GNU_SOURCE -fPIC -march=native -DALLOW_EXPERIMENTAL_API -DALLOW_INTERNAL_API -DCC_AVX512_SUPPORT -DVHOST_CLANG_UNROLL_PRAGMA -MD -MQ 'drivers/a715181@@tmp_rte_pmd_virtio@sta/net_virtio_virtio_ethdev.c.o' -MF 'drivers/a715181@@tmp_rte_pmd_virtio@sta/net_virtio_virtio_ethdev.c.o.d' -o 'drivers/a715181@@tmp_rte_pmd_virtio@sta/net_virtio_virtio_ethdev.c.o' -c ../drivers/net/virtio/virtio_ethdev.c
In file included from ../drivers/net/virtio/virtio_ethdev.c:36:
../drivers/net/virtio/virtqueue.h:615:1: error: extraneous closing brace ('}')
} while (0)
^
../drivers/net/virtio/virtqueue.h:615:3: error: expected identifier or '('
} while (0)
  ^
2 errors generated.
[1623/2583] Generating rte_pmd_softnic.sym_chk with a meson_exe.py custom command.
[1624/2583] Compiling C object 'drivers/net/thunderx/base/80ab7c6@@nicvf_base@sta/nicvf_hw.c.o'.
[1625/2583] Compiling C object 'drivers/net/virtio/20670f1@@virtio_avx512_lib@sta/virtio_rxtx_packed_avx.c.o'.
FAILED: drivers/net/virtio/20670f1@@virtio_avx512_lib@sta/virtio_rxtx_packed_avx.c.o 
clang -Idrivers/net/virtio/20670f1@@virtio_avx512_lib@sta -Idrivers/net/virtio -I../drivers/net/virtio -Ilib/librte_ethdev -I../lib/librte_ethdev -I. -I../ -Iconfig -I../config -Ilib/librte_eal/include -I../lib/librte_eal/include -Ilib/librte_eal/linux/include -I../lib/librte_eal/linux/include -Ilib/librte_eal/x86/include -I../lib/librte_eal/x86/include -Ilib/librte_eal/common -I../lib/librte_eal/common -Ilib/librte_eal -I../lib/librte_eal -Ilib/librte_kvargs -I../lib/librte_kvargs -Ilib/librte_telemetry/../librte_metrics -I../lib/librte_telemetry/../librte_metrics -Ilib/librte_telemetry -I../lib/librte_telemetry -Ilib/librte_net -I../lib/librte_net -Ilib/librte_mbuf -I../lib/librte_mbuf -Ilib/librte_mempool -I../lib/librte_mempool -Ilib/librte_ring -I../lib/librte_ring -Ilib/librte_meter -I../lib/librte_meter -Idrivers/bus/pci -I../drivers/bus/pci -I../drivers/bus/pci/linux -Ilib/librte_pci -I../lib/librte_pci -Xclang -fcolor-diagnostics -pipe -D_FILE_OFFSET_BITS=64 -Wall -Winvalid-pch -Werror -O3 -include rte_config.h -Wextra -Wcast-qual -Wdeprecated -Wformat-nonliteral -Wformat-security -Wmissing-declarations -Wmissing-prototypes -Wnested-externs -Wold-style-definition -Wpointer-arith -Wsign-compare -Wstrict-prototypes -Wundef -Wwrite-strings -Wno-address-of-packed-member -Wno-missing-field-initializers -D_GNU_SOURCE -fPIC -march=native -DALLOW_EXPERIMENTAL_API -DALLOW_INTERNAL_API -DCC_AVX512_SUPPORT -mavx512f -mavx512bw -mavx512vl -MD -MQ 'drivers/net/virtio/20670f1@@virtio_avx512_lib@sta/virtio_rxtx_packed_avx.c.o' -MF 'drivers/net/virtio/20670f1@@virtio_avx512_lib@sta/virtio_rxtx_packed_avx.c.o.d' -o 'drivers/net/virtio/20670f1@@virtio_avx512_lib@sta/virtio_rxtx_packed_avx.c.o' -c ../drivers/net/virtio/virtio_rxtx_packed_avx.c
In file included from ../drivers/net/virtio/virtio_rxtx_packed_avx.c:16:
../drivers/net/virtio/virtqueue.h:615:1: error: extraneous closing brace ('}')
} while (0)
^
../drivers/net/virtio/virtqueue.h:615:3: error: expected identifier or '('
} while (0)
  ^
2 errors generated.
[1626/2583] Compiling C object 'drivers/a715181@@tmp_rte_pmd_vdev_netvsc@sta/net_vdev_netvsc_vdev_netvsc.c.o'.
[1627/2583] Compiling C object 'drivers/a715181@@tmp_rte_pmd_virtio@sta/net_virtio_virtio_pci.c.o'.
FAILED: drivers/a715181@@tmp_rte_pmd_virtio@sta/net_virtio_virtio_pci.c.o 
clang -Idrivers/a715181@@tmp_rte_pmd_virtio@sta -Idrivers -I../drivers -Idrivers/net/virtio -I../drivers/net/virtio -Ilib/librte_ethdev -I../lib/librte_ethdev -I. -I../ -Iconfig -I../config -Ilib/librte_eal/include -I../lib/librte_eal/include -Ilib/librte_eal/linux/include -I../lib/librte_eal/linux/include -Ilib/librte_eal/x86/include -I../lib/librte_eal/x86/include -Ilib/librte_eal/common -I../lib/librte_eal/common -Ilib/librte_eal -I../lib/librte_eal -Ilib/librte_kvargs -I../lib/librte_kvargs -Ilib/librte_telemetry/../librte_metrics -I../lib/librte_telemetry/../librte_metrics -Ilib/librte_telemetry -I../lib/librte_telemetry -Ilib/librte_net -I../lib/librte_net -Ilib/librte_mbuf -I../lib/librte_mbuf -Ilib/librte_mempool -I../lib/librte_mempool -Ilib/librte_ring -I../lib/librte_ring -Ilib/librte_meter -I../lib/librte_meter -Idrivers/bus/pci -I../drivers/bus/pci -I../drivers/bus/pci/linux -Ilib/librte_pci -I../lib/librte_pci -Idrivers/bus/vdev -I../drivers/bus/vdev -Xclang -fcolor-diagnostics -pipe -D_FILE_OFFSET_BITS=64 -Wall -Winvalid-pch -Werror -O3 -include rte_config.h -Wextra -Wcast-qual -Wdeprecated -Wformat-nonliteral -Wformat-security -Wmissing-declarations -Wmissing-prototypes -Wnested-externs -Wold-style-definition -Wpointer-arith -Wsign-compare -Wstrict-prototypes -Wundef -Wwrite-strings -Wno-address-of-packed-member -Wno-missing-field-initializers -D_GNU_SOURCE -fPIC -march=native -DALLOW_EXPERIMENTAL_API -DALLOW_INTERNAL_API -DCC_AVX512_SUPPORT -DVHOST_CLANG_UNROLL_PRAGMA -MD -MQ 'drivers/a715181@@tmp_rte_pmd_virtio@sta/net_virtio_virtio_pci.c.o' -MF 'drivers/a715181@@tmp_rte_pmd_virtio@sta/net_virtio_virtio_pci.c.o.d' -o 'drivers/a715181@@tmp_rte_pmd_virtio@sta/net_virtio_virtio_pci.c.o' -c ../drivers/net/virtio/virtio_pci.c
In file included from ../drivers/net/virtio/virtio_pci.c:16:
../drivers/net/virtio/virtqueue.h:615:1: error: extraneous closing brace ('}')
} while (0)
^
../drivers/net/virtio/virtqueue.h:615:3: error: expected identifier or '('
} while (0)
  ^
2 errors generated.
[1628/2583] Compiling C object 'drivers/a715181@@tmp_rte_pmd_virtio@sta/net_virtio_virtio_user_vhost_kernel_tap.c.o'.
[1629/2583] Compiling C object 'drivers/a715181@@tmp_rte_pmd_vhost@sta/net_vhost_rte_eth_vhost.c.o'.
[1630/2583] Compiling C object 'drivers/a715181@@tmp_rte_pmd_thunderx@sta/net_thunderx_nicvf_ethdev.c.o'.
[1631/2583] Compiling C object 'drivers/a715181@@tmp_rte_pmd_tap@sta/net_tap_rte_eth_tap.c.o'.
ninja: build stopped: subcommand failed




*Build Failed #9:
OS: FreeBSD1201-64
Target: x86_64-gcc-static
FAILED: drivers/libtmp_rte_pmd_virtio.a.p/net_virtio_virtio_ethdev.c.o 
gcc -Idrivers/libtmp_rte_pmd_virtio.a.p -Idrivers -I../drivers -Idrivers/net/virtio -I../drivers/net/virtio -Ilib/librte_ethdev -I../lib/librte_ethdev -I. -I.. -Iconfig -I../config -Ilib/librte_eal/include -I../lib/librte_eal/include -Ilib/librte_eal/freebsd/include -I../lib/librte_eal/freebsd/include -Ilib/librte_eal/x86/include -I../lib/librte_eal/x86/include -Ilib/librte_eal/common -I../lib/librte_eal/common -Ilib/librte_eal -I../lib/librte_eal -Ilib/librte_kvargs -I../lib/librte_kvargs -Ilib/librte_metrics -I../lib/librte_metrics -Ilib/librte_telemetry -I../lib/librte_telemetry -Ilib/librte_net -I../lib/librte_net -Ilib/librte_mbuf -I../lib/librte_mbuf -Ilib/librte_mempool -I../lib/librte_mempool -Ilib/librte_ring -I../lib/librte_ring -Ilib/librte_meter -I../lib/librte_meter -Idrivers/bus/pci -I../drivers/bus/pci -I../drivers/bus/pci/bsd -Ilib/librte_pci -I../lib/librte_pci -Idrivers/bus/vdev -I../drivers/bus/vdev -fdiagnostics-color=always -pipe -D_FILE_OFFSET_BITS=64 -Wall -Winvalid-pch -Werror -O3 -include rte_config.h -Wextra -Wcast-qual -Wdeprecated -Wformat-nonliteral -Wformat-security -Wmissing-declarations -Wmissing-prototypes -Wnested-externs -Wold-style-definition -Wpointer-arith -Wsign-compare -Wstrict-prototypes -Wundef -Wwrite-strings -Wno-address-of-packed-member -Wno-packed-not-aligned -Wno-missing-field-initializers -D_GNU_SOURCE -D__BSD_VISIBLE -fPIC -march=native -mno-avx512f -DALLOW_EXPERIMENTAL_API -DALLOW_INTERNAL_API -Wno-format-truncation -MD -MQ drivers/libtmp_rte_pmd_virtio.a.p/net_virtio_virtio_ethdev.c.o -MF drivers/libtmp_rte_pmd_virtio.a.p/net_virtio_virtio_ethdev.c.o.d -o drivers/libtmp_rte_pmd_virtio.a.p/net_virtio_virtio_ethdev.c.o -c ../drivers/net/virtio/virtio_ethdev.c
In file included from ../drivers/net/virtio/virtio_ethdev.c:36:
../drivers/net/virtio/virtqueue.h:615:1: error: expected identifier or '(' before '}' token
  615 | } while (0)
      | ^
../drivers/net/virtio/virtqueue.h:615:3: error: expected identifier or '(' before 'while'
  615 | } while (0)
      |   ^~~~~
[1244/1923] Compiling C object drivers/libtmp_rte_pmd_virtio.a.p/net_virtio_virtio_pci.c.o
FAILED: drivers/libtmp_rte_pmd_virtio.a.p/net_virtio_virtio_pci.c.o 
gcc -Idrivers/libtmp_rte_pmd_virtio.a.p -Idrivers -I../drivers -Idrivers/net/virtio -I../drivers/net/virtio -Ilib/librte_ethdev -I../lib/librte_ethdev -I. -I.. -Iconfig -I../config -Ilib/librte_eal/include -I../lib/librte_eal/include -Ilib/librte_eal/freebsd/include -I../lib/librte_eal/freebsd/include -Ilib/librte_eal/x86/include -I../lib/librte_eal/x86/include -Ilib/librte_eal/common -I../lib/librte_eal/common -Ilib/librte_eal -I../lib/librte_eal -Ilib/librte_kvargs -I../lib/librte_kvargs -Ilib/librte_metrics -I../lib/librte_metrics -Ilib/librte_telemetry -I../lib/librte_telemetry -Ilib/librte_net -I../lib/librte_net -Ilib/librte_mbuf -I../lib/librte_mbuf -Ilib/librte_mempool -I../lib/librte_mempool -Ilib/librte_ring -I../lib/librte_ring -Ilib/librte_meter -I../lib/librte_meter -Idrivers/bus/pci -I../drivers/bus/pci -I../drivers/bus/pci/bsd -Ilib/librte_pci -I../lib/librte_pci -Idrivers/bus/vdev -I../drivers/bus/vdev -fdiagnostics-color=always -pipe -D_FILE_OFFSET_BITS=64 -Wall -Winvalid-pch -Werror -O3 -include rte_config.h -Wextra -Wcast-qual -Wdeprecated -Wformat-nonliteral -Wformat-security -Wmissing-declarations -Wmissing-prototypes -Wnested-externs -Wold-style-definition -Wpointer-arith -Wsign-compare -Wstrict-prototypes -Wundef -Wwrite-strings -Wno-address-of-packed-member -Wno-packed-not-aligned -Wno-missing-field-initializers -D_GNU_SOURCE -D__BSD_VISIBLE -fPIC -march=native -mno-avx512f -DALLOW_EXPERIMENTAL_API -DALLOW_INTERNAL_API -Wno-format-truncation -MD -MQ drivers/libtmp_rte_pmd_virtio.a.p/net_virtio_virtio_pci.c.o -MF drivers/libtmp_rte_pmd_virtio.a.p/net_virtio_virtio_pci.c.o.d -o drivers/libtmp_rte_pmd_virtio.a.p/net_virtio_virtio_pci.c.o -c ../drivers/net/virtio/virtio_pci.c
In file included from ../drivers/net/virtio/virtio_pci.c:16:
../drivers/net/virtio/virtqueue.h:615:1: error: expected identifier or '(' before '}' token
  615 | } while (0)
      | ^
../drivers/net/virtio/virtqueue.h:615:3: error: expected identifier or '(' before 'while'
  615 | } while (0)
      |   ^~~~~
[1245/1923] Generating rte_pmd_sfc.pmd.c with a custom command
[1246/1923] Compiling C object drivers/libtmp_rte_pmd_thunderx.a.p/net_thunderx_nicvf_rxtx.c.o
[1247/1923] Compiling C object drivers/libtmp_rte_pmd_virtio.a.p/net_virtio_virtio_rxtx.c.o
FAILED: drivers/libtmp_rte_pmd_virtio.a.p/net_virtio_virtio_rxtx.c.o 
gcc -Idrivers/libtmp_rte_pmd_virtio.a.p -Idrivers -I../drivers -Idrivers/net/virtio -I../drivers/net/virtio -Ilib/librte_ethdev -I../lib/librte_ethdev -I. -I.. -Iconfig -I../config -Ilib/librte_eal/include -I../lib/librte_eal/include -Ilib/librte_eal/freebsd/include -I../lib/librte_eal/freebsd/include -Ilib/librte_eal/x86/include -I../lib/librte_eal/x86/include -Ilib/librte_eal/common -I../lib/librte_eal/common -Ilib/librte_eal -I../lib/librte_eal -Ilib/librte_kvargs -I../lib/librte_kvargs -Ilib/librte_metrics -I../lib/librte_metrics -Ilib/librte_telemetry -I../lib/librte_telemetry -Ilib/librte_net -I../lib/librte_net -Ilib/librte_mbuf -I../lib/librte_mbuf -Ilib/librte_mempool -I../lib/librte_mempool -Ilib/librte_ring -I../lib/librte_ring -Ilib/librte_meter -I../lib/librte_meter -Idrivers/bus/pci -I../drivers/bus/pci -I../drivers/bus/pci/bsd -Ilib/librte_pci -I../lib/librte_pci -Idrivers/bus/vdev -I../drivers/bus/vdev -fdiagnostics-color=always -pipe -D_FILE_OFFSET_BITS=64 -Wall -Winvalid-pch -Werror -O3 -include rte_config.h -Wextra -Wcast-qual -Wdeprecated -Wformat-nonliteral -Wformat-security -Wmissing-declarations -Wmissing-prototypes -Wnested-externs -Wold-style-definition -Wpointer-arith -Wsign-compare -Wstrict-prototypes -Wundef -Wwrite-strings -Wno-address-of-packed-member -Wno-packed-not-aligned -Wno-missing-field-initializers -D_GNU_SOURCE -D__BSD_VISIBLE -fPIC -march=native -mno-avx512f -DALLOW_EXPERIMENTAL_API -DALLOW_INTERNAL_API -Wno-format-truncation -MD -MQ drivers/libtmp_rte_pmd_virtio.a.p/net_virtio_virtio_rxtx.c.o -MF drivers/libtmp_rte_pmd_virtio.a.p/net_virtio_virtio_rxtx.c.o.d -o drivers/libtmp_rte_pmd_virtio.a.p/net_virtio_virtio_rxtx.c.o -c ../drivers/net/virtio/virtio_rxtx.c
In file included from ../drivers/net/virtio/virtio_rxtx.c:31:
../drivers/net/virtio/virtqueue.h:615:1: error: expected identifier or '(' before '}' token
  615 | } while (0)
      | ^
../drivers/net/virtio/virtqueue.h:615:3: error: expected identifier or '(' before 'while'
  615 | } while (0)
      |   ^~~~~
[1248/1923] Compiling C object drivers/libtmp_rte_pmd_thunderx.a.p/net_thunderx_nicvf_ethdev.c.o
ninja: build stopped: subcommand failed




*Build Failed #10:
OS: FreeBSD1201-64
Target: x86_64-clang-static
FAILED: drivers/libtmp_rte_pmd_virtio.a.p/net_virtio_virtio_rxtx.c.o 
clang -Idrivers/libtmp_rte_pmd_virtio.a.p -Idrivers -I../drivers -Idrivers/net/virtio -I../drivers/net/virtio -Ilib/librte_ethdev -I../lib/librte_ethdev -I. -I.. -Iconfig -I../config -Ilib/librte_eal/include -I../lib/librte_eal/include -Ilib/librte_eal/freebsd/include -I../lib/librte_eal/freebsd/include -Ilib/librte_eal/x86/include -I../lib/librte_eal/x86/include -Ilib/librte_eal/common -I../lib/librte_eal/common -Ilib/librte_eal -I../lib/librte_eal -Ilib/librte_kvargs -I../lib/librte_kvargs -Ilib/librte_metrics -I../lib/librte_metrics -Ilib/librte_telemetry -I../lib/librte_telemetry -Ilib/librte_net -I../lib/librte_net -Ilib/librte_mbuf -I../lib/librte_mbuf -Ilib/librte_mempool -I../lib/librte_mempool -Ilib/librte_ring -I../lib/librte_ring -Ilib/librte_meter -I../lib/librte_meter -Idrivers/bus/pci -I../drivers/bus/pci -I../drivers/bus/pci/bsd -Ilib/librte_pci -I../lib/librte_pci -Idrivers/bus/vdev -I../drivers/bus/vdev -Xclang -fcolor-diagnostics -pipe -D_FILE_OFFSET_BITS=64 -Wall -Winvalid-pch -Werror -O3 -include rte_config.h -Wextra -Wcast-qual -Wdeprecated -Wformat-nonliteral -Wformat-security -Wmissing-declarations -Wmissing-prototypes -Wnested-externs -Wold-style-definition -Wpointer-arith -Wsign-compare -Wstrict-prototypes -Wundef -Wwrite-strings -Wno-address-of-packed-member -Wno-missing-field-initializers -D_GNU_SOURCE -D__BSD_VISIBLE -fPIC -march=native -mno-avx512f -DALLOW_EXPERIMENTAL_API -DALLOW_INTERNAL_API -MD -MQ drivers/libtmp_rte_pmd_virtio.a.p/net_virtio_virtio_rxtx.c.o -MF drivers/libtmp_rte_pmd_virtio.a.p/net_virtio_virtio_rxtx.c.o.d -o drivers/libtmp_rte_pmd_virtio.a.p/net_virtio_virtio_rxtx.c.o -c ../drivers/net/virtio/virtio_rxtx.c
In file included from ../drivers/net/virtio/virtio_rxtx.c:31:
../drivers/net/virtio/virtqueue.h:615:1: error: extraneous closing brace ('}')
} while (0)
^
../drivers/net/virtio/virtqueue.h:615:3: error: expected identifier or '('
} while (0)
  ^
2 errors generated.
[1244/1923] Compiling C object drivers/libtmp_rte_pmd_virtio.a.p/net_virtio_virtio_ethdev.c.o
FAILED: drivers/libtmp_rte_pmd_virtio.a.p/net_virtio_virtio_ethdev.c.o 
clang -Idrivers/libtmp_rte_pmd_virtio.a.p -Idrivers -I../drivers -Idrivers/net/virtio -I../drivers/net/virtio -Ilib/librte_ethdev -I../lib/librte_ethdev -I. -I.. -Iconfig -I../config -Ilib/librte_eal/include -I../lib/librte_eal/include -Ilib/librte_eal/freebsd/include -I../lib/librte_eal/freebsd/include -Ilib/librte_eal/x86/include -I../lib/librte_eal/x86/include -Ilib/librte_eal/common -I../lib/librte_eal/common -Ilib/librte_eal -I../lib/librte_eal -Ilib/librte_kvargs -I../lib/librte_kvargs -Ilib/librte_metrics -I../lib/librte_metrics -Ilib/librte_telemetry -I../lib/librte_telemetry -Ilib/librte_net -I../lib/librte_net -Ilib/librte_mbuf -I../lib/librte_mbuf -Ilib/librte_mempool -I../lib/librte_mempool -Ilib/librte_ring -I../lib/librte_ring -Ilib/librte_meter -I../lib/librte_meter -Idrivers/bus/pci -I../drivers/bus/pci -I../drivers/bus/pci/bsd -Ilib/librte_pci -I../lib/librte_pci -Idrivers/bus/vdev -I../drivers/bus/vdev -Xclang -fcolor-diagnostics -pipe -D_FILE_OFFSET_BITS=64 -Wall -Winvalid-pch -Werror -O3 -include rte_config.h -Wextra -Wcast-qual -Wdeprecated -Wformat-nonliteral -Wformat-security -Wmissing-declarations -Wmissing-prototypes -Wnested-externs -Wold-style-definition -Wpointer-arith -Wsign-compare -Wstrict-prototypes -Wundef -Wwrite-strings -Wno-address-of-packed-member -Wno-missing-field-initializers -D_GNU_SOURCE -D__BSD_VISIBLE -fPIC -march=native -mno-avx512f -DALLOW_EXPERIMENTAL_API -DALLOW_INTERNAL_API -MD -MQ drivers/libtmp_rte_pmd_virtio.a.p/net_virtio_virtio_ethdev.c.o -MF drivers/libtmp_rte_pmd_virtio.a.p/net_virtio_virtio_ethdev.c.o.d -o drivers/libtmp_rte_pmd_virtio.a.p/net_virtio_virtio_ethdev.c.o -c ../drivers/net/virtio/virtio_ethdev.c
In file included from ../drivers/net/virtio/virtio_ethdev.c:36:
../drivers/net/virtio/virtqueue.h:615:1: error: extraneous closing brace ('}')
} while (0)
^
../drivers/net/virtio/virtqueue.h:615:3: error: expected identifier or '('
} while (0)
  ^
2 errors generated.
[1245/1923] Generating rte_pmd_sfc.pmd.c with a custom command
[1246/1923] Compiling C object drivers/libtmp_rte_pmd_thunderx.a.p/net_thunderx_nicvf_rxtx.c.o
[1247/1923] Compiling C object drivers/libtmp_rte_pmd_virtio.a.p/net_virtio_virtio_pci.c.o
FAILED: drivers/libtmp_rte_pmd_virtio.a.p/net_virtio_virtio_pci.c.o 
clang -Idrivers/libtmp_rte_pmd_virtio.a.p -Idrivers -I../drivers -Idrivers/net/virtio -I../drivers/net/virtio -Ilib/librte_ethdev -I../lib/librte_ethdev -I. -I.. -Iconfig -I../config -Ilib/librte_eal/include -I../lib/librte_eal/include -Ilib/librte_eal/freebsd/include -I../lib/librte_eal/freebsd/include -Ilib/librte_eal/x86/include -I../lib/librte_eal/x86/include -Ilib/librte_eal/common -I../lib/librte_eal/common -Ilib/librte_eal -I../lib/librte_eal -Ilib/librte_kvargs -I../lib/librte_kvargs -Ilib/librte_metrics -I../lib/librte_metrics -Ilib/librte_telemetry -I../lib/librte_telemetry -Ilib/librte_net -I../lib/librte_net -Ilib/librte_mbuf -I../lib/librte_mbuf -Ilib/librte_mempool -I../lib/librte_mempool -Ilib/librte_ring -I../lib/librte_ring -Ilib/librte_meter -I../lib/librte_meter -Idrivers/bus/pci -I../drivers/bus/pci -I../drivers/bus/pci/bsd -Ilib/librte_pci -I../lib/librte_pci -Idrivers/bus/vdev -I../drivers/bus/vdev -Xclang -fcolor-diagnostics -pipe -D_FILE_OFFSET_BITS=64 -Wall -Winvalid-pch -Werror -O3 -include rte_config.h -Wextra -Wcast-qual -Wdeprecated -Wformat-nonliteral -Wformat-security -Wmissing-declarations -Wmissing-prototypes -Wnested-externs -Wold-style-definition -Wpointer-arith -Wsign-compare -Wstrict-prototypes -Wundef -Wwrite-strings -Wno-address-of-packed-member -Wno-missing-field-initializers -D_GNU_SOURCE -D__BSD_VISIBLE -fPIC -march=native -mno-avx512f -DALLOW_EXPERIMENTAL_API -DALLOW_INTERNAL_API -MD -MQ drivers/libtmp_rte_pmd_virtio.a.p/net_virtio_virtio_pci.c.o -MF drivers/libtmp_rte_pmd_virtio.a.p/net_virtio_virtio_pci.c.o.d -o drivers/libtmp_rte_pmd_virtio.a.p/net_virtio_virtio_pci.c.o -c ../drivers/net/virtio/virtio_pci.c
In file included from ../drivers/net/virtio/virtio_pci.c:16:
../drivers/net/virtio/virtqueue.h:615:1: error: extraneous closing brace ('}')
} while (0)
^
../drivers/net/virtio/virtqueue.h:615:3: error: expected identifier or '('
} while (0)
  ^
2 errors generated.
[1248/1923] Compiling C object drivers/libtmp_rte_pmd_thunderx.a.p/net_thunderx_nicvf_ethdev.c.o
ninja: build stopped: subcommand failed




*Build Failed #11:
OS: FreeBSD1201-64
Target: x86_64-gcc-shared
FAILED: drivers/libtmp_rte_pmd_virtio.a.p/net_virtio_virtio_ethdev.c.o 
gcc -Idrivers/libtmp_rte_pmd_virtio.a.p -Idrivers -I../drivers -Idrivers/net/virtio -I../drivers/net/virtio -Ilib/librte_ethdev -I../lib/librte_ethdev -I. -I.. -Iconfig -I../config -Ilib/librte_eal/include -I../lib/librte_eal/include -Ilib/librte_eal/freebsd/include -I../lib/librte_eal/freebsd/include -Ilib/librte_eal/x86/include -I../lib/librte_eal/x86/include -Ilib/librte_eal/common -I../lib/librte_eal/common -Ilib/librte_eal -I../lib/librte_eal -Ilib/librte_kvargs -I../lib/librte_kvargs -Ilib/librte_metrics -I../lib/librte_metrics -Ilib/librte_telemetry -I../lib/librte_telemetry -Ilib/librte_net -I../lib/librte_net -Ilib/librte_mbuf -I../lib/librte_mbuf -Ilib/librte_mempool -I../lib/librte_mempool -Ilib/librte_ring -I../lib/librte_ring -Ilib/librte_meter -I../lib/librte_meter -Idrivers/bus/pci -I../drivers/bus/pci -I../drivers/bus/pci/bsd -Ilib/librte_pci -I../lib/librte_pci -Idrivers/bus/vdev -I../drivers/bus/vdev -fdiagnostics-color=always -pipe -D_FILE_OFFSET_BITS=64 -Wall -Winvalid-pch -Werror -O3 -include rte_config.h -Wextra -Wcast-qual -Wdeprecated -Wformat-nonliteral -Wformat-security -Wmissing-declarations -Wmissing-prototypes -Wnested-externs -Wold-style-definition -Wpointer-arith -Wsign-compare -Wstrict-prototypes -Wundef -Wwrite-strings -Wno-address-of-packed-member -Wno-packed-not-aligned -Wno-missing-field-initializers -D_GNU_SOURCE -D__BSD_VISIBLE -fPIC -march=native -mno-avx512f -DALLOW_EXPERIMENTAL_API -DALLOW_INTERNAL_API -Wno-format-truncation -MD -MQ drivers/libtmp_rte_pmd_virtio.a.p/net_virtio_virtio_ethdev.c.o -MF drivers/libtmp_rte_pmd_virtio.a.p/net_virtio_virtio_ethdev.c.o.d -o drivers/libtmp_rte_pmd_virtio.a.p/net_virtio_virtio_ethdev.c.o -c ../drivers/net/virtio/virtio_ethdev.c
In file included from ../drivers/net/virtio/virtio_ethdev.c:36:
../drivers/net/virtio/virtqueue.h:615:1: error: expected identifier or '(' before '}' token
  615 | } while (0)
      | ^
../drivers/net/virtio/virtqueue.h:615:3: error: expected identifier or '(' before 'while'
  615 | } while (0)
      |   ^~~~~
[1269/1952] Compiling C object drivers/libtmp_rte_pmd_thunderx.a.p/net_thunderx_nicvf_rxtx.c.o
[1270/1952] Generating rte_pmd_sfc.pmd.c with a custom command
[1271/1952] Compiling C object drivers/libtmp_rte_pmd_virtio.a.p/net_virtio_virtio_rxtx.c.o
FAILED: drivers/libtmp_rte_pmd_virtio.a.p/net_virtio_virtio_rxtx.c.o 
gcc -Idrivers/libtmp_rte_pmd_virtio.a.p -Idrivers -I../drivers -Idrivers/net/virtio -I../drivers/net/virtio -Ilib/librte_ethdev -I../lib/librte_ethdev -I. -I.. -Iconfig -I../config -Ilib/librte_eal/include -I../lib/librte_eal/include -Ilib/librte_eal/freebsd/include -I../lib/librte_eal/freebsd/include -Ilib/librte_eal/x86/include -I../lib/librte_eal/x86/include -Ilib/librte_eal/common -I../lib/librte_eal/common -Ilib/librte_eal -I../lib/librte_eal -Ilib/librte_kvargs -I../lib/librte_kvargs -Ilib/librte_metrics -I../lib/librte_metrics -Ilib/librte_telemetry -I../lib/librte_telemetry -Ilib/librte_net -I../lib/librte_net -Ilib/librte_mbuf -I../lib/librte_mbuf -Ilib/librte_mempool -I../lib/librte_mempool -Ilib/librte_ring -I../lib/librte_ring -Ilib/librte_meter -I../lib/librte_meter -Idrivers/bus/pci -I../drivers/bus/pci -I../drivers/bus/pci/bsd -Ilib/librte_pci -I../lib/librte_pci -Idrivers/bus/vdev -I../drivers/bus/vdev -fdiagnostics-color=always -pipe -D_FILE_OFFSET_BITS=64 -Wall -Winvalid-pch -Werror -O3 -include rte_config.h -Wextra -Wcast-qual -Wdeprecated -Wformat-nonliteral -Wformat-security -Wmissing-declarations -Wmissing-prototypes -Wnested-externs -Wold-style-definition -Wpointer-arith -Wsign-compare -Wstrict-prototypes -Wundef -Wwrite-strings -Wno-address-of-packed-member -Wno-packed-not-aligned -Wno-missing-field-initializers -D_GNU_SOURCE -D__BSD_VISIBLE -fPIC -march=native -mno-avx512f -DALLOW_EXPERIMENTAL_API -DALLOW_INTERNAL_API -Wno-format-truncation -MD -MQ drivers/libtmp_rte_pmd_virtio.a.p/net_virtio_virtio_rxtx.c.o -MF drivers/libtmp_rte_pmd_virtio.a.p/net_virtio_virtio_rxtx.c.o.d -o drivers/libtmp_rte_pmd_virtio.a.p/net_virtio_virtio_rxtx.c.o -c ../drivers/net/virtio/virtio_rxtx.c
In file included from ../drivers/net/virtio/virtio_rxtx.c:31:
../drivers/net/virtio/virtqueue.h:615:1: error: expected identifier or '(' before '}' token
  615 | } while (0)
      | ^
../drivers/net/virtio/virtqueue.h:615:3: error: expected identifier or '(' before 'while'
  615 | } while (0)
      |   ^~~~~
[1272/1952] Compiling C object drivers/libtmp_rte_pmd_virtio.a.p/net_virtio_virtio_pci.c.o
FAILED: drivers/libtmp_rte_pmd_virtio.a.p/net_virtio_virtio_pci.c.o 
gcc -Idrivers/libtmp_rte_pmd_virtio.a.p -Idrivers -I../drivers -Idrivers/net/virtio -I../drivers/net/virtio -Ilib/librte_ethdev -I../lib/librte_ethdev -I. -I.. -Iconfig -I../config -Ilib/librte_eal/include -I../lib/librte_eal/include -Ilib/librte_eal/freebsd/include -I../lib/librte_eal/freebsd/include -Ilib/librte_eal/x86/include -I../lib/librte_eal/x86/include -Ilib/librte_eal/common -I../lib/librte_eal/common -Ilib/librte_eal -I../lib/librte_eal -Ilib/librte_kvargs -I../lib/librte_kvargs -Ilib/librte_metrics -I../lib/librte_metrics -Ilib/librte_telemetry -I../lib/librte_telemetry -Ilib/librte_net -I../lib/librte_net -Ilib/librte_mbuf -I../lib/librte_mbuf -Ilib/librte_mempool -I../lib/librte_mempool -Ilib/librte_ring -I../lib/librte_ring -Ilib/librte_meter -I../lib/librte_meter -Idrivers/bus/pci -I../drivers/bus/pci -I../drivers/bus/pci/bsd -Ilib/librte_pci -I../lib/librte_pci -Idrivers/bus/vdev -I../drivers/bus/vdev -fdiagnostics-color=always -pipe -D_FILE_OFFSET_BITS=64 -Wall -Winvalid-pch -Werror -O3 -include rte_config.h -Wextra -Wcast-qual -Wdeprecated -Wformat-nonliteral -Wformat-security -Wmissing-declarations -Wmissing-prototypes -Wnested-externs -Wold-style-definition -Wpointer-arith -Wsign-compare -Wstrict-prototypes -Wundef -Wwrite-strings -Wno-address-of-packed-member -Wno-packed-not-aligned -Wno-missing-field-initializers -D_GNU_SOURCE -D__BSD_VISIBLE -fPIC -march=native -mno-avx512f -DALLOW_EXPERIMENTAL_API -DALLOW_INTERNAL_API -Wno-format-truncation -MD -MQ drivers/libtmp_rte_pmd_virtio.a.p/net_virtio_virtio_pci.c.o -MF drivers/libtmp_rte_pmd_virtio.a.p/net_virtio_virtio_pci.c.o.d -o drivers/libtmp_rte_pmd_virtio.a.p/net_virtio_virtio_pci.c.o -c ../drivers/net/virtio/virtio_pci.c
In file included from ../drivers/net/virtio/virtio_pci.c:16:
../drivers/net/virtio/virtqueue.h:615:1: error: expected identifier or '(' before '}' token
  615 | } while (0)
      | ^
../drivers/net/virtio/virtqueue.h:615:3: error: expected identifier or '(' before 'while'
  615 | } while (0)
      |   ^~~~~
[1273/1952] Compiling C object drivers/libtmp_rte_pmd_thunderx.a.p/net_thunderx_nicvf_ethdev.c.o
ninja: build stopped: subcommand failed




*Build Failed #12:
OS: FreeBSD1201-64
Target: x86_64-gcc-debug
FAILED: drivers/libtmp_rte_pmd_virtio.a.p/net_virtio_virtio_rxtx.c.o 
gcc -Idrivers/libtmp_rte_pmd_virtio.a.p -Idrivers -I../drivers -Idrivers/net/virtio -I../drivers/net/virtio -Ilib/librte_ethdev -I../lib/librte_ethdev -I. -I.. -Iconfig -I../config -Ilib/librte_eal/include -I../lib/librte_eal/include -Ilib/librte_eal/freebsd/include -I../lib/librte_eal/freebsd/include -Ilib/librte_eal/x86/include -I../lib/librte_eal/x86/include -Ilib/librte_eal/common -I../lib/librte_eal/common -Ilib/librte_eal -I../lib/librte_eal -Ilib/librte_kvargs -I../lib/librte_kvargs -Ilib/librte_metrics -I../lib/librte_metrics -Ilib/librte_telemetry -I../lib/librte_telemetry -Ilib/librte_net -I../lib/librte_net -Ilib/librte_mbuf -I../lib/librte_mbuf -Ilib/librte_mempool -I../lib/librte_mempool -Ilib/librte_ring -I../lib/librte_ring -Ilib/librte_meter -I../lib/librte_meter -Idrivers/bus/pci -I../drivers/bus/pci -I../drivers/bus/pci/bsd -Ilib/librte_pci -I../lib/librte_pci -Idrivers/bus/vdev -I../drivers/bus/vdev -fdiagnostics-color=always -pipe -D_FILE_OFFSET_BITS=64 -Wall -Winvalid-pch -Werror -O2 -g -include rte_config.h -Wextra -Wcast-qual -Wdeprecated -Wformat-nonliteral -Wformat-security -Wmissing-declarations -Wmissing-prototypes -Wnested-externs -Wold-style-definition -Wpointer-arith -Wsign-compare -Wstrict-prototypes -Wundef -Wwrite-strings -Wno-address-of-packed-member -Wno-packed-not-aligned -Wno-missing-field-initializers -D_GNU_SOURCE -D__BSD_VISIBLE -fPIC -march=native -mno-avx512f -DALLOW_EXPERIMENTAL_API -DALLOW_INTERNAL_API -Wno-format-truncation -MD -MQ drivers/libtmp_rte_pmd_virtio.a.p/net_virtio_virtio_rxtx.c.o -MF drivers/libtmp_rte_pmd_virtio.a.p/net_virtio_virtio_rxtx.c.o.d -o drivers/libtmp_rte_pmd_virtio.a.p/net_virtio_virtio_rxtx.c.o -c ../drivers/net/virtio/virtio_rxtx.c
In file included from ../drivers/net/virtio/virtio_rxtx.c:31:
../drivers/net/virtio/virtqueue.h:615:1: error: expected identifier or '(' before '}' token
  615 | } while (0)
      | ^
../drivers/net/virtio/virtqueue.h:615:3: error: expected identifier or '(' before 'while'
  615 | } while (0)
      |   ^~~~~
[1245/1923] Compiling C object drivers/libtmp_rte_pmd_virtio.a.p/net_virtio_virtio_rxtx_simple.c.o
FAILED: drivers/libtmp_rte_pmd_virtio.a.p/net_virtio_virtio_rxtx_simple.c.o 
gcc -Idrivers/libtmp_rte_pmd_virtio.a.p -Idrivers -I../drivers -Idrivers/net/virtio -I../drivers/net/virtio -Ilib/librte_ethdev -I../lib/librte_ethdev -I. -I.. -Iconfig -I../config -Ilib/librte_eal/include -I../lib/librte_eal/include -Ilib/librte_eal/freebsd/include -I../lib/librte_eal/freebsd/include -Ilib/librte_eal/x86/include -I../lib/librte_eal/x86/include -Ilib/librte_eal/common -I../lib/librte_eal/common -Ilib/librte_eal -I../lib/librte_eal -Ilib/librte_kvargs -I../lib/librte_kvargs -Ilib/librte_metrics -I../lib/librte_metrics -Ilib/librte_telemetry -I../lib/librte_telemetry -Ilib/librte_net -I../lib/librte_net -Ilib/librte_mbuf -I../lib/librte_mbuf -Ilib/librte_mempool -I../lib/librte_mempool -Ilib/librte_ring -I../lib/librte_ring -Ilib/librte_meter -I../lib/librte_meter -Idrivers/bus/pci -I../drivers/bus/pci -I../drivers/bus/pci/bsd -Ilib/librte_pci -I../lib/librte_pci -Idrivers/bus/vdev -I../drivers/bus/vdev -fdiagnostics-color=always -pipe -D_FILE_OFFSET_BITS=64 -Wall -Winvalid-pch -Werror -O2 -g -include rte_config.h -Wextra -Wcast-qual -Wdeprecated -Wformat-nonliteral -Wformat-security -Wmissing-declarations -Wmissing-prototypes -Wnested-externs -Wold-style-definition -Wpointer-arith -Wsign-compare -Wstrict-prototypes -Wundef -Wwrite-strings -Wno-address-of-packed-member -Wno-packed-not-aligned -Wno-missing-field-initializers -D_GNU_SOURCE -D__BSD_VISIBLE -fPIC -march=native -mno-avx512f -DALLOW_EXPERIMENTAL_API -DALLOW_INTERNAL_API -Wno-format-truncation -MD -MQ drivers/libtmp_rte_pmd_virtio.a.p/net_virtio_virtio_rxtx_simple.c.o -MF drivers/libtmp_rte_pmd_virtio.a.p/net_virtio_virtio_rxtx_simple.c.o.d -o drivers/libtmp_rte_pmd_virtio.a.p/net_virtio_virtio_rxtx_simple.c.o -c ../drivers/net/virtio/virtio_rxtx_simple.c
In file included from ../drivers/net/virtio/virtio_rxtx_simple.h:12,
                 from ../drivers/net/virtio/virtio_rxtx_simple.c:24:
../drivers/net/virtio/virtqueue.h:615:1: error: expected identifier or '(' before '}' token
  615 | } while (0)
      | ^
../drivers/net/virtio/virtqueue.h:615:3: error: expected identifier or '(' before 'while'
  615 | } while (0)
      |   ^~~~~
[1246/1923] Generating rte_pmd_sfc.pmd.c with a custom command
[1247/1923] Compiling C object drivers/libtmp_rte_pmd_virtio.a.p/net_virtio_virtio_pci.c.o
FAILED: drivers/libtmp_rte_pmd_virtio.a.p/net_virtio_virtio_pci.c.o 
gcc -Idrivers/libtmp_rte_pmd_virtio.a.p -Idrivers -I../drivers -Idrivers/net/virtio -I../drivers/net/virtio -Ilib/librte_ethdev -I../lib/librte_ethdev -I. -I.. -Iconfig -I../config -Ilib/librte_eal/include -I../lib/librte_eal/include -Ilib/librte_eal/freebsd/include -I../lib/librte_eal/freebsd/include -Ilib/librte_eal/x86/include -I../lib/librte_eal/x86/include -Ilib/librte_eal/common -I../lib/librte_eal/common -Ilib/librte_eal -I../lib/librte_eal -Ilib/librte_kvargs -I../lib/librte_kvargs -Ilib/librte_metrics -I../lib/librte_metrics -Ilib/librte_telemetry -I../lib/librte_telemetry -Ilib/librte_net -I../lib/librte_net -Ilib/librte_mbuf -I../lib/librte_mbuf -Ilib/librte_mempool -I../lib/librte_mempool -Ilib/librte_ring -I../lib/librte_ring -Ilib/librte_meter -I../lib/librte_meter -Idrivers/bus/pci -I../drivers/bus/pci -I../drivers/bus/pci/bsd -Ilib/librte_pci -I../lib/librte_pci -Idrivers/bus/vdev -I../drivers/bus/vdev -fdiagnostics-color=always -pipe -D_FILE_OFFSET_BITS=64 -Wall -Winvalid-pch -Werror -O2 -g -include rte_config.h -Wextra -Wcast-qual -Wdeprecated -Wformat-nonliteral -Wformat-security -Wmissing-declarations -Wmissing-prototypes -Wnested-externs -Wold-style-definition -Wpointer-arith -Wsign-compare -Wstrict-prototypes -Wundef -Wwrite-strings -Wno-address-of-packed-member -Wno-packed-not-aligned -Wno-missing-field-initializers -D_GNU_SOURCE -D__BSD_VISIBLE -fPIC -march=native -mno-avx512f -DALLOW_EXPERIMENTAL_API -DALLOW_INTERNAL_API -Wno-format-truncation -MD -MQ drivers/libtmp_rte_pmd_virtio.a.p/net_virtio_virtio_pci.c.o -MF drivers/libtmp_rte_pmd_virtio.a.p/net_virtio_virtio_pci.c.o.d -o drivers/libtmp_rte_pmd_virtio.a.p/net_virtio_virtio_pci.c.o -c ../drivers/net/virtio/virtio_pci.c
In file included from ../drivers/net/virtio/virtio_pci.c:16:
../drivers/net/virtio/virtqueue.h:615:1: error: expected identifier or '(' before '}' token
  615 | } while (0)
      | ^
../drivers/net/virtio/virtqueue.h:615:3: error: expected identifier or '(' before 'while'
  615 | } while (0)
      |   ^~~~~
[1248/1923] Compiling C object drivers/libtmp_rte_pmd_virtio.a.p/net_virtio_virtio_ethdev.c.o
FAILED: drivers/libtmp_rte_pmd_virtio.a.p/net_virtio_virtio_ethdev.c.o 
gcc -Idrivers/libtmp_rte_pmd_virtio.a.p -Idrivers -I../drivers -Idrivers/net/virtio -I../drivers/net/virtio -Ilib/librte_ethdev -I../lib/librte_ethdev -I. -I.. -Iconfig -I../config -Ilib/librte_eal/include -I../lib/librte_eal/include -Ilib/librte_eal/freebsd/include -I../lib/librte_eal/freebsd/include -Ilib/librte_eal/x86/include -I../lib/librte_eal/x86/include -Ilib/librte_eal/common -I../lib/librte_eal/common -Ilib/librte_eal -I../lib/librte_eal -Ilib/librte_kvargs -I../lib/librte_kvargs -Ilib/librte_metrics -I../lib/librte_metrics -Ilib/librte_telemetry -I../lib/librte_telemetry -Ilib/librte_net -I../lib/librte_net -Ilib/librte_mbuf -I../lib/librte_mbuf -Ilib/librte_mempool -I../lib/librte_mempool -Ilib/librte_ring -I../lib/librte_ring -Ilib/librte_meter -I../lib/librte_meter -Idrivers/bus/pci -I../drivers/bus/pci -I../drivers/bus/pci/bsd -Ilib/librte_pci -I../lib/librte_pci -Idrivers/bus/vdev -I../drivers/bus/vdev -fdiagnostics-color=always -pipe -D_FILE_OFFSET_BITS=64 -Wall -Winvalid-pch -Werror -O2 -g -include rte_config.h -Wextra -Wcast-qual -Wdeprecated -Wformat-nonliteral -Wformat-security -Wmissing-declarations -Wmissing-prototypes -Wnested-externs -Wold-style-definition -Wpointer-arith -Wsign-compare -Wstrict-prototypes -Wundef -Wwrite-strings -Wno-address-of-packed-member -Wno-packed-not-aligned -Wno-missing-field-initializers -D_GNU_SOURCE -D__BSD_VISIBLE -fPIC -march=native -mno-avx512f -DALLOW_EXPERIMENTAL_API -DALLOW_INTERNAL_API -Wno-format-truncation -MD -MQ drivers/libtmp_rte_pmd_virtio.a.p/net_virtio_virtio_ethdev.c.o -MF drivers/libtmp_rte_pmd_virtio.a.p/net_virtio_virtio_ethdev.c.o.d -o drivers/libtmp_rte_pmd_virtio.a.p/net_virtio_virtio_ethdev.c.o -c ../drivers/net/virtio/virtio_ethdev.c
In file included from ../drivers/net/virtio/virtio_ethdev.c:36:
../drivers/net/virtio/virtqueue.h:615:1: error: expected identifier or '(' before '}' token
  615 | } while (0)
      | ^
../drivers/net/virtio/virtqueue.h:615:3: error: expected identifier or '(' before 'while'
  615 | } while (0)
      |   ^~~~~
[1249/1923] Compiling C object drivers/libtmp_rte_pmd_thunderx.a.p/net_thunderx_nicvf_ethdev.c.o
ninja: build stopped: subcommand failed




*Build Failed #13:
OS: RHEL82-64
Target: x86_64-gcc-static
FAILED: drivers/a715181@@tmp_rte_pmd_virtio@sta/net_virtio_virtio_pci.c.o 
gcc -Idrivers/a715181@@tmp_rte_pmd_virtio@sta -Idrivers -I../drivers -Idrivers/net/virtio -I../drivers/net/virtio -Ilib/librte_ethdev -I../lib/librte_ethdev -I. -I../ -Iconfig -I../config -Ilib/librte_eal/include -I../lib/librte_eal/include -Ilib/librte_eal/linux/include -I../lib/librte_eal/linux/include -Ilib/librte_eal/x86/include -I../lib/librte_eal/x86/include -Ilib/librte_eal/common -I../lib/librte_eal/common -Ilib/librte_eal -I../lib/librte_eal -Ilib/librte_kvargs -I../lib/librte_kvargs -Ilib/librte_telemetry/../librte_metrics -I../lib/librte_telemetry/../librte_metrics -Ilib/librte_telemetry -I../lib/librte_telemetry -Ilib/librte_net -I../lib/librte_net -Ilib/librte_mbuf -I../lib/librte_mbuf -Ilib/librte_mempool -I../lib/librte_mempool -Ilib/librte_ring -I../lib/librte_ring -Ilib/librte_meter -I../lib/librte_meter -Idrivers/bus/pci -I../drivers/bus/pci -I../drivers/bus/pci/linux -Ilib/librte_pci -I../lib/librte_pci -Idrivers/bus/vdev -I../drivers/bus/vdev -fdiagnostics-color=always -pipe -D_FILE_OFFSET_BITS=64 -Wall -Winvalid-pch -Werror -O3 -include rte_config.h -Wextra -Wcast-qual -Wdeprecated -Wformat-nonliteral -Wformat-security -Wmissing-declarations -Wmissing-prototypes -Wnested-externs -Wold-style-definition -Wpointer-arith -Wsign-compare -Wstrict-prototypes -Wundef -Wwrite-strings -Wno-packed-not-aligned -Wno-missing-field-initializers -D_GNU_SOURCE -fPIC -march=native -mno-avx512f -DALLOW_EXPERIMENTAL_API -DALLOW_INTERNAL_API -Wno-format-truncation -MD -MQ 'drivers/a715181@@tmp_rte_pmd_virtio@sta/net_virtio_virtio_pci.c.o' -MF 'drivers/a715181@@tmp_rte_pmd_virtio@sta/net_virtio_virtio_pci.c.o.d' -o 'drivers/a715181@@tmp_rte_pmd_virtio@sta/net_virtio_virtio_pci.c.o' -c ../drivers/net/virtio/virtio_pci.c
In file included from ../drivers/net/virtio/virtio_pci.c:16:
../drivers/net/virtio/virtqueue.h:615:1: error: expected identifier or ‘(’ before ‘}’ token
 } while (0)
 ^
../drivers/net/virtio/virtqueue.h:615:3: error: expected identifier or ‘(’ before ‘while’
 } while (0)
   ^~~~~
[1614/2582] Compiling C object 'drivers/a715181@@tmp_rte_pmd_vdev_netvsc@sta/net_vdev_netvsc_vdev_netvsc.c.o'.
[1615/2582] Compiling C object 'drivers/a715181@@tmp_rte_pmd_virtio@sta/net_virtio_virtio_ethdev.c.o'.
FAILED: drivers/a715181@@tmp_rte_pmd_virtio@sta/net_virtio_virtio_ethdev.c.o 
gcc -Idrivers/a715181@@tmp_rte_pmd_virtio@sta -Idrivers -I../drivers -Idrivers/net/virtio -I../drivers/net/virtio -Ilib/librte_ethdev -I../lib/librte_ethdev -I. -I../ -Iconfig -I../config -Ilib/librte_eal/include -I../lib/librte_eal/include -Ilib/librte_eal/linux/include -I../lib/librte_eal/linux/include -Ilib/librte_eal/x86/include -I../lib/librte_eal/x86/include -Ilib/librte_eal/common -I../lib/librte_eal/common -Ilib/librte_eal -I../lib/librte_eal -Ilib/librte_kvargs -I../lib/librte_kvargs -Ilib/librte_telemetry/../librte_metrics -I../lib/librte_telemetry/../librte_metrics -Ilib/librte_telemetry -I../lib/librte_telemetry -Ilib/librte_net -I../lib/librte_net -Ilib/librte_mbuf -I../lib/librte_mbuf -Ilib/librte_mempool -I../lib/librte_mempool -Ilib/librte_ring -I../lib/librte_ring -Ilib/librte_meter -I../lib/librte_meter -Idrivers/bus/pci -I../drivers/bus/pci -I../drivers/bus/pci/linux -Ilib/librte_pci -I../lib/librte_pci -Idrivers/bus/vdev -I../drivers/bus/vdev -fdiagnostics-color=always -pipe -D_FILE_OFFSET_BITS=64 -Wall -Winvalid-pch -Werror -O3 -include rte_config.h -Wextra -Wcast-qual -Wdeprecated -Wformat-nonliteral -Wformat-security -Wmissing-declarations -Wmissing-prototypes -Wnested-externs -Wold-style-definition -Wpointer-arith -Wsign-compare -Wstrict-prototypes -Wundef -Wwrite-strings -Wno-packed-not-aligned -Wno-missing-field-initializers -D_GNU_SOURCE -fPIC -march=native -mno-avx512f -DALLOW_EXPERIMENTAL_API -DALLOW_INTERNAL_API -Wno-format-truncation -MD -MQ 'drivers/a715181@@tmp_rte_pmd_virtio@sta/net_virtio_virtio_ethdev.c.o' -MF 'drivers/a715181@@tmp_rte_pmd_virtio@sta/net_virtio_virtio_ethdev.c.o.d' -o 'drivers/a715181@@tmp_rte_pmd_virtio@sta/net_virtio_virtio_ethdev.c.o' -c ../drivers/net/virtio/virtio_ethdev.c
In file included from ../drivers/net/virtio/virtio_ethdev.c:36:
../drivers/net/virtio/virtqueue.h:615:1: error: expected identifier or ‘(’ before ‘}’ token
 } while (0)
 ^
../drivers/net/virtio/virtqueue.h:615:3: error: expected identifier or ‘(’ before ‘while’
 } while (0)
   ^~~~~
[1616/2582] Generating rte_pmd_softnic.pmd.c with a custom command.
[1617/2582] Generating rte_pmd_sfc.sym_chk with a meson_exe.py custom command.
[1618/2582] Compiling C object 'drivers/a715181@@tmp_rte_pmd_virtio@sta/net_virtio_virtio_user_vhost_kernel_tap.c.o'.
[1619/2582] Compiling C object 'drivers/a715181@@tmp_rte_pmd_virtio@sta/net_virtio_virtio_rxtx.c.o'.
FAILED: drivers/a715181@@tmp_rte_pmd_virtio@sta/net_virtio_virtio_rxtx.c.o 
gcc -Idrivers/a715181@@tmp_rte_pmd_virtio@sta -Idrivers -I../drivers -Idrivers/net/virtio -I../drivers/net/virtio -Ilib/librte_ethdev -I../lib/librte_ethdev -I. -I../ -Iconfig -I../config -Ilib/librte_eal/include -I../lib/librte_eal/include -Ilib/librte_eal/linux/include -I../lib/librte_eal/linux/include -Ilib/librte_eal/x86/include -I../lib/librte_eal/x86/include -Ilib/librte_eal/common -I../lib/librte_eal/common -Ilib/librte_eal -I../lib/librte_eal -Ilib/librte_kvargs -I../lib/librte_kvargs -Ilib/librte_telemetry/../librte_metrics -I../lib/librte_telemetry/../librte_metrics -Ilib/librte_telemetry -I../lib/librte_telemetry -Ilib/librte_net -I../lib/librte_net -Ilib/librte_mbuf -I../lib/librte_mbuf -Ilib/librte_mempool -I../lib/librte_mempool -Ilib/librte_ring -I../lib/librte_ring -Ilib/librte_meter -I../lib/librte_meter -Idrivers/bus/pci -I../drivers/bus/pci -I../drivers/bus/pci/linux -Ilib/librte_pci -I../lib/librte_pci -Idrivers/bus/vdev -I../drivers/bus/vdev -fdiagnostics-color=always -pipe -D_FILE_OFFSET_BITS=64 -Wall -Winvalid-pch -Werror -O3 -include rte_config.h -Wextra -Wcast-qual -Wdeprecated -Wformat-nonliteral -Wformat-security -Wmissing-declarations -Wmissing-prototypes -Wnested-externs -Wold-style-definition -Wpointer-arith -Wsign-compare -Wstrict-prototypes -Wundef -Wwrite-strings -Wno-packed-not-aligned -Wno-missing-field-initializers -D_GNU_SOURCE -fPIC -march=native -mno-avx512f -DALLOW_EXPERIMENTAL_API -DALLOW_INTERNAL_API -Wno-format-truncation -MD -MQ 'drivers/a715181@@tmp_rte_pmd_virtio@sta/net_virtio_virtio_rxtx.c.o' -MF 'drivers/a715181@@tmp_rte_pmd_virtio@sta/net_virtio_virtio_rxtx.c.o.d' -o 'drivers/a715181@@tmp_rte_pmd_virtio@sta/net_virtio_virtio_rxtx.c.o' -c ../drivers/net/virtio/virtio_rxtx.c
In file included from ../drivers/net/virtio/virtio_rxtx.c:31:
../drivers/net/virtio/virtqueue.h:615:1: error: expected identifier or ‘(’ before ‘}’ token
 } while (0)
 ^
../drivers/net/virtio/virtqueue.h:615:3: error: expected identifier or ‘(’ before ‘while’
 } while (0)
   ^~~~~
[1620/2582] Compiling C object 'drivers/a715181@@tmp_rte_pmd_vhost@sta/net_vhost_rte_eth_vhost.c.o'.
[1621/2582] Compiling C object 'drivers/a715181@@tmp_rte_pmd_tap@sta/net_tap_rte_eth_tap.c.o'.
[1622/2582] Compiling C object 'drivers/a715181@@tmp_rte_pmd_thunderx@sta/net_thunderx_nicvf_ethdev.c.o'.
ninja: build stopped: subcommand failed




*Build Failed #14:
OS: SUSE15-64
Target: x86_64-clang-static
FAILED: drivers/libtmp_rte_pmd_virtio.a.p/net_virtio_virtio_pci.c.o 
clang -Idrivers/libtmp_rte_pmd_virtio.a.p -Idrivers -I../drivers -Idrivers/net/virtio -I../drivers/net/virtio -Ilib/librte_ethdev -I../lib/librte_ethdev -I. -I.. -Iconfig -I../config -Ilib/librte_eal/include -I../lib/librte_eal/include -Ilib/librte_eal/linux/include -I../lib/librte_eal/linux/include -Ilib/librte_eal/x86/include -I../lib/librte_eal/x86/include -Ilib/librte_eal/common -I../lib/librte_eal/common -Ilib/librte_eal -I../lib/librte_eal -Ilib/librte_kvargs -I../lib/librte_kvargs -Ilib/librte_metrics -I../lib/librte_metrics -Ilib/librte_telemetry -I../lib/librte_telemetry -Ilib/librte_net -I../lib/librte_net -Ilib/librte_mbuf -I../lib/librte_mbuf -Ilib/librte_mempool -I../lib/librte_mempool -Ilib/librte_ring -I../lib/librte_ring -Ilib/librte_meter -I../lib/librte_meter -Idrivers/bus/pci -I../drivers/bus/pci -I../drivers/bus/pci/linux -Ilib/librte_pci -I../lib/librte_pci -Idrivers/bus/vdev -I../drivers/bus/vdev -Xclang -fcolor-diagnostics -pipe -D_FILE_OFFSET_BITS=64 -Wall -Winvalid-pch -Werror -O3 -include rte_config.h -Wextra -Wcast-qual -Wdeprecated -Wformat-nonliteral -Wformat-security -Wmissing-declarations -Wmissing-prototypes -Wnested-externs -Wold-style-definition -Wpointer-arith -Wsign-compare -Wstrict-prototypes -Wundef -Wwrite-strings -Wno-address-of-packed-member -Wno-missing-field-initializers -D_GNU_SOURCE -fPIC -march=native -DALLOW_EXPERIMENTAL_API -DALLOW_INTERNAL_API -DCC_AVX512_SUPPORT -DVHOST_CLANG_UNROLL_PRAGMA -MD -MQ drivers/libtmp_rte_pmd_virtio.a.p/net_virtio_virtio_pci.c.o -MF drivers/libtmp_rte_pmd_virtio.a.p/net_virtio_virtio_pci.c.o.d -o drivers/libtmp_rte_pmd_virtio.a.p/net_virtio_virtio_pci.c.o -c ../drivers/net/virtio/virtio_pci.c
In file included from ../drivers/net/virtio/virtio_pci.c:16:
../drivers/net/virtio/virtqueue.h:615:1: error: extraneous closing brace ('}')
} while (0)
^
../drivers/net/virtio/virtqueue.h:615:3: error: expected identifier or '('
} while (0)
  ^
2 errors generated.
[1621/2551] Generating rte_pmd_softnic.pmd.c with a custom command
[1622/2551] Compiling C object drivers/librte_pmd_vdev_netvsc.a.p/meson-generated_.._rte_pmd_vdev_netvsc.pmd.c.o
[1623/2551] Compiling C object drivers/libtmp_rte_pmd_thunderx.a.p/net_thunderx_nicvf_ethdev.c.o
[1624/2551] Compiling C object drivers/net/virtio/libvirtio_avx512_lib.a.p/virtio_rxtx_packed_avx.c.o
FAILED: drivers/net/virtio/libvirtio_avx512_lib.a.p/virtio_rxtx_packed_avx.c.o 
clang -Idrivers/net/virtio/libvirtio_avx512_lib.a.p -Idrivers/net/virtio -I../drivers/net/virtio -Ilib/librte_ethdev -I../lib/librte_ethdev -I. -I.. -Iconfig -I../config -Ilib/librte_eal/include -I../lib/librte_eal/include -Ilib/librte_eal/linux/include -I../lib/librte_eal/linux/include -Ilib/librte_eal/x86/include -I../lib/librte_eal/x86/include -Ilib/librte_eal/common -I../lib/librte_eal/common -Ilib/librte_eal -I../lib/librte_eal -Ilib/librte_kvargs -I../lib/librte_kvargs -Ilib/librte_metrics -I../lib/librte_metrics -Ilib/librte_telemetry -I../lib/librte_telemetry -Ilib/librte_net -I../lib/librte_net -Ilib/librte_mbuf -I../lib/librte_mbuf -Ilib/librte_mempool -I../lib/librte_mempool -Ilib/librte_ring -I../lib/librte_ring -Ilib/librte_meter -I../lib/librte_meter -Idrivers/bus/pci -I../drivers/bus/pci -I../drivers/bus/pci/linux -Ilib/librte_pci -I../lib/librte_pci -Xclang -fcolor-diagnostics -pipe -D_FILE_OFFSET_BITS=64 -Wall -Winvalid-pch -Werror -O3 -include rte_config.h -Wextra -Wcast-qual -Wdeprecated -Wformat-nonliteral -Wformat-security -Wmissing-declarations -Wmissing-prototypes -Wnested-externs -Wold-style-definition -Wpointer-arith -Wsign-compare -Wstrict-prototypes -Wundef -Wwrite-strings -Wno-address-of-packed-member -Wno-missing-field-initializers -D_GNU_SOURCE -fPIC -march=native -DALLOW_EXPERIMENTAL_API -DALLOW_INTERNAL_API -DCC_AVX512_SUPPORT -mavx512f -mavx512bw -mavx512vl -MD -MQ drivers/net/virtio/libvirtio_avx512_lib.a.p/virtio_rxtx_packed_avx.c.o -MF drivers/net/virtio/libvirtio_avx512_lib.a.p/virtio_rxtx_packed_avx.c.o.d -o drivers/net/virtio/libvirtio_avx512_lib.a.p/virtio_rxtx_packed_avx.c.o -c ../drivers/net/virtio/virtio_rxtx_packed_avx.c
In file included from ../drivers/net/virtio/virtio_rxtx_packed_avx.c:16:
../drivers/net/virtio/virtqueue.h:615:1: error: extraneous closing brace ('}')
} while (0)
^
../drivers/net/virtio/virtqueue.h:615:3: error: expected identifier or '('
} while (0)
  ^
2 errors generated.
[1625/2551] Compiling C object drivers/libtmp_rte_pmd_virtio.a.p/net_virtio_virtio_ethdev.c.o
FAILED: drivers/libtmp_rte_pmd_virtio.a.p/net_virtio_virtio_ethdev.c.o 
clang -Idrivers/libtmp_rte_pmd_virtio.a.p -Idrivers -I../drivers -Idrivers/net/virtio -I../drivers/net/virtio -Ilib/librte_ethdev -I../lib/librte_ethdev -I. -I.. -Iconfig -I../config -Ilib/librte_eal/include -I../lib/librte_eal/include -Ilib/librte_eal/linux/include -I../lib/librte_eal/linux/include -Ilib/librte_eal/x86/include -I../lib/librte_eal/x86/include -Ilib/librte_eal/common -I../lib/librte_eal/common -Ilib/librte_eal -I../lib/librte_eal -Ilib/librte_kvargs -I../lib/librte_kvargs -Ilib/librte_metrics -I../lib/librte_metrics -Ilib/librte_telemetry -I../lib/librte_telemetry -Ilib/librte_net -I../lib/librte_net -Ilib/librte_mbuf -I../lib/librte_mbuf -Ilib/librte_mempool -I../lib/librte_mempool -Ilib/librte_ring -I../lib/librte_ring -Ilib/librte_meter -I../lib/librte_meter -Idrivers/bus/pci -I../drivers/bus/pci -I../drivers/bus/pci/linux -Ilib/librte_pci -I../lib/librte_pci -Idrivers/bus/vdev -I../drivers/bus/vdev -Xclang -fcolor-diagnostics -pipe -D_FILE_OFFSET_BITS=64 -Wall -Winvalid-pch -Werror -O3 -include rte_config.h -Wextra -Wcast-qual -Wdeprecated -Wformat-nonliteral -Wformat-security -Wmissing-declarations -Wmissing-prototypes -Wnested-externs -Wold-style-definition -Wpointer-arith -Wsign-compare -Wstrict-prototypes -Wundef -Wwrite-strings -Wno-address-of-packed-member -Wno-missing-field-initializers -D_GNU_SOURCE -fPIC -march=native -DALLOW_EXPERIMENTAL_API -DALLOW_INTERNAL_API -DCC_AVX512_SUPPORT -DVHOST_CLANG_UNROLL_PRAGMA -MD -MQ drivers/libtmp_rte_pmd_virtio.a.p/net_virtio_virtio_ethdev.c.o -MF drivers/libtmp_rte_pmd_virtio.a.p/net_virtio_virtio_ethdev.c.o.d -o drivers/libtmp_rte_pmd_virtio.a.p/net_virtio_virtio_ethdev.c.o -c ../drivers/net/virtio/virtio_ethdev.c
In file included from ../drivers/net/virtio/virtio_ethdev.c:36:
../drivers/net/virtio/virtqueue.h:615:1: error: extraneous closing brace ('}')
} while (0)
^
../drivers/net/virtio/virtqueue.h:615:3: error: expected identifier or '('
} while (0)
  ^
2 errors generated.
[1626/2551] Compiling C object drivers/libtmp_rte_pmd_vhost.a.p/net_vhost_rte_eth_vhost.c.o
[1627/2551] Compiling C object drivers/libtmp_rte_pmd_virtio.a.p/net_virtio_virtio_rxtx.c.o
FAILED: drivers/libtmp_rte_pmd_virtio.a.p/net_virtio_virtio_rxtx.c.o 
clang -Idrivers/libtmp_rte_pmd_virtio.a.p -Idrivers -I../drivers -Idrivers/net/virtio -I../drivers/net/virtio -Ilib/librte_ethdev -I../lib/librte_ethdev -I. -I.. -Iconfig -I../config -Ilib/librte_eal/include -I../lib/librte_eal/include -Ilib/librte_eal/linux/include -I../lib/librte_eal/linux/include -Ilib/librte_eal/x86/include -I../lib/librte_eal/x86/include -Ilib/librte_eal/common -I../lib/librte_eal/common -Ilib/librte_eal -I../lib/librte_eal -Ilib/librte_kvargs -I../lib/librte_kvargs -Ilib/librte_metrics -I../lib/librte_metrics -Ilib/librte_telemetry -I../lib/librte_telemetry -Ilib/librte_net -I../lib/librte_net -Ilib/librte_mbuf -I../lib/librte_mbuf -Ilib/librte_mempool -I../lib/librte_mempool -Ilib/librte_ring -I../lib/librte_ring -Ilib/librte_meter -I../lib/librte_meter -Idrivers/bus/pci -I../drivers/bus/pci -I../drivers/bus/pci/linux -Ilib/librte_pci -I../lib/librte_pci -Idrivers/bus/vdev -I../drivers/bus/vdev -Xclang -fcolor-diagnostics -pipe -D_FILE_OFFSET_BITS=64 -Wall -Winvalid-pch -Werror -O3 -include rte_config.h -Wextra -Wcast-qual -Wdeprecated -Wformat-nonliteral -Wformat-security -Wmissing-declarations -Wmissing-prototypes -Wnested-externs -Wold-style-definition -Wpointer-arith -Wsign-compare -Wstrict-prototypes -Wundef -Wwrite-strings -Wno-address-of-packed-member -Wno-missing-field-initializers -D_GNU_SOURCE -fPIC -march=native -DALLOW_EXPERIMENTAL_API -DALLOW_INTERNAL_API -DCC_AVX512_SUPPORT -DVHOST_CLANG_UNROLL_PRAGMA -MD -MQ drivers/libtmp_rte_pmd_virtio.a.p/net_virtio_virtio_rxtx.c.o -MF drivers/libtmp_rte_pmd_virtio.a.p/net_virtio_virtio_rxtx.c.o.d -o drivers/libtmp_rte_pmd_virtio.a.p/net_virtio_virtio_rxtx.c.o -c ../drivers/net/virtio/virtio_rxtx.c
In file included from ../drivers/net/virtio/virtio_rxtx.c:31:
../drivers/net/virtio/virtqueue.h:615:1: error: extraneous closing brace ('}')
} while (0)
^
../drivers/net/virtio/virtqueue.h:615:3: error: expected identifier or '('
} while (0)
  ^
2 errors generated.
[1628/2551] Compiling C object drivers/libtmp_rte_pmd_virtio.a.p/net_virtio_virtqueue.c.o
FAILED: drivers/libtmp_rte_pmd_virtio.a.p/net_virtio_virtqueue.c.o 
clang -Idrivers/libtmp_rte_pmd_virtio.a.p -Idrivers -I../drivers -Idrivers/net/virtio -I../drivers/net/virtio -Ilib/librte_ethdev -I../lib/librte_ethdev -I. -I.. -Iconfig -I../config -Ilib/librte_eal/include -I../lib/librte_eal/include -Ilib/librte_eal/linux/include -I../lib/librte_eal/linux/include -Ilib/librte_eal/x86/include -I../lib/librte_eal/x86/include -Ilib/librte_eal/common -I../lib/librte_eal/common -Ilib/librte_eal -I../lib/librte_eal -Ilib/librte_kvargs -I../lib/librte_kvargs -Ilib/librte_metrics -I../lib/librte_metrics -Ilib/librte_telemetry -I../lib/librte_telemetry -Ilib/librte_net -I../lib/librte_net -Ilib/librte_mbuf -I../lib/librte_mbuf -Ilib/librte_mempool -I../lib/librte_mempool -Ilib/librte_ring -I../lib/librte_ring -Ilib/librte_meter -I../lib/librte_meter -Idrivers/bus/pci -I../drivers/bus/pci -I../drivers/bus/pci/linux -Ilib/librte_pci -I../lib/librte_pci -Idrivers/bus/vdev -I../drivers/bus/vdev -Xclang -fcolor-diagnostics -pipe -D_FILE_OFFSET_BITS=64 -Wall -Winvalid-pch -Werror -O3 -include rte_config.h -Wextra -Wcast-qual -Wdeprecated -Wformat-nonliteral -Wformat-security -Wmissing-declarations -Wmissing-prototypes -Wnested-externs -Wold-style-definition -Wpointer-arith -Wsign-compare -Wstrict-prototypes -Wundef -Wwrite-strings -Wno-address-of-packed-member -Wno-missing-field-initializers -D_GNU_SOURCE -fPIC -march=native -DALLOW_EXPERIMENTAL_API -DALLOW_INTERNAL_API -DCC_AVX512_SUPPORT -DVHOST_CLANG_UNROLL_PRAGMA -MD -MQ drivers/libtmp_rte_pmd_virtio.a.p/net_virtio_virtqueue.c.o -MF drivers/libtmp_rte_pmd_virtio.a.p/net_virtio_virtqueue.c.o.d -o drivers/libtmp_rte_pmd_virtio.a.p/net_virtio_virtqueue.c.o -c ../drivers/net/virtio/virtqueue.c
In file included from ../drivers/net/virtio/virtqueue.c:8:
../drivers/net/virtio/virtqueue.h:615:1: error: extraneous closing brace ('}')
} while (0)
^
../drivers/net/virtio/virtqueue.h:615:3: error: expected identifier or '('
} while (0)
  ^
2 errors generated.
[1629/2551] Compiling C object drivers/libtmp_rte_pmd_tap.a.p/net_tap_rte_eth_tap.c.o
ninja: build stopped: subcommand failed




*Build Failed #15:
OS: SUSE15-64
Target: x86_64-gcc-static
FAILED: drivers/a715181@@tmp_rte_pmd_virtio@sta/net_virtio_virtio_pci.c.o 
gcc -Idrivers/a715181@@tmp_rte_pmd_virtio@sta -Idrivers -I../drivers -Idrivers/net/virtio -I../drivers/net/virtio -Ilib/librte_ethdev -I../lib/librte_ethdev -I. -I.. -Iconfig -I../config -Ilib/librte_eal/include -I../lib/librte_eal/include -Ilib/librte_eal/linux/include -I../lib/librte_eal/linux/include -Ilib/librte_eal/x86/include -I../lib/librte_eal/x86/include -Ilib/librte_eal/common -I../lib/librte_eal/common -Ilib/librte_eal -I../lib/librte_eal -Ilib/librte_kvargs -I../lib/librte_kvargs -Ilib/librte_metrics -I../lib/librte_metrics -Ilib/librte_telemetry -I../lib/librte_telemetry -Ilib/librte_net -I../lib/librte_net -Ilib/librte_mbuf -I../lib/librte_mbuf -Ilib/librte_mempool -I../lib/librte_mempool -Ilib/librte_ring -I../lib/librte_ring -Ilib/librte_meter -I../lib/librte_meter -Idrivers/bus/pci -I../drivers/bus/pci -I../drivers/bus/pci/linux -Ilib/librte_pci -I../lib/librte_pci -Idrivers/bus/vdev -I../drivers/bus/vdev -fdiagnostics-color=always -pipe -D_FILE_OFFSET_BITS=64 -Wall -Winvalid-pch -Werror -O3 -include rte_config.h -Wextra -Wcast-qual -Wdeprecated -Wformat-nonliteral -Wformat-security -Wmissing-declarations -Wmissing-prototypes -Wnested-externs -Wold-style-definition -Wpointer-arith -Wsign-compare -Wstrict-prototypes -Wundef -Wwrite-strings -Wno-missing-field-initializers -D_GNU_SOURCE -fPIC -march=native -DALLOW_EXPERIMENTAL_API -DALLOW_INTERNAL_API -Wno-format-truncation -DCC_AVX512_SUPPORT -MD -MQ 'drivers/a715181@@tmp_rte_pmd_virtio@sta/net_virtio_virtio_pci.c.o' -MF 'drivers/a715181@@tmp_rte_pmd_virtio@sta/net_virtio_virtio_pci.c.o.d' -o 'drivers/a715181@@tmp_rte_pmd_virtio@sta/net_virtio_virtio_pci.c.o' -c ../drivers/net/virtio/virtio_pci.c
In file included from ../drivers/net/virtio/virtio_pci.c:16:0:
../drivers/net/virtio/virtqueue.h:615:1: error: expected identifier or ‘(’ before ‘}’ token
 } while (0)
 ^
../drivers/net/virtio/virtqueue.h:615:3: error: expected identifier or ‘(’ before ‘while’
 } while (0)
   ^~~~~
[1614/2551] Compiling C object 'drivers/a715181@@tmp_rte_pmd_vdev_netvsc@sta/net_vdev_netvsc_vdev_netvsc.c.o'
[1615/2551] Generating rte_pmd_softnic.pmd.c with a custom command
[1616/2551] Compiling C object 'drivers/a715181@@tmp_rte_pmd_virtio@sta/net_virtio_virtio_ethdev.c.o'
FAILED: drivers/a715181@@tmp_rte_pmd_virtio@sta/net_virtio_virtio_ethdev.c.o 
gcc -Idrivers/a715181@@tmp_rte_pmd_virtio@sta -Idrivers -I../drivers -Idrivers/net/virtio -I../drivers/net/virtio -Ilib/librte_ethdev -I../lib/librte_ethdev -I. -I.. -Iconfig -I../config -Ilib/librte_eal/include -I../lib/librte_eal/include -Ilib/librte_eal/linux/include -I../lib/librte_eal/linux/include -Ilib/librte_eal/x86/include -I../lib/librte_eal/x86/include -Ilib/librte_eal/common -I../lib/librte_eal/common -Ilib/librte_eal -I../lib/librte_eal -Ilib/librte_kvargs -I../lib/librte_kvargs -Ilib/librte_metrics -I../lib/librte_metrics -Ilib/librte_telemetry -I../lib/librte_telemetry -Ilib/librte_net -I../lib/librte_net -Ilib/librte_mbuf -I../lib/librte_mbuf -Ilib/librte_mempool -I../lib/librte_mempool -Ilib/librte_ring -I../lib/librte_ring -Ilib/librte_meter -I../lib/librte_meter -Idrivers/bus/pci -I../drivers/bus/pci -I../drivers/bus/pci/linux -Ilib/librte_pci -I../lib/librte_pci -Idrivers/bus/vdev -I../drivers/bus/vdev -fdiagnostics-color=always -pipe -D_FILE_OFFSET_BITS=64 -Wall -Winvalid-pch -Werror -O3 -include rte_config.h -Wextra -Wcast-qual -Wdeprecated -Wformat-nonliteral -Wformat-security -Wmissing-declarations -Wmissing-prototypes -Wnested-externs -Wold-style-definition -Wpointer-arith -Wsign-compare -Wstrict-prototypes -Wundef -Wwrite-strings -Wno-missing-field-initializers -D_GNU_SOURCE -fPIC -march=native -DALLOW_EXPERIMENTAL_API -DALLOW_INTERNAL_API -Wno-format-truncation -DCC_AVX512_SUPPORT -MD -MQ 'drivers/a715181@@tmp_rte_pmd_virtio@sta/net_virtio_virtio_ethdev.c.o' -MF 'drivers/a715181@@tmp_rte_pmd_virtio@sta/net_virtio_virtio_ethdev.c.o.d' -o 'drivers/a715181@@tmp_rte_pmd_virtio@sta/net_virtio_virtio_ethdev.c.o' -c ../drivers/net/virtio/virtio_ethdev.c
In file included from ../drivers/net/virtio/virtio_ethdev.c:36:0:
../drivers/net/virtio/virtqueue.h:615:1: error: expected identifier or ‘(’ before ‘}’ token
 } while (0)
 ^
../drivers/net/virtio/virtqueue.h:615:3: error: expected identifier or ‘(’ before ‘while’
 } while (0)
   ^~~~~
[1617/2551] Compiling C object 'drivers/net/virtio/20670f1@@virtio_avx512_lib@sta/virtio_rxtx_packed_avx.c.o'
FAILED: drivers/net/virtio/20670f1@@virtio_avx512_lib@sta/virtio_rxtx_packed_avx.c.o 
gcc -Idrivers/net/virtio/20670f1@@virtio_avx512_lib@sta -Idrivers/net/virtio -I../drivers/net/virtio -Ilib/librte_ethdev -I../lib/librte_ethdev -I. -I.. -Iconfig -I../config -Ilib/librte_eal/include -I../lib/librte_eal/include -Ilib/librte_eal/linux/include -I../lib/librte_eal/linux/include -Ilib/librte_eal/x86/include -I../lib/librte_eal/x86/include -Ilib/librte_eal/common -I../lib/librte_eal/common -Ilib/librte_eal -I../lib/librte_eal -Ilib/librte_kvargs -I../lib/librte_kvargs -Ilib/librte_metrics -I../lib/librte_metrics -Ilib/librte_telemetry -I../lib/librte_telemetry -Ilib/librte_net -I../lib/librte_net -Ilib/librte_mbuf -I../lib/librte_mbuf -Ilib/librte_mempool -I../lib/librte_mempool -Ilib/librte_ring -I../lib/librte_ring -Ilib/librte_meter -I../lib/librte_meter -Idrivers/bus/pci -I../drivers/bus/pci -I../drivers/bus/pci/linux -Ilib/librte_pci -I../lib/librte_pci -fdiagnostics-color=always -pipe -D_FILE_OFFSET_BITS=64 -Wall -Winvalid-pch -Werror -O3 -include rte_config.h -Wextra -Wcast-qual -Wdeprecated -Wformat-nonliteral -Wformat-security -Wmissing-declarations -Wmissing-prototypes -Wnested-externs -Wold-style-definition -Wpointer-arith -Wsign-compare -Wstrict-prototypes -Wundef -Wwrite-strings -Wno-missing-field-initializers -D_GNU_SOURCE -fPIC -march=native -DALLOW_EXPERIMENTAL_API -DALLOW_INTERNAL_API -Wno-format-truncation -DCC_AVX512_SUPPORT -mavx512f -mavx512bw -mavx512vl -MD -MQ 'drivers/net/virtio/20670f1@@virtio_avx512_lib@sta/virtio_rxtx_packed_avx.c.o' -MF 'drivers/net/virtio/20670f1@@virtio_avx512_lib@sta/virtio_rxtx_packed_avx.c.o.d' -o 'drivers/net/virtio/20670f1@@virtio_avx512_lib@sta/virtio_rxtx_packed_avx.c.o' -c ../drivers/net/virtio/virtio_rxtx_packed_avx.c
In file included from ../drivers/net/virtio/virtio_rxtx_packed_avx.c:16:0:
../drivers/net/virtio/virtqueue.h:615:1: error: expected identifier or ‘(’ before ‘}’ token
 } while (0)
 ^
../drivers/net/virtio/virtqueue.h:615:3: error: expected identifier or ‘(’ before ‘while’
 } while (0)
   ^~~~~
[1618/2551] Compiling C object 'drivers/a715181@@tmp_rte_pmd_virtio@sta/net_virtio_virtio_rxtx.c.o'
FAILED: drivers/a715181@@tmp_rte_pmd_virtio@sta/net_virtio_virtio_rxtx.c.o 
gcc -Idrivers/a715181@@tmp_rte_pmd_virtio@sta -Idrivers -I../drivers -Idrivers/net/virtio -I../drivers/net/virtio -Ilib/librte_ethdev -I../lib/librte_ethdev -I. -I.. -Iconfig -I../config -Ilib/librte_eal/include -I../lib/librte_eal/include -Ilib/librte_eal/linux/include -I../lib/librte_eal/linux/include -Ilib/librte_eal/x86/include -I../lib/librte_eal/x86/include -Ilib/librte_eal/common -I../lib/librte_eal/common -Ilib/librte_eal -I../lib/librte_eal -Ilib/librte_kvargs -I../lib/librte_kvargs -Ilib/librte_metrics -I../lib/librte_metrics -Ilib/librte_telemetry -I../lib/librte_telemetry -Ilib/librte_net -I../lib/librte_net -Ilib/librte_mbuf -I../lib/librte_mbuf -Ilib/librte_mempool -I../lib/librte_mempool -Ilib/librte_ring -I../lib/librte_ring -Ilib/librte_meter -I../lib/librte_meter -Idrivers/bus/pci -I../drivers/bus/pci -I../drivers/bus/pci/linux -Ilib/librte_pci -I../lib/librte_pci -Idrivers/bus/vdev -I../drivers/bus/vdev -fdiagnostics-color=always -pipe -D_FILE_OFFSET_BITS=64 -Wall -Winvalid-pch -Werror -O3 -include rte_config.h -Wextra -Wcast-qual -Wdeprecated -Wformat-nonliteral -Wformat-security -Wmissing-declarations -Wmissing-prototypes -Wnested-externs -Wold-style-definition -Wpointer-arith -Wsign-compare -Wstrict-prototypes -Wundef -Wwrite-strings -Wno-missing-field-initializers -D_GNU_SOURCE -fPIC -march=native -DALLOW_EXPERIMENTAL_API -DALLOW_INTERNAL_API -Wno-format-truncation -DCC_AVX512_SUPPORT -MD -MQ 'drivers/a715181@@tmp_rte_pmd_virtio@sta/net_virtio_virtio_rxtx.c.o' -MF 'drivers/a715181@@tmp_rte_pmd_virtio@sta/net_virtio_virtio_rxtx.c.o.d' -o 'drivers/a715181@@tmp_rte_pmd_virtio@sta/net_virtio_virtio_rxtx.c.o' -c ../drivers/net/virtio/virtio_rxtx.c
In file included from ../drivers/net/virtio/virtio_rxtx.c:31:0:
../drivers/net/virtio/virtqueue.h:615:1: error: expected identifier or ‘(’ before ‘}’ token
 } while (0)
 ^
../drivers/net/virtio/virtqueue.h:615:3: error: expected identifier or ‘(’ before ‘while’
 } while (0)
   ^~~~~
[1619/2551] Compiling C object 'drivers/a715181@@tmp_rte_pmd_thunderx@sta/net_thunderx_nicvf_rxtx.c.o'
[1620/2551] Compiling C object 'drivers/a715181@@tmp_rte_pmd_tap@sta/net_tap_rte_eth_tap.c.o'
[1621/2551] Compiling C object 'drivers/a715181@@tmp_rte_pmd_vhost@sta/net_vhost_rte_eth_vhost.c.o'
[1622/2551] Compiling C object 'drivers/a715181@@tmp_rte_pmd_thunderx@sta/net_thunderx_nicvf_ethdev.c.o'
ninja: build stopped: subcommand failed




*Build Failed #16:
OS: UB1804-64
Target: x86_64-gcc-static
FAILED: drivers/a715181@@tmp_rte_pmd_virtio@sta/net_virtio_virtio_pci.c.o 
gcc -Idrivers/a715181@@tmp_rte_pmd_virtio@sta -Idrivers -I../drivers -Idrivers/net/virtio -I../drivers/net/virtio -Ilib/librte_ethdev -I../lib/librte_ethdev -I. -I../ -Iconfig -I../config -Ilib/librte_eal/include -I../lib/librte_eal/include -Ilib/librte_eal/linux/include -I../lib/librte_eal/linux/include -Ilib/librte_eal/x86/include -I../lib/librte_eal/x86/include -Ilib/librte_eal/common -I../lib/librte_eal/common -Ilib/librte_eal -I../lib/librte_eal -Ilib/librte_kvargs -I../lib/librte_kvargs -Ilib/librte_telemetry/../librte_metrics -I../lib/librte_telemetry/../librte_metrics -Ilib/librte_telemetry -I../lib/librte_telemetry -Ilib/librte_net -I../lib/librte_net -Ilib/librte_mbuf -I../lib/librte_mbuf -Ilib/librte_mempool -I../lib/librte_mempool -Ilib/librte_ring -I../lib/librte_ring -Ilib/librte_meter -I../lib/librte_meter -Idrivers/bus/pci -I../drivers/bus/pci -I../drivers/bus/pci/linux -Ilib/librte_pci -I../lib/librte_pci -Idrivers/bus/vdev -I../drivers/bus/vdev -fdiagnostics-color=always -pipe -D_FILE_OFFSET_BITS=64 -Wall -Winvalid-pch -Werror -O3 -include rte_config.h -Wextra -Wcast-qual -Wdeprecated -Wformat-nonliteral -Wformat-security -Wmissing-declarations -Wmissing-prototypes -Wnested-externs -Wold-style-definition -Wpointer-arith -Wsign-compare -Wstrict-prototypes -Wundef -Wwrite-strings -Wno-packed-not-aligned -Wno-missing-field-initializers -D_GNU_SOURCE -fPIC -march=native -mno-avx512f -DALLOW_EXPERIMENTAL_API -DALLOW_INTERNAL_API -Wno-format-truncation -MD -MQ 'drivers/a715181@@tmp_rte_pmd_virtio@sta/net_virtio_virtio_pci.c.o' -MF 'drivers/a715181@@tmp_rte_pmd_virtio@sta/net_virtio_virtio_pci.c.o.d' -o 'drivers/a715181@@tmp_rte_pmd_virtio@sta/net_virtio_virtio_pci.c.o' -c ../drivers/net/virtio/virtio_pci.c
In file included from ../drivers/net/virtio/virtio_pci.c:16:
../drivers/net/virtio/virtqueue.h:615:1: error: expected identifier or ‘(’ before ‘}’ token
 } while (0)
 ^
../drivers/net/virtio/virtqueue.h:615:3: error: expected identifier or ‘(’ before ‘while’
 } while (0)
   ^~~~~
[1619/2571] Generating rte_pmd_vdev_netvsc.pmd.c with a custom command.
[1620/2571] Compiling C object 'drivers/a715181@@tmp_rte_pmd_virtio@sta/net_virtio_virtio_rxtx_simple.c.o'.
FAILED: drivers/a715181@@tmp_rte_pmd_virtio@sta/net_virtio_virtio_rxtx_simple.c.o 
gcc -Idrivers/a715181@@tmp_rte_pmd_virtio@sta -Idrivers -I../drivers -Idrivers/net/virtio -I../drivers/net/virtio -Ilib/librte_ethdev -I../lib/librte_ethdev -I. -I../ -Iconfig -I../config -Ilib/librte_eal/include -I../lib/librte_eal/include -Ilib/librte_eal/linux/include -I../lib/librte_eal/linux/include -Ilib/librte_eal/x86/include -I../lib/librte_eal/x86/include -Ilib/librte_eal/common -I../lib/librte_eal/common -Ilib/librte_eal -I../lib/librte_eal -Ilib/librte_kvargs -I../lib/librte_kvargs -Ilib/librte_telemetry/../librte_metrics -I../lib/librte_telemetry/../librte_metrics -Ilib/librte_telemetry -I../lib/librte_telemetry -Ilib/librte_net -I../lib/librte_net -Ilib/librte_mbuf -I../lib/librte_mbuf -Ilib/librte_mempool -I../lib/librte_mempool -Ilib/librte_ring -I../lib/librte_ring -Ilib/librte_meter -I../lib/librte_meter -Idrivers/bus/pci -I../drivers/bus/pci -I../drivers/bus/pci/linux -Ilib/librte_pci -I../lib/librte_pci -Idrivers/bus/vdev -I../drivers/bus/vdev -fdiagnostics-color=always -pipe -D_FILE_OFFSET_BITS=64 -Wall -Winvalid-pch -Werror -O3 -include rte_config.h -Wextra -Wcast-qual -Wdeprecated -Wformat-nonliteral -Wformat-security -Wmissing-declarations -Wmissing-prototypes -Wnested-externs -Wold-style-definition -Wpointer-arith -Wsign-compare -Wstrict-prototypes -Wundef -Wwrite-strings -Wno-packed-not-aligned -Wno-missing-field-initializers -D_GNU_SOURCE -fPIC -march=native -mno-avx512f -DALLOW_EXPERIMENTAL_API -DALLOW_INTERNAL_API -Wno-format-truncation -MD -MQ 'drivers/a715181@@tmp_rte_pmd_virtio@sta/net_virtio_virtio_rxtx_simple.c.o' -MF 'drivers/a715181@@tmp_rte_pmd_virtio@sta/net_virtio_virtio_rxtx_simple.c.o.d' -o 'drivers/a715181@@tmp_rte_pmd_virtio@sta/net_virtio_virtio_rxtx_simple.c.o' -c ../drivers/net/virtio/virtio_rxtx_simple.c
In file included from ../drivers/net/virtio/virtio_rxtx_simple.h:12,
                 from ../drivers/net/virtio/virtio_rxtx_simple.c:24:
../drivers/net/virtio/virtqueue.h:615:1: error: expected identifier or ‘(’ before ‘}’ token
 } while (0)
 ^
../drivers/net/virtio/virtqueue.h:615:3: error: expected identifier or ‘(’ before ‘while’
 } while (0)
   ^~~~~
[1621/2571] Compiling C object 'drivers/a715181@@tmp_rte_pmd_virtio@sta/net_virtio_virtio_ethdev.c.o'.
FAILED: drivers/a715181@@tmp_rte_pmd_virtio@sta/net_virtio_virtio_ethdev.c.o 
gcc -Idrivers/a715181@@tmp_rte_pmd_virtio@sta -Idrivers -I../drivers -Idrivers/net/virtio -I../drivers/net/virtio -Ilib/librte_ethdev -I../lib/librte_ethdev -I. -I../ -Iconfig -I../config -Ilib/librte_eal/include -I../lib/librte_eal/include -Ilib/librte_eal/linux/include -I../lib/librte_eal/linux/include -Ilib/librte_eal/x86/include -I../lib/librte_eal/x86/include -Ilib/librte_eal/common -I../lib/librte_eal/common -Ilib/librte_eal -I../lib/librte_eal -Ilib/librte_kvargs -I../lib/librte_kvargs -Ilib/librte_telemetry/../librte_metrics -I../lib/librte_telemetry/../librte_metrics -Ilib/librte_telemetry -I../lib/librte_telemetry -Ilib/librte_net -I../lib/librte_net -Ilib/librte_mbuf -I../lib/librte_mbuf -Ilib/librte_mempool -I../lib/librte_mempool -Ilib/librte_ring -I../lib/librte_ring -Ilib/librte_meter -I../lib/librte_meter -Idrivers/bus/pci -I../drivers/bus/pci -I../drivers/bus/pci/linux -Ilib/librte_pci -I../lib/librte_pci -Idrivers/bus/vdev -I../drivers/bus/vdev -fdiagnostics-color=always -pipe -D_FILE_OFFSET_BITS=64 -Wall -Winvalid-pch -Werror -O3 -include rte_config.h -Wextra -Wcast-qual -Wdeprecated -Wformat-nonliteral -Wformat-security -Wmissing-declarations -Wmissing-prototypes -Wnested-externs -Wold-style-definition -Wpointer-arith -Wsign-compare -Wstrict-prototypes -Wundef -Wwrite-strings -Wno-packed-not-aligned -Wno-missing-field-initializers -D_GNU_SOURCE -fPIC -march=native -mno-avx512f -DALLOW_EXPERIMENTAL_API -DALLOW_INTERNAL_API -Wno-format-truncation -MD -MQ 'drivers/a715181@@tmp_rte_pmd_virtio@sta/net_virtio_virtio_ethdev.c.o' -MF 'drivers/a715181@@tmp_rte_pmd_virtio@sta/net_virtio_virtio_ethdev.c.o.d' -o 'drivers/a715181@@tmp_rte_pmd_virtio@sta/net_virtio_virtio_ethdev.c.o' -c ../drivers/net/virtio/virtio_ethdev.c
In file included from ../drivers/net/virtio/virtio_ethdev.c:36:
../drivers/net/virtio/virtqueue.h:615:1: error: expected identifier or ‘(’ before ‘}’ token
 } while (0)
 ^
../drivers/net/virtio/virtqueue.h:615:3: error: expected identifier or ‘(’ before ‘while’
 } while (0)
   ^~~~~
[1622/2571] Generating rte_pmd_softnic.sym_chk with a meson_exe.py custom command.
[1623/2571] Compiling C object 'drivers/a715181@@tmp_rte_pmd_virtio@sta/net_virtio_virtio_user_vhost_kernel_tap.c.o'.
[1624/2571] Compiling C object 'drivers/a715181@@tmp_rte_pmd_virtio@sta/net_virtio_virtio_rxtx.c.o'.
FAILED: drivers/a715181@@tmp_rte_pmd_virtio@sta/net_virtio_virtio_rxtx.c.o 
gcc -Idrivers/a715181@@tmp_rte_pmd_virtio@sta -Idrivers -I../drivers -Idrivers/net/virtio -I../drivers/net/virtio -Ilib/librte_ethdev -I../lib/librte_ethdev -I. -I../ -Iconfig -I../config -Ilib/librte_eal/include -I../lib/librte_eal/include -Ilib/librte_eal/linux/include -I../lib/librte_eal/linux/include -Ilib/librte_eal/x86/include -I../lib/librte_eal/x86/include -Ilib/librte_eal/common -I../lib/librte_eal/common -Ilib/librte_eal -I../lib/librte_eal -Ilib/librte_kvargs -I../lib/librte_kvargs -Ilib/librte_telemetry/../librte_metrics -I../lib/librte_telemetry/../librte_metrics -Ilib/librte_telemetry -I../lib/librte_telemetry -Ilib/librte_net -I../lib/librte_net -Ilib/librte_mbuf -I../lib/librte_mbuf -Ilib/librte_mempool -I../lib/librte_mempool -Ilib/librte_ring -I../lib/librte_ring -Ilib/librte_meter -I../lib/librte_meter -Idrivers/bus/pci -I../drivers/bus/pci -I../drivers/bus/pci/linux -Ilib/librte_pci -I../lib/librte_pci -Idrivers/bus/vdev -I../drivers/bus/vdev -fdiagnostics-color=always -pipe -D_FILE_OFFSET_BITS=64 -Wall -Winvalid-pch -Werror -O3 -include rte_config.h -Wextra -Wcast-qual -Wdeprecated -Wformat-nonliteral -Wformat-security -Wmissing-declarations -Wmissing-prototypes -Wnested-externs -Wold-style-definition -Wpointer-arith -Wsign-compare -Wstrict-prototypes -Wundef -Wwrite-strings -Wno-packed-not-aligned -Wno-missing-field-initializers -D_GNU_SOURCE -fPIC -march=native -mno-avx512f -DALLOW_EXPERIMENTAL_API -DALLOW_INTERNAL_API -Wno-format-truncation -MD -MQ 'drivers/a715181@@tmp_rte_pmd_virtio@sta/net_virtio_virtio_rxtx.c.o' -MF 'drivers/a715181@@tmp_rte_pmd_virtio@sta/net_virtio_virtio_rxtx.c.o.d' -o 'drivers/a715181@@tmp_rte_pmd_virtio@sta/net_virtio_virtio_rxtx.c.o' -c ../drivers/net/virtio/virtio_rxtx.c
In file included from ../drivers/net/virtio/virtio_rxtx.c:31:
../drivers/net/virtio/virtqueue.h:615:1: error: expected identifier or ‘(’ before ‘}’ token
 } while (0)
 ^
../drivers/net/virtio/virtqueue.h:615:3: error: expected identifier or ‘(’ before ‘while’
 } while (0)
   ^~~~~
[1625/2571] Compiling C object 'drivers/a715181@@tmp_rte_pmd_tap@sta/net_tap_rte_eth_tap.c.o'.
[1626/2571] Compiling C object 'drivers/a715181@@tmp_rte_pmd_vhost@sta/net_vhost_rte_eth_vhost.c.o'.
[1627/2571] Compiling C object 'drivers/a715181@@tmp_rte_pmd_thunderx@sta/net_thunderx_nicvf_ethdev.c.o'.
ninja: build stopped: subcommand failed




*Build Failed #17:
OS: UB2004-32
Target: i686-gcc-static
FAILED: drivers/a715181@@tmp_rte_pmd_virtio@sta/net_virtio_virtio_pci.c.o 
gcc -Idrivers/a715181@@tmp_rte_pmd_virtio@sta -Idrivers -I../drivers -Idrivers/net/virtio -I../drivers/net/virtio -Ilib/librte_ethdev -I../lib/librte_ethdev -I. -I../ -Iconfig -I../config -Ilib/librte_eal/include -I../lib/librte_eal/include -Ilib/librte_eal/linux/include -I../lib/librte_eal/linux/include -Ilib/librte_eal/x86/include -I../lib/librte_eal/x86/include -Ilib/librte_eal/common -I../lib/librte_eal/common -Ilib/librte_eal -I../lib/librte_eal -Ilib/librte_kvargs -I../lib/librte_kvargs -Ilib/librte_telemetry/../librte_metrics -I../lib/librte_telemetry/../librte_metrics -Ilib/librte_telemetry -I../lib/librte_telemetry -Ilib/librte_net -I../lib/librte_net -Ilib/librte_mbuf -I../lib/librte_mbuf -Ilib/librte_mempool -I../lib/librte_mempool -Ilib/librte_ring -I../lib/librte_ring -Ilib/librte_meter -I../lib/librte_meter -Idrivers/bus/pci -I../drivers/bus/pci -I../drivers/bus/pci/linux -Ilib/librte_pci -I../lib/librte_pci -Idrivers/bus/vdev -I../drivers/bus/vdev -fdiagnostics-color=always -pipe -D_FILE_OFFSET_BITS=64 -Wall -Winvalid-pch -Werror -O3 -include rte_config.h -Wextra -Wcast-qual -Wdeprecated -Wformat-nonliteral -Wformat-security -Wmissing-declarations -Wmissing-prototypes -Wnested-externs -Wold-style-definition -Wpointer-arith -Wsign-compare -Wstrict-prototypes -Wundef -Wwrite-strings -Wno-address-of-packed-member -Wno-packed-not-aligned -Wno-missing-field-initializers -Wno-pointer-to-int-cast -D_GNU_SOURCE -m32 -fPIC -march=native -DALLOW_EXPERIMENTAL_API -DALLOW_INTERNAL_API -Wno-format-truncation -DCC_AVX512_SUPPORT -DVHOST_GCC_UNROLL_PRAGMA -MD -MQ 'drivers/a715181@@tmp_rte_pmd_virtio@sta/net_virtio_virtio_pci.c.o' -MF 'drivers/a715181@@tmp_rte_pmd_virtio@sta/net_virtio_virtio_pci.c.o.d' -o 'drivers/a715181@@tmp_rte_pmd_virtio@sta/net_virtio_virtio_pci.c.o' -c ../drivers/net/virtio/virtio_pci.c
In file included from ../drivers/net/virtio/virtio_pci.c:16:
../drivers/net/virtio/virtqueue.h:615:1: error: expected identifier or ‘(’ before ‘}’ token
  615 | } while (0)
      | ^
../drivers/net/virtio/virtqueue.h:615:3: error: expected identifier or ‘(’ before ‘while’
  615 | } while (0)
      |   ^~~~~
[1456/2332] Compiling C object 'drivers/a715181@@tmp_rte_pmd_virtio@sta/net_virtio_virtio_ethdev.c.o'.
FAILED: drivers/a715181@@tmp_rte_pmd_virtio@sta/net_virtio_virtio_ethdev.c.o 
gcc -Idrivers/a715181@@tmp_rte_pmd_virtio@sta -Idrivers -I../drivers -Idrivers/net/virtio -I../drivers/net/virtio -Ilib/librte_ethdev -I../lib/librte_ethdev -I. -I../ -Iconfig -I../config -Ilib/librte_eal/include -I../lib/librte_eal/include -Ilib/librte_eal/linux/include -I../lib/librte_eal/linux/include -Ilib/librte_eal/x86/include -I../lib/librte_eal/x86/include -Ilib/librte_eal/common -I../lib/librte_eal/common -Ilib/librte_eal -I../lib/librte_eal -Ilib/librte_kvargs -I../lib/librte_kvargs -Ilib/librte_telemetry/../librte_metrics -I../lib/librte_telemetry/../librte_metrics -Ilib/librte_telemetry -I../lib/librte_telemetry -Ilib/librte_net -I../lib/librte_net -Ilib/librte_mbuf -I../lib/librte_mbuf -Ilib/librte_mempool -I../lib/librte_mempool -Ilib/librte_ring -I../lib/librte_ring -Ilib/librte_meter -I../lib/librte_meter -Idrivers/bus/pci -I../drivers/bus/pci -I../drivers/bus/pci/linux -Ilib/librte_pci -I../lib/librte_pci -Idrivers/bus/vdev -I../drivers/bus/vdev -fdiagnostics-color=always -pipe -D_FILE_OFFSET_BITS=64 -Wall -Winvalid-pch -Werror -O3 -include rte_config.h -Wextra -Wcast-qual -Wdeprecated -Wformat-nonliteral -Wformat-security -Wmissing-declarations -Wmissing-prototypes -Wnested-externs -Wold-style-definition -Wpointer-arith -Wsign-compare -Wstrict-prototypes -Wundef -Wwrite-strings -Wno-address-of-packed-member -Wno-packed-not-aligned -Wno-missing-field-initializers -Wno-pointer-to-int-cast -D_GNU_SOURCE -m32 -fPIC -march=native -DALLOW_EXPERIMENTAL_API -DALLOW_INTERNAL_API -Wno-format-truncation -DCC_AVX512_SUPPORT -DVHOST_GCC_UNROLL_PRAGMA -MD -MQ 'drivers/a715181@@tmp_rte_pmd_virtio@sta/net_virtio_virtio_ethdev.c.o' -MF 'drivers/a715181@@tmp_rte_pmd_virtio@sta/net_virtio_virtio_ethdev.c.o.d' -o 'drivers/a715181@@tmp_rte_pmd_virtio@sta/net_virtio_virtio_ethdev.c.o' -c ../drivers/net/virtio/virtio_ethdev.c
In file included from ../drivers/net/virtio/virtio_ethdev.c:36:
../drivers/net/virtio/virtqueue.h:615:1: error: expected identifier or ‘(’ before ‘}’ token
  615 | } while (0)
      | ^
../drivers/net/virtio/virtqueue.h:615:3: error: expected identifier or ‘(’ before ‘while’
  615 | } while (0)
      |   ^~~~~
[1457/2332] Compiling C object 'drivers/a715181@@tmp_rte_pmd_vdev_netvsc@sta/net_vdev_netvsc_vdev_netvsc.c.o'.
[1458/2332] Compiling C object 'drivers/net/virtio/20670f1@@virtio_avx512_lib@sta/virtio_rxtx_packed_avx.c.o'.
FAILED: drivers/net/virtio/20670f1@@virtio_avx512_lib@sta/virtio_rxtx_packed_avx.c.o 
gcc -Idrivers/net/virtio/20670f1@@virtio_avx512_lib@sta -Idrivers/net/virtio -I../drivers/net/virtio -Ilib/librte_ethdev -I../lib/librte_ethdev -I. -I../ -Iconfig -I../config -Ilib/librte_eal/include -I../lib/librte_eal/include -Ilib/librte_eal/linux/include -I../lib/librte_eal/linux/include -Ilib/librte_eal/x86/include -I../lib/librte_eal/x86/include -Ilib/librte_eal/common -I../lib/librte_eal/common -Ilib/librte_eal -I../lib/librte_eal -Ilib/librte_kvargs -I../lib/librte_kvargs -Ilib/librte_telemetry/../librte_metrics -I../lib/librte_telemetry/../librte_metrics -Ilib/librte_telemetry -I../lib/librte_telemetry -Ilib/librte_net -I../lib/librte_net -Ilib/librte_mbuf -I../lib/librte_mbuf -Ilib/librte_mempool -I../lib/librte_mempool -Ilib/librte_ring -I../lib/librte_ring -Ilib/librte_meter -I../lib/librte_meter -Idrivers/bus/pci -I../drivers/bus/pci -I../drivers/bus/pci/linux -Ilib/librte_pci -I../lib/librte_pci -fdiagnostics-color=always -pipe -D_FILE_OFFSET_BITS=64 -Wall -Winvalid-pch -Werror -O3 -include rte_config.h -Wextra -Wcast-qual -Wdeprecated -Wformat-nonliteral -Wformat-security -Wmissing-declarations -Wmissing-prototypes -Wnested-externs -Wold-style-definition -Wpointer-arith -Wsign-compare -Wstrict-prototypes -Wundef -Wwrite-strings -Wno-address-of-packed-member -Wno-packed-not-aligned -Wno-missing-field-initializers -Wno-pointer-to-int-cast -D_GNU_SOURCE -m32 -fPIC -march=native -DALLOW_EXPERIMENTAL_API -DALLOW_INTERNAL_API -Wno-format-truncation -DCC_AVX512_SUPPORT -mavx512f -mavx512bw -mavx512vl -MD -MQ 'drivers/net/virtio/20670f1@@virtio_avx512_lib@sta/virtio_rxtx_packed_avx.c.o' -MF 'drivers/net/virtio/20670f1@@virtio_avx512_lib@sta/virtio_rxtx_packed_avx.c.o.d' -o 'drivers/net/virtio/20670f1@@virtio_avx512_lib@sta/virtio_rxtx_packed_avx.c.o' -c ../drivers/net/virtio/virtio_rxtx_packed_avx.c
In file included from ../drivers/net/virtio/virtio_rxtx_packed_avx.c:16:
../drivers/net/virtio/virtqueue.h:615:1: error: expected identifier or ‘(’ before ‘}’ token
  615 | } while (0)
      | ^
../drivers/net/virtio/virtqueue.h:615:3: error: expected identifier or ‘(’ before ‘while’
  615 | } while (0)
      |   ^~~~~
[1459/2332] Generating rte_pmd_octeontx2.sym_chk with a meson_exe.py custom command.
[1460/2332] Generating rte_pmd_softnic.sym_chk with a meson_exe.py custom command.
[1461/2332] Compiling C object 'drivers/a715181@@tmp_rte_pmd_virtio@sta/net_virtio_virtio_user_vhost_kernel_tap.c.o'.
[1462/2332] Compiling C object 'drivers/a715181@@tmp_rte_pmd_tap@sta/net_tap_rte_eth_tap.c.o'.
[1463/2332] Compiling C object 'drivers/a715181@@tmp_rte_pmd_vhost@sta/net_vhost_rte_eth_vhost.c.o'.
[1464/2332] Compiling C object 'drivers/a715181@@tmp_rte_pmd_thunderx@sta/net_thunderx_nicvf_ethdev.c.o'.
ninja: build stopped: subcommand failed




*Build Failed #18:
OS: UB2004-64
Target: x86_64-clang-static
FAILED: drivers/a715181@@tmp_rte_pmd_virtio@sta/net_virtio_virtio_ethdev.c.o 
clang -Idrivers/a715181@@tmp_rte_pmd_virtio@sta -Idrivers -I../drivers -Idrivers/net/virtio -I../drivers/net/virtio -Ilib/librte_ethdev -I../lib/librte_ethdev -I. -I../ -Iconfig -I../config -Ilib/librte_eal/include -I../lib/librte_eal/include -Ilib/librte_eal/linux/include -I../lib/librte_eal/linux/include -Ilib/librte_eal/x86/include -I../lib/librte_eal/x86/include -Ilib/librte_eal/common -I../lib/librte_eal/common -Ilib/librte_eal -I../lib/librte_eal -Ilib/librte_kvargs -I../lib/librte_kvargs -Ilib/librte_telemetry/../librte_metrics -I../lib/librte_telemetry/../librte_metrics -Ilib/librte_telemetry -I../lib/librte_telemetry -Ilib/librte_net -I../lib/librte_net -Ilib/librte_mbuf -I../lib/librte_mbuf -Ilib/librte_mempool -I../lib/librte_mempool -Ilib/librte_ring -I../lib/librte_ring -Ilib/librte_meter -I../lib/librte_meter -Idrivers/bus/pci -I../drivers/bus/pci -I../drivers/bus/pci/linux -Ilib/librte_pci -I../lib/librte_pci -Idrivers/bus/vdev -I../drivers/bus/vdev -Xclang -fcolor-diagnostics -pipe -D_FILE_OFFSET_BITS=64 -Wall -Winvalid-pch -Werror -O3 -include rte_config.h -Wextra -Wcast-qual -Wdeprecated -Wformat-nonliteral -Wformat-security -Wmissing-declarations -Wmissing-prototypes -Wnested-externs -Wold-style-definition -Wpointer-arith -Wsign-compare -Wstrict-prototypes -Wundef -Wwrite-strings -Wno-address-of-packed-member -Wno-missing-field-initializers -D_GNU_SOURCE -fPIC -march=native -DALLOW_EXPERIMENTAL_API -DALLOW_INTERNAL_API -DCC_AVX512_SUPPORT -DVHOST_CLANG_UNROLL_PRAGMA -MD -MQ 'drivers/a715181@@tmp_rte_pmd_virtio@sta/net_virtio_virtio_ethdev.c.o' -MF 'drivers/a715181@@tmp_rte_pmd_virtio@sta/net_virtio_virtio_ethdev.c.o.d' -o 'drivers/a715181@@tmp_rte_pmd_virtio@sta/net_virtio_virtio_ethdev.c.o' -c ../drivers/net/virtio/virtio_ethdev.c
In file included from ../drivers/net/virtio/virtio_ethdev.c:36:
../drivers/net/virtio/virtqueue.h:615:1: error: extraneous closing brace ('}')
} while (0)
^
../drivers/net/virtio/virtqueue.h:615:3: error: expected identifier or '('
} while (0)
  ^
2 errors generated.
[1617/2573] Linking static target drivers/libtmp_rte_pmd_vdev_netvsc.a.
[1618/2573] Compiling C object 'drivers/net/virtio/20670f1@@virtio_avx512_lib@sta/virtio_rxtx_packed_avx.c.o'.
FAILED: drivers/net/virtio/20670f1@@virtio_avx512_lib@sta/virtio_rxtx_packed_avx.c.o 
clang -Idrivers/net/virtio/20670f1@@virtio_avx512_lib@sta -Idrivers/net/virtio -I../drivers/net/virtio -Ilib/librte_ethdev -I../lib/librte_ethdev -I. -I../ -Iconfig -I../config -Ilib/librte_eal/include -I../lib/librte_eal/include -Ilib/librte_eal/linux/include -I../lib/librte_eal/linux/include -Ilib/librte_eal/x86/include -I../lib/librte_eal/x86/include -Ilib/librte_eal/common -I../lib/librte_eal/common -Ilib/librte_eal -I../lib/librte_eal -Ilib/librte_kvargs -I../lib/librte_kvargs -Ilib/librte_telemetry/../librte_metrics -I../lib/librte_telemetry/../librte_metrics -Ilib/librte_telemetry -I../lib/librte_telemetry -Ilib/librte_net -I../lib/librte_net -Ilib/librte_mbuf -I../lib/librte_mbuf -Ilib/librte_mempool -I../lib/librte_mempool -Ilib/librte_ring -I../lib/librte_ring -Ilib/librte_meter -I../lib/librte_meter -Idrivers/bus/pci -I../drivers/bus/pci -I../drivers/bus/pci/linux -Ilib/librte_pci -I../lib/librte_pci -Xclang -fcolor-diagnostics -pipe -D_FILE_OFFSET_BITS=64 -Wall -Winvalid-pch -Werror -O3 -include rte_config.h -Wextra -Wcast-qual -Wdeprecated -Wformat-nonliteral -Wformat-security -Wmissing-declarations -Wmissing-prototypes -Wnested-externs -Wold-style-definition -Wpointer-arith -Wsign-compare -Wstrict-prototypes -Wundef -Wwrite-strings -Wno-address-of-packed-member -Wno-missing-field-initializers -D_GNU_SOURCE -fPIC -march=native -DALLOW_EXPERIMENTAL_API -DALLOW_INTERNAL_API -DCC_AVX512_SUPPORT -mavx512f -mavx512bw -mavx512vl -MD -MQ 'drivers/net/virtio/20670f1@@virtio_avx512_lib@sta/virtio_rxtx_packed_avx.c.o' -MF 'drivers/net/virtio/20670f1@@virtio_avx512_lib@sta/virtio_rxtx_packed_avx.c.o.d' -o 'drivers/net/virtio/20670f1@@virtio_avx512_lib@sta/virtio_rxtx_packed_avx.c.o' -c ../drivers/net/virtio/virtio_rxtx_packed_avx.c
In file included from ../drivers/net/virtio/virtio_rxtx_packed_avx.c:16:
../drivers/net/virtio/virtqueue.h:615:1: error: extraneous closing brace ('}')
} while (0)
^
../drivers/net/virtio/virtqueue.h:615:3: error: expected identifier or '('
} while (0)
  ^
2 errors generated.
[1619/2573] Compiling C object 'drivers/a715181@@rte_pmd_softnic@sta/meson-generated_.._rte_pmd_softnic.pmd.c.o'.
[1620/2573] Compiling C object 'drivers/a715181@@tmp_rte_pmd_virtio@sta/net_virtio_virtio_user_vhost_kernel_tap.c.o'.
[1621/2573] Compiling C object 'drivers/a715181@@tmp_rte_pmd_virtio@sta/net_virtio_virtio_rxtx.c.o'.
FAILED: drivers/a715181@@tmp_rte_pmd_virtio@sta/net_virtio_virtio_rxtx.c.o 
clang -Idrivers/a715181@@tmp_rte_pmd_virtio@sta -Idrivers -I../drivers -Idrivers/net/virtio -I../drivers/net/virtio -Ilib/librte_ethdev -I../lib/librte_ethdev -I. -I../ -Iconfig -I../config -Ilib/librte_eal/include -I../lib/librte_eal/include -Ilib/librte_eal/linux/include -I../lib/librte_eal/linux/include -Ilib/librte_eal/x86/include -I../lib/librte_eal/x86/include -Ilib/librte_eal/common -I../lib/librte_eal/common -Ilib/librte_eal -I../lib/librte_eal -Ilib/librte_kvargs -I../lib/librte_kvargs -Ilib/librte_telemetry/../librte_metrics -I../lib/librte_telemetry/../librte_metrics -Ilib/librte_telemetry -I../lib/librte_telemetry -Ilib/librte_net -I../lib/librte_net -Ilib/librte_mbuf -I../lib/librte_mbuf -Ilib/librte_mempool -I../lib/librte_mempool -Ilib/librte_ring -I../lib/librte_ring -Ilib/librte_meter -I../lib/librte_meter -Idrivers/bus/pci -I../drivers/bus/pci -I../drivers/bus/pci/linux -Ilib/librte_pci -I../lib/librte_pci -Idrivers/bus/vdev -I../drivers/bus/vdev -Xclang -fcolor-diagnostics -pipe -D_FILE_OFFSET_BITS=64 -Wall -Winvalid-pch -Werror -O3 -include rte_config.h -Wextra -Wcast-qual -Wdeprecated -Wformat-nonliteral -Wformat-security -Wmissing-declarations -Wmissing-prototypes -Wnested-externs -Wold-style-definition -Wpointer-arith -Wsign-compare -Wstrict-prototypes -Wundef -Wwrite-strings -Wno-address-of-packed-member -Wno-missing-field-initializers -D_GNU_SOURCE -fPIC -march=native -DALLOW_EXPERIMENTAL_API -DALLOW_INTERNAL_API -DCC_AVX512_SUPPORT -DVHOST_CLANG_UNROLL_PRAGMA -MD -MQ 'drivers/a715181@@tmp_rte_pmd_virtio@sta/net_virtio_virtio_rxtx.c.o' -MF 'drivers/a715181@@tmp_rte_pmd_virtio@sta/net_virtio_virtio_rxtx.c.o.d' -o 'drivers/a715181@@tmp_rte_pmd_virtio@sta/net_virtio_virtio_rxtx.c.o' -c ../drivers/net/virtio/virtio_rxtx.c
In file included from ../drivers/net/virtio/virtio_rxtx.c:31:
../drivers/net/virtio/virtqueue.h:615:1: error: extraneous closing brace ('}')
} while (0)
^
../drivers/net/virtio/virtqueue.h:615:3: error: expected identifier or '('
} while (0)
  ^
2 errors generated.
[1622/2573] Compiling C object 'drivers/a715181@@tmp_rte_pmd_virtio@sta/net_virtio_virtio_pci.c.o'.
FAILED: drivers/a715181@@tmp_rte_pmd_virtio@sta/net_virtio_virtio_pci.c.o 
clang -Idrivers/a715181@@tmp_rte_pmd_virtio@sta -Idrivers -I../drivers -Idrivers/net/virtio -I../drivers/net/virtio -Ilib/librte_ethdev -I../lib/librte_ethdev -I. -I../ -Iconfig -I../config -Ilib/librte_eal/include -I../lib/librte_eal/include -Ilib/librte_eal/linux/include -I../lib/librte_eal/linux/include -Ilib/librte_eal/x86/include -I../lib/librte_eal/x86/include -Ilib/librte_eal/common -I../lib/librte_eal/common -Ilib/librte_eal -I../lib/librte_eal -Ilib/librte_kvargs -I../lib/librte_kvargs -Ilib/librte_telemetry/../librte_metrics -I../lib/librte_telemetry/../librte_metrics -Ilib/librte_telemetry -I../lib/librte_telemetry -Ilib/librte_net -I../lib/librte_net -Ilib/librte_mbuf -I../lib/librte_mbuf -Ilib/librte_mempool -I../lib/librte_mempool -Ilib/librte_ring -I../lib/librte_ring -Ilib/librte_meter -I../lib/librte_meter -Idrivers/bus/pci -I../drivers/bus/pci -I../drivers/bus/pci/linux -Ilib/librte_pci -I../lib/librte_pci -Idrivers/bus/vdev -I../drivers/bus/vdev -Xclang -fcolor-diagnostics -pipe -D_FILE_OFFSET_BITS=64 -Wall -Winvalid-pch -Werror -O3 -include rte_config.h -Wextra -Wcast-qual -Wdeprecated -Wformat-nonliteral -Wformat-security -Wmissing-declarations -Wmissing-prototypes -Wnested-externs -Wold-style-definition -Wpointer-arith -Wsign-compare -Wstrict-prototypes -Wundef -Wwrite-strings -Wno-address-of-packed-member -Wno-missing-field-initializers -D_GNU_SOURCE -fPIC -march=native -DALLOW_EXPERIMENTAL_API -DALLOW_INTERNAL_API -DCC_AVX512_SUPPORT -DVHOST_CLANG_UNROLL_PRAGMA -MD -MQ 'drivers/a715181@@tmp_rte_pmd_virtio@sta/net_virtio_virtio_pci.c.o' -MF 'drivers/a715181@@tmp_rte_pmd_virtio@sta/net_virtio_virtio_pci.c.o.d' -o 'drivers/a715181@@tmp_rte_pmd_virtio@sta/net_virtio_virtio_pci.c.o' -c ../drivers/net/virtio/virtio_pci.c
In file included from ../drivers/net/virtio/virtio_pci.c:16:
../drivers/net/virtio/virtqueue.h:615:1: error: extraneous closing brace ('}')
} while (0)
^
../drivers/net/virtio/virtqueue.h:615:3: error: expected identifier or '('
} while (0)
  ^
2 errors generated.
[1623/2573] Compiling C object 'drivers/a715181@@tmp_rte_pmd_tap@sta/net_tap_rte_eth_tap.c.o'.
[1624/2573] Compiling C object 'drivers/a715181@@tmp_rte_pmd_thunderx@sta/net_thunderx_nicvf_ethdev.c.o'.
[1625/2573] Compiling C object 'drivers/a715181@@tmp_rte_pmd_vhost@sta/net_vhost_rte_eth_vhost.c.o'.
ninja: build stopped: subcommand failed




*Build Failed #19:
OS: UB2004-64
Target: x86_64-gcc-static
FAILED: drivers/a715181@@tmp_rte_pmd_virtio@sta/net_virtio_virtio_ethdev.c.o 
gcc -Idrivers/a715181@@tmp_rte_pmd_virtio@sta -Idrivers -I../drivers -Idrivers/net/virtio -I../drivers/net/virtio -Ilib/librte_ethdev -I../lib/librte_ethdev -I. -I../ -Iconfig -I../config -Ilib/librte_eal/include -I../lib/librte_eal/include -Ilib/librte_eal/linux/include -I../lib/librte_eal/linux/include -Ilib/librte_eal/x86/include -I../lib/librte_eal/x86/include -Ilib/librte_eal/common -I../lib/librte_eal/common -Ilib/librte_eal -I../lib/librte_eal -Ilib/librte_kvargs -I../lib/librte_kvargs -Ilib/librte_telemetry/../librte_metrics -I../lib/librte_telemetry/../librte_metrics -Ilib/librte_telemetry -I../lib/librte_telemetry -Ilib/librte_net -I../lib/librte_net -Ilib/librte_mbuf -I../lib/librte_mbuf -Ilib/librte_mempool -I../lib/librte_mempool -Ilib/librte_ring -I../lib/librte_ring -Ilib/librte_meter -I../lib/librte_meter -Idrivers/bus/pci -I../drivers/bus/pci -I../drivers/bus/pci/linux -Ilib/librte_pci -I../lib/librte_pci -Idrivers/bus/vdev -I../drivers/bus/vdev -fdiagnostics-color=always -pipe -D_FILE_OFFSET_BITS=64 -Wall -Winvalid-pch -Werror -O3 -include rte_config.h -Wextra -Wcast-qual -Wdeprecated -Wformat-nonliteral -Wformat-security -Wmissing-declarations -Wmissing-prototypes -Wnested-externs -Wold-style-definition -Wpointer-arith -Wsign-compare -Wstrict-prototypes -Wundef -Wwrite-strings -Wno-address-of-packed-member -Wno-packed-not-aligned -Wno-missing-field-initializers -Wno-zero-length-bounds -D_GNU_SOURCE -fPIC -march=native -DALLOW_EXPERIMENTAL_API -DALLOW_INTERNAL_API -Wno-format-truncation -DCC_AVX512_SUPPORT -DVHOST_GCC_UNROLL_PRAGMA -MD -MQ 'drivers/a715181@@tmp_rte_pmd_virtio@sta/net_virtio_virtio_ethdev.c.o' -MF 'drivers/a715181@@tmp_rte_pmd_virtio@sta/net_virtio_virtio_ethdev.c.o.d' -o 'drivers/a715181@@tmp_rte_pmd_virtio@sta/net_virtio_virtio_ethdev.c.o' -c ../drivers/net/virtio/virtio_ethdev.c
In file included from ../drivers/net/virtio/virtio_ethdev.c:36:
../drivers/net/virtio/virtqueue.h:615:1: error: expected identifier or ‘(’ before ‘}’ token
  615 | } while (0)
      | ^
../drivers/net/virtio/virtqueue.h:615:3: error: expected identifier or ‘(’ before ‘while’
  615 | } while (0)
      |   ^~~~~
[1622/2573] Linking static target drivers/libtmp_rte_pmd_vdev_netvsc.a.
[1623/2573] Compiling C object 'drivers/a715181@@tmp_rte_pmd_thunderx@sta/net_thunderx_nicvf_rxtx.c.o'.
[1624/2573] Compiling C object 'drivers/a715181@@tmp_rte_pmd_softnic@sta/net_softnic_rte_eth_softnic_cli.c.o'.
[1625/2573] Compiling C object 'drivers/net/virtio/20670f1@@virtio_avx512_lib@sta/virtio_rxtx_packed_avx.c.o'.
FAILED: drivers/net/virtio/20670f1@@virtio_avx512_lib@sta/virtio_rxtx_packed_avx.c.o 
gcc -Idrivers/net/virtio/20670f1@@virtio_avx512_lib@sta -Idrivers/net/virtio -I../drivers/net/virtio -Ilib/librte_ethdev -I../lib/librte_ethdev -I. -I../ -Iconfig -I../config -Ilib/librte_eal/include -I../lib/librte_eal/include -Ilib/librte_eal/linux/include -I../lib/librte_eal/linux/include -Ilib/librte_eal/x86/include -I../lib/librte_eal/x86/include -Ilib/librte_eal/common -I../lib/librte_eal/common -Ilib/librte_eal -I../lib/librte_eal -Ilib/librte_kvargs -I../lib/librte_kvargs -Ilib/librte_telemetry/../librte_metrics -I../lib/librte_telemetry/../librte_metrics -Ilib/librte_telemetry -I../lib/librte_telemetry -Ilib/librte_net -I../lib/librte_net -Ilib/librte_mbuf -I../lib/librte_mbuf -Ilib/librte_mempool -I../lib/librte_mempool -Ilib/librte_ring -I../lib/librte_ring -Ilib/librte_meter -I../lib/librte_meter -Idrivers/bus/pci -I../drivers/bus/pci -I../drivers/bus/pci/linux -Ilib/librte_pci -I../lib/librte_pci -fdiagnostics-color=always -pipe -D_FILE_OFFSET_BITS=64 -Wall -Winvalid-pch -Werror -O3 -include rte_config.h -Wextra -Wcast-qual -Wdeprecated -Wformat-nonliteral -Wformat-security -Wmissing-declarations -Wmissing-prototypes -Wnested-externs -Wold-style-definition -Wpointer-arith -Wsign-compare -Wstrict-prototypes -Wundef -Wwrite-strings -Wno-address-of-packed-member -Wno-packed-not-aligned -Wno-missing-field-initializers -Wno-zero-length-bounds -D_GNU_SOURCE -fPIC -march=native -DALLOW_EXPERIMENTAL_API -DALLOW_INTERNAL_API -Wno-format-truncation -DCC_AVX512_SUPPORT -mavx512f -mavx512bw -mavx512vl -MD -MQ 'drivers/net/virtio/20670f1@@virtio_avx512_lib@sta/virtio_rxtx_packed_avx.c.o' -MF 'drivers/net/virtio/20670f1@@virtio_avx512_lib@sta/virtio_rxtx_packed_avx.c.o.d' -o 'drivers/net/virtio/20670f1@@virtio_avx512_lib@sta/virtio_rxtx_packed_avx.c.o' -c ../drivers/net/virtio/virtio_rxtx_packed_avx.c
In file included from ../drivers/net/virtio/virtio_rxtx_packed_avx.c:16:
../drivers/net/virtio/virtqueue.h:615:1: error: expected identifier or ‘(’ before ‘}’ token
  615 | } while (0)
      | ^
../drivers/net/virtio/virtqueue.h:615:3: error: expected identifier or ‘(’ before ‘while’
  615 | } while (0)
      |   ^~~~~
[1626/2573] Compiling C object 'drivers/a715181@@tmp_rte_pmd_vhost@sta/net_vhost_rte_eth_vhost.c.o'.
[1627/2573] Compiling C object 'drivers/a715181@@tmp_rte_pmd_virtio@sta/net_virtio_virtio_pci.c.o'.
FAILED: drivers/a715181@@tmp_rte_pmd_virtio@sta/net_virtio_virtio_pci.c.o 
gcc -Idrivers/a715181@@tmp_rte_pmd_virtio@sta -Idrivers -I../drivers -Idrivers/net/virtio -I../drivers/net/virtio -Ilib/librte_ethdev -I../lib/librte_ethdev -I. -I../ -Iconfig -I../config -Ilib/librte_eal/include -I../lib/librte_eal/include -Ilib/librte_eal/linux/include -I../lib/librte_eal/linux/include -Ilib/librte_eal/x86/include -I../lib/librte_eal/x86/include -Ilib/librte_eal/common -I../lib/librte_eal/common -Ilib/librte_eal -I../lib/librte_eal -Ilib/librte_kvargs -I../lib/librte_kvargs -Ilib/librte_telemetry/../librte_metrics -I../lib/librte_telemetry/../librte_metrics -Ilib/librte_telemetry -I../lib/librte_telemetry -Ilib/librte_net -I../lib/librte_net -Ilib/librte_mbuf -I../lib/librte_mbuf -Ilib/librte_mempool -I../lib/librte_mempool -Ilib/librte_ring -I../lib/librte_ring -Ilib/librte_meter -I../lib/librte_meter -Idrivers/bus/pci -I../drivers/bus/pci -I../drivers/bus/pci/linux -Ilib/librte_pci -I../lib/librte_pci -Idrivers/bus/vdev -I../drivers/bus/vdev -fdiagnostics-color=always -pipe -D_FILE_OFFSET_BITS=64 -Wall -Winvalid-pch -Werror -O3 -include rte_config.h -Wextra -Wcast-qual -Wdeprecated -Wformat-nonliteral -Wformat-security -Wmissing-declarations -Wmissing-prototypes -Wnested-externs -Wold-style-definition -Wpointer-arith -Wsign-compare -Wstrict-prototypes -Wundef -Wwrite-strings -Wno-address-of-packed-member -Wno-packed-not-aligned -Wno-missing-field-initializers -Wno-zero-length-bounds -D_GNU_SOURCE -fPIC -march=native -DALLOW_EXPERIMENTAL_API -DALLOW_INTERNAL_API -Wno-format-truncation -DCC_AVX512_SUPPORT -DVHOST_GCC_UNROLL_PRAGMA -MD -MQ 'drivers/a715181@@tmp_rte_pmd_virtio@sta/net_virtio_virtio_pci.c.o' -MF 'drivers/a715181@@tmp_rte_pmd_virtio@sta/net_virtio_virtio_pci.c.o.d' -o 'drivers/a715181@@tmp_rte_pmd_virtio@sta/net_virtio_virtio_pci.c.o' -c ../drivers/net/virtio/virtio_pci.c
In file included from ../drivers/net/virtio/virtio_pci.c:16:
../drivers/net/virtio/virtqueue.h:615:1: error: expected identifier or ‘(’ before ‘}’ token
  615 | } while (0)
      | ^
../drivers/net/virtio/virtqueue.h:615:3: error: expected identifier or ‘(’ before ‘while’
  615 | } while (0)
      |   ^~~~~
[1628/2573] Compiling C object 'drivers/a715181@@tmp_rte_pmd_virtio@sta/net_virtio_virtio_user_vhost_kernel_tap.c.o'.
[1629/2573] Compiling C object 'drivers/a715181@@tmp_rte_pmd_tap@sta/net_tap_rte_eth_tap.c.o'.
[1630/2573] Compiling C object 'drivers/a715181@@tmp_rte_pmd_thunderx@sta/net_thunderx_nicvf_ethdev.c.o'.
ninja: build stopped: subcommand failed




*Build Failed #20:
OS: UB2004-64
Target: x86_64-icc-static
FAILED: drivers/a715181@@tmp_rte_pmd_virtio@sta/net_virtio_virtio_ethdev.c.o 
icc -Idrivers/a715181@@tmp_rte_pmd_virtio@sta -Idrivers -I../drivers -Idrivers/net/virtio -I../drivers/net/virtio -Ilib/librte_ethdev -I../lib/librte_ethdev -I. -I../ -Iconfig -I../config -Ilib/librte_eal/include -I../lib/librte_eal/include -Ilib/librte_eal/linux/include -I../lib/librte_eal/linux/include -Ilib/librte_eal/x86/include -I../lib/librte_eal/x86/include -Ilib/librte_eal/common -I../lib/librte_eal/common -Ilib/librte_eal -I../lib/librte_eal -Ilib/librte_kvargs -I../lib/librte_kvargs -Ilib/librte_telemetry/../librte_metrics -I../lib/librte_telemetry/../librte_metrics -Ilib/librte_telemetry -I../lib/librte_telemetry -Ilib/librte_net -I../lib/librte_net -Ilib/librte_mbuf -I../lib/librte_mbuf -Ilib/librte_mempool -I../lib/librte_mempool -Ilib/librte_ring -I../lib/librte_ring -Ilib/librte_meter -I../lib/librte_meter -Idrivers/bus/pci -I../drivers/bus/pci -I../drivers/bus/pci/linux -Ilib/librte_pci -I../lib/librte_pci -Idrivers/bus/vdev -I../drivers/bus/vdev -pipe -D_FILE_OFFSET_BITS=64 -Wall -w3 -diag-disable:remark -Werror -O3 -include rte_config.h -Wextra -Wcast-qual -Wdeprecated -Wformat-security -Wmissing-declarations -Wmissing-prototypes -Wold-style-definition -Wpointer-arith -Wsign-compare -Wstrict-prototypes -Wundef -Wwrite-strings -Wno-missing-field-initializers -diag-disable=188 -diag-disable=2203 -diag-disable=2279 -diag-disable=2557 -diag-disable=3179 -diag-disable=3656 -D_GNU_SOURCE -fPIC -march=native -DALLOW_EXPERIMENTAL_API -DALLOW_INTERNAL_API -DCC_AVX512_SUPPORT -MD -MQ 'drivers/a715181@@tmp_rte_pmd_virtio@sta/net_virtio_virtio_ethdev.c.o' -MF 'drivers/a715181@@tmp_rte_pmd_virtio@sta/net_virtio_virtio_ethdev.c.o.d' -o 'drivers/a715181@@tmp_rte_pmd_virtio@sta/net_virtio_virtio_ethdev.c.o' -c ../drivers/net/virtio/virtio_ethdev.c
In file included from ../drivers/net/virtio/virtio_ethdev.c(36):
../drivers/net/virtio/virtqueue.h(615): error: expected a declaration
  } while (0)
  ^

In file included from ../drivers/net/virtio/virtio_ethdev.c(36):
../drivers/net/virtio/virtqueue.h(700): error #12: parsing restarts here after previous syntax error
  	head_dp = &vq->vq_packed.ring.desc[idx];
  	                                       ^

In file included from ../drivers/net/virtio/virtio_ethdev.c(36):
../drivers/net/virtio/virtqueue.h(701): error #77: this declaration has no storage class or type specifier
  	head_flags = cookie->next ? VRING_DESC_F_NEXT : 0;
  	^

In file included from ../drivers/net/virtio/virtio_ethdev.c(36):
../drivers/net/virtio/virtqueue.h(701): error: identifier "cookie" is undefined
  	head_flags = cookie->next ? VRING_DESC_F_NEXT : 0;
  	             ^

In file included from ../drivers/net/virtio/virtio_ethdev.c(36):
../drivers/net/virtio/virtqueue.h(702): error #77: this declaration has no storage class or type specifier
  	head_flags |= vq->vq_packed.cached_flags;
  	^

In file included from ../drivers/net/virtio/virtio_ethdev.c(36):
../drivers/net/virtio/virtqueue.h(702): error: expected a ";"
  	head_flags |= vq->vq_packed.cached_flags;
  	           ^

In file included from ../drivers/net/virtio/virtio_ethdev.c(36):
../drivers/net/virtio/virtqueue.h(704): error: expected a declaration
  	if (can_push) {
  	^

In file included from ../drivers/net/virtio/virtio_ethdev.c(36):
../drivers/net/virtio/virtqueue.h(725): error #12: parsing restarts here after previous syntax error
  				VRING_PACKED_DESC_F_AVAIL_USED;
  				                              ^

In file included from ../drivers/net/virtio/virtio_ethdev.c(36):
../drivers/net/virtio/virtqueue.h(726): error: expected a declaration
  		}
  		^

In file included from ../drivers/net/virtio/virtio_ethdev.c(36):
../drivers/net/virtio/virtqueue.h(729): error #12: parsing restarts here after previous syntax error
  	virtqueue_xmit_offload(hdr, cookie, vq->hw->has_tx_offload);
  	                                                           ^

In file included from ../drivers/net/virtio/virtio_ethdev.c(36):
../drivers/net/virtio/virtqueue.h(731): error: expected a declaration
  	do {
  	^

In file included from ../drivers/net/virtio/virtio_ethdev.c(36):
../drivers/net/virtio/virtqueue.h(752): error #12: parsing restarts here after previous syntax error
  				VRING_PACKED_DESC_F_AVAIL_USED;
  				                              ^

In file included from ../drivers/net/virtio/virtio_ethdev.c(36):
../drivers/net/virtio/virtqueue.h(753): error: expected a declaration
  		}
  		^

In file included from ../drivers/net/virtio/virtio_ethdev.c(36):
../drivers/net/virtio/virtqueue.h(756): error: identifier "prev" is undefined
  	start_dp[prev].id = id;
  	         ^

In file included from ../drivers/net/virtio/virtio_ethdev.c(36):
../drivers/net/virtio/virtqueue.h(756): error: expected a ";"
  	start_dp[prev].id = id;
  	              ^

In file included from ../drivers/net/virtio/virtio_ethdev.c(36):
../drivers/net/virtio/virtqueue.h(758): error #77: this declaration has no storage class or type specifier
  	vq->vq_free_cnt = (uint16_t)(vq->vq_free_cnt - needed);
  	^

In file included from ../drivers/net/virtio/virtio_ethdev.c(36):
../drivers/net/virtio/virtqueue.h(758): error: expected a ";"
  	vq->vq_free_cnt = (uint16_t)(vq->vq_free_cnt - needed);
  	  ^

In file included from ../drivers/net/virtio/virtio_ethdev.c(36):
../drivers/net/virtio/virtqueue.h(759): error #77: this declaration has no storage class or type specifier
  	vq->vq_avail_idx = idx;
  	^

In file included from ../drivers/net/virtio/virtio_ethdev.c(36):
../drivers/net/virtio/virtqueue.h(759): error: expected a ";"
  	vq->vq_avail_idx = idx;
  	  ^

In file included from ../drivers/net/virtio/virtio_ethdev.c(36):
../drivers/net/virtio/virtqueue.h(761): error: expected a declaration
  	if (!in_order) {
  	^

In file included from ../drivers/net/virtio/virtio_ethdev.c(36):
../drivers/net/virtio/virtqueue.h(768): error #12: parsing restarts here after previous syntax error
  				     vq->hw->weak_barriers);
  				                           ^

In file included from ../drivers/net/virtio/virtio_ethdev.c(36):
../drivers/net/virtio/virtqueue.h(769): error: expected a declaration
  }
  ^

In file included from ../drivers/net/virtio/virtio_ethdev.c(36):
../drivers/net/virtio/virtqueue.h(816): error #12: parsing restarts here after previous syntax error
  		} while (curr_id != id);
  		                       ^

In file included from ../drivers/net/virtio/virtio_ethdev.c(36):
../drivers/net/virtio/virtqueue.h(817): error: expected a declaration
  	}
  	^

In file included from ../drivers/net/virtio/virtio_ethdev.c(36):
../drivers/net/virtio/virtqueue.h(819): error #77: this declaration has no storage class or type specifier
  	vq->vq_free_cnt += free_cnt;
  	^

In file included from ../drivers/net/virtio/virtio_ethdev.c(36):
../drivers/net/virtio/virtqueue.h(819): error: expected a ";"
  	vq->vq_free_cnt += free_cnt;
  	  ^

In file included from ../drivers/net/virtio/virtio_ethdev.c(36):
../drivers/net/virtio/virtqueue.h(820): error: expected a declaration
  }
  ^

In file included from ../drivers/net/virtio/virtio_ethdev.c(36):
../drivers/net/virtio/virtqueue.h(845): error #12: parsing restarts here after previous syntax error
  			dxp->cookie = NULL;
  			                  ^

In file included from ../drivers/net/virtio/virtio_ethdev.c(36):
../drivers/net/virtio/virtqueue.h(846): error: expected a declaration
  		}
  		^

In file included from ../drivers/net/virtio/virtio_ethdev.c(36):
../drivers/net/virtio/virtqueue.h(848): error: expected a declaration
  	}
  	^

In file included from ../drivers/net/virtio/virtio_ethdev.c(38):
../drivers/net/virtio/virtio_user/virtio_user_dev.h(17): error #12: parsing restarts here after previous syntax error
  };
   ^

In file included from ../drivers/net/virtio/virtio_ethdev.c(38):
../drivers/net/virtio/virtio_user/virtio_user_dev.h(55): error: incomplete type is not allowed
  	struct virtio_user_queue packed_queues[VIRTIO_MAX_VIRTQUEUES];
  	                         ^

compilation aborted for ../drivers/net/virtio/virtio_ethdev.c (code 2)
[1606/2573] Compiling C object 'drivers/a715181@@rte_pmd_softnic@sta/meson-generated_.._rte_pmd_softnic.pmd.c.o'.
[1607/2573] Compiling C object 'drivers/a715181@@rte_pmd_softnic@sha/meson-generated_.._rte_pmd_softnic.pmd.c.o'.
[1608/2573] Compiling C object 'drivers/net/virtio/20670f1@@virtio_avx512_lib@sta/virtio_rxtx_packed_avx.c.o'.
FAILED: drivers/net/virtio/20670f1@@virtio_avx512_lib@sta/virtio_rxtx_packed_avx.c.o 
icc -Idrivers/net/virtio/20670f1@@virtio_avx512_lib@sta -Idrivers/net/virtio -I../drivers/net/virtio -Ilib/librte_ethdev -I../lib/librte_ethdev -I. -I../ -Iconfig -I../config -Ilib/librte_eal/include -I../lib/librte_eal/include -Ilib/librte_eal/linux/include -I../lib/librte_eal/linux/include -Ilib/librte_eal/x86/include -I../lib/librte_eal/x86/include -Ilib/librte_eal/common -I../lib/librte_eal/common -Ilib/librte_eal -I../lib/librte_eal -Ilib/librte_kvargs -I../lib/librte_kvargs -Ilib/librte_telemetry/../librte_metrics -I../lib/librte_telemetry/../librte_metrics -Ilib/librte_telemetry -I../lib/librte_telemetry -Ilib/librte_net -I../lib/librte_net -Ilib/librte_mbuf -I../lib/librte_mbuf -Ilib/librte_mempool -I../lib/librte_mempool -Ilib/librte_ring -I../lib/librte_ring -Ilib/librte_meter -I../lib/librte_meter -Idrivers/bus/pci -I../drivers/bus/pci -I../drivers/bus/pci/linux -Ilib/librte_pci -I../lib/librte_pci -pipe -D_FILE_OFFSET_BITS=64 -Wall -w3 -diag-disable:remark -Werror -O3 -include rte_config.h -Wextra -Wcast-qual -Wdeprecated -Wformat-security -Wmissing-declarations -Wmissing-prototypes -Wold-style-definition -Wpointer-arith -Wsign-compare -Wstrict-prototypes -Wundef -Wwrite-strings -Wno-missing-field-initializers -diag-disable=188 -diag-disable=2203 -diag-disable=2279 -diag-disable=2557 -diag-disable=3179 -diag-disable=3656 -D_GNU_SOURCE -fPIC -march=native -DALLOW_EXPERIMENTAL_API -DALLOW_INTERNAL_API -DCC_AVX512_SUPPORT -mavx512f -mavx512bw -mavx512vl -MD -MQ 'drivers/net/virtio/20670f1@@virtio_avx512_lib@sta/virtio_rxtx_packed_avx.c.o' -MF 'drivers/net/virtio/20670f1@@virtio_avx512_lib@sta/virtio_rxtx_packed_avx.c.o.d' -o 'drivers/net/virtio/20670f1@@virtio_avx512_lib@sta/virtio_rxtx_packed_avx.c.o' -c ../drivers/net/virtio/virtio_rxtx_packed_avx.c
In file included from ../drivers/net/virtio/virtio_rxtx_packed_avx.c(16):
../drivers/net/virtio/virtqueue.h(615): error: expected a declaration
  } while (0)
  ^

In file included from ../drivers/net/virtio/virtio_rxtx_packed_avx.c(16):
../drivers/net/virtio/virtqueue.h(700): error #12: parsing restarts here after previous syntax error
  	head_dp = &vq->vq_packed.ring.desc[idx];
  	                                       ^

In file included from ../drivers/net/virtio/virtio_rxtx_packed_avx.c(16):
../drivers/net/virtio/virtqueue.h(701): error #77: this declaration has no storage class or type specifier
  	head_flags = cookie->next ? VRING_DESC_F_NEXT : 0;
  	^

In file included from ../drivers/net/virtio/virtio_rxtx_packed_avx.c(16):
../drivers/net/virtio/virtqueue.h(701): error: identifier "cookie" is undefined
  	head_flags = cookie->next ? VRING_DESC_F_NEXT : 0;
  	             ^

In file included from ../drivers/net/virtio/virtio_rxtx_packed_avx.c(16):
../drivers/net/virtio/virtqueue.h(702): error #77: this declaration has no storage class or type specifier
  	head_flags |= vq->vq_packed.cached_flags;
  	^

In file included from ../drivers/net/virtio/virtio_rxtx_packed_avx.c(16):
../drivers/net/virtio/virtqueue.h(702): error: expected a ";"
  	head_flags |= vq->vq_packed.cached_flags;
  	           ^

In file included from ../drivers/net/virtio/virtio_rxtx_packed_avx.c(16):
../drivers/net/virtio/virtqueue.h(704): error: expected a declaration
  	if (can_push) {
  	^

In file included from ../drivers/net/virtio/virtio_rxtx_packed_avx.c(16):
../drivers/net/virtio/virtqueue.h(725): error #12: parsing restarts here after previous syntax error
  				VRING_PACKED_DESC_F_AVAIL_USED;
  				                              ^

In file included from ../drivers/net/virtio/virtio_rxtx_packed_avx.c(16):
../drivers/net/virtio/virtqueue.h(726): error: expected a declaration
  		}
  		^

In file included from ../drivers/net/virtio/virtio_rxtx_packed_avx.c(16):
../drivers/net/virtio/virtqueue.h(729): error #12: parsing restarts here after previous syntax error
  	virtqueue_xmit_offload(hdr, cookie, vq->hw->has_tx_offload);
  	                                                           ^

In file included from ../drivers/net/virtio/virtio_rxtx_packed_avx.c(16):
../drivers/net/virtio/virtqueue.h(731): error: expected a declaration
  	do {
  	^

In file included from ../drivers/net/virtio/virtio_rxtx_packed_avx.c(16):
../drivers/net/virtio/virtqueue.h(752): error #12: parsing restarts here after previous syntax error
  				VRING_PACKED_DESC_F_AVAIL_USED;
  				                              ^

In file included from ../drivers/net/virtio/virtio_rxtx_packed_avx.c(16):
../drivers/net/virtio/virtqueue.h(753): error: expected a declaration
  		}
  		^

In file included from ../drivers/net/virtio/virtio_rxtx_packed_avx.c(16):
../drivers/net/virtio/virtqueue.h(756): error: identifier "prev" is undefined
  	start_dp[prev].id = id;
  	         ^

In file included from ../drivers/net/virtio/virtio_rxtx_packed_avx.c(16):
../drivers/net/virtio/virtqueue.h(756): error: expected a ";"
  	start_dp[prev].id = id;
  	              ^

In file included from ../drivers/net/virtio/virtio_rxtx_packed_avx.c(16):
../drivers/net/virtio/virtqueue.h(758): error #77: this declaration has no storage class or type specifier
  	vq->vq_free_cnt = (uint16_t)(vq->vq_free_cnt - needed);
  	^

In file included from ../drivers/net/virtio/virtio_rxtx_packed_avx.c(16):
../drivers/net/virtio/virtqueue.h(758): error: expected a ";"
  	vq->vq_free_cnt = (uint16_t)(vq->vq_free_cnt - needed);
  	  ^

In file included from ../drivers/net/virtio/virtio_rxtx_packed_avx.c(16):
../drivers/net/virtio/virtqueue.h(759): error #77: this declaration has no storage class or type specifier
  	vq->vq_avail_idx = idx;
  	^

In file included from ../drivers/net/virtio/virtio_rxtx_packed_avx.c(16):
../drivers/net/virtio/virtqueue.h(759): error: expected a ";"
  	vq->vq_avail_idx = idx;
  	  ^

In file included from ../drivers/net/virtio/virtio_rxtx_packed_avx.c(16):
../drivers/net/virtio/virtqueue.h(761): error: expected a declaration
  	if (!in_order) {
  	^

In file included from ../drivers/net/virtio/virtio_rxtx_packed_avx.c(16):
../drivers/net/virtio/virtqueue.h(768): error #12: parsing restarts here after previous syntax error
  				     vq->hw->weak_barriers);
  				                           ^

In file included from ../drivers/net/virtio/virtio_rxtx_packed_avx.c(16):
../drivers/net/virtio/virtqueue.h(769): error: expected a declaration
  }
  ^

In file included from ../drivers/net/virtio/virtio_rxtx_packed_avx.c(16):
../drivers/net/virtio/virtqueue.h(816): error #12: parsing restarts here after previous syntax error
  		} while (curr_id != id);
  		                       ^

In file included from ../drivers/net/virtio/virtio_rxtx_packed_avx.c(16):
../drivers/net/virtio/virtqueue.h(817): error: expected a declaration
  	}
  	^

In file included from ../drivers/net/virtio/virtio_rxtx_packed_avx.c(16):
../drivers/net/virtio/virtqueue.h(819): error #77: this declaration has no storage class or type specifier
  	vq->vq_free_cnt += free_cnt;
  	^

In file included from ../drivers/net/virtio/virtio_rxtx_packed_avx.c(16):
../drivers/net/virtio/virtqueue.h(819): error: expected a ";"
  	vq->vq_free_cnt += free_cnt;
  	  ^

In file included from ../drivers/net/virtio/virtio_rxtx_packed_avx.c(16):
../drivers/net/virtio/virtqueue.h(820): error: expected a declaration
  }
  ^

In file included from ../drivers/net/virtio/virtio_rxtx_packed_avx.c(16):
../drivers/net/virtio/virtqueue.h(845): error #12: parsing restarts here after previous syntax error
  			dxp->cookie = NULL;
  			                  ^

In file included from ../drivers/net/virtio/virtio_rxtx_packed_avx.c(16):
../drivers/net/virtio/virtqueue.h(846): error: expected a declaration
  		}
  		^

In file included from ../drivers/net/virtio/virtio_rxtx_packed_avx.c(16):
../drivers/net/virtio/virtqueue.h(848): error: expected a declaration
  	}
  	^

../drivers/net/virtio/virtio_rxtx_packed_avx.c(107): error #12: parsing restarts here after previous syntax error
  	__m256i mbuf_ref = _mm256_set1_epi64x(DEFAULT_REARM_DATA);
  	                                                         ^

../drivers/net/virtio/virtio_rxtx_packed_avx.c(108): error: function call is not allowed in a constant expression
  	__m256i head_rooms = _mm256_set1_epi16(head_size);
  	                     ^

../drivers/net/virtio/virtio_rxtx_packed_avx.c(108): error: identifier "head_size" is undefined
  	__m256i head_rooms = _mm256_set1_epi16(head_size);
  	                                       ^

../drivers/net/virtio/virtio_rxtx_packed_avx.c(112): error #77: this declaration has no storage class or type specifier
  	cmp = _mm256_mask_cmpneq_epu16_mask(mask, mbufs, mbuf_ref);
  	^

../drivers/net/virtio/virtio_rxtx_packed_avx.c(112): error: function call is not allowed in a constant expression
  	cmp = _mm256_mask_cmpneq_epu16_mask(mask, mbufs, mbuf_ref);
  	      ^

../drivers/net/virtio/virtio_rxtx_packed_avx.c(112): error: identifier "mbufs" is undefined
  	cmp = _mm256_mask_cmpneq_epu16_mask(mask, mbufs, mbuf_ref);
  	      ^

../drivers/net/virtio/virtio_rxtx_packed_avx.c(112): error: identifier "mbuf_ref" is undefined
  	cmp = _mm256_mask_cmpneq_epu16_mask(mask, mbufs, mbuf_ref);
  	      ^

../drivers/net/virtio/virtio_rxtx_packed_avx.c(113): error: expected a declaration
  	if (unlikely(cmp))
  	^

../drivers/net/virtio/virtio_rxtx_packed_avx.c(118): error: expected an identifier
  	RTE_BUILD_BUG_ON(offsetof(struct rte_mbuf, data_off) !=
  	^

../drivers/net/virtio/virtio_rxtx_packed_avx.c(118): error: expected a ")"
  	RTE_BUILD_BUG_ON(offsetof(struct rte_mbuf, data_off) !=
  	^

../drivers/net/virtio/virtio_rxtx_packed_avx.c(120): error #77: this declaration has no storage class or type specifier
  	cmp = _mm256_mask_cmplt_epu16_mask(data_mask, mbufs, head_rooms);
  	^

../drivers/net/virtio/virtio_rxtx_packed_avx.c(120): error: variable "cmp" has already been initialized
  	cmp = _mm256_mask_cmplt_epu16_mask(data_mask, mbufs, head_rooms);
  	^

../drivers/net/virtio/virtio_rxtx_packed_avx.c(120): error: function call is not allowed in a constant expression
  	cmp = _mm256_mask_cmplt_epu16_mask(data_mask, mbufs, head_rooms);
  	      ^

../drivers/net/virtio/virtio_rxtx_packed_avx.c(121): error: expected a declaration
  	if (unlikely(cmp))
  	^

../drivers/net/virtio/virtio_rxtx_packed_avx.c(124): error: expected a declaration
  	virtio_for_each_try_unroll(i, 0, PACKED_BATCH_SIZE) {
  	^

../drivers/net/virtio/virtio_rxtx_packed_avx.c(142): error #12: parsing restarts here after previous syntax error
  			VIRTIO_MBUF_ADDR(tx_pkts[0], vq));
  			                                 ^

../drivers/net/virtio/virtio_rxtx_packed_avx.c(145): error: function call is not allowed in a constant expression
  	__m512i data_offsets = _mm512_set_epi64((uint64_t)3 << ID_BITS_OFFSET,
  	                       ^

../drivers/net/virtio/virtio_rxtx_packed_avx.c(146): error: identifier "tx_pkts" is undefined
  						tx_pkts[3]->data_off,
  						^

../drivers/net/virtio/virtio_rxtx_packed_avx.c(153): error: function call is not allowed in a constant expression
  	__m512i new_descs = _mm512_add_epi64(descs_base, data_offsets);
  	                    ^

../drivers/net/virtio/virtio_rxtx_packed_avx.c(153): error: identifier "descs_base" is undefined
  	__m512i new_descs = _mm512_add_epi64(descs_base, data_offsets);
  	                                     ^

../drivers/net/virtio/virtio_rxtx_packed_avx.c(155): error: identifier "idx" is undefined
  	uint64_t flags_temp = (uint64_t)idx << ID_BITS_OFFSET |
  	                                ^

../drivers/net/virtio/virtio_rxtx_packed_avx.c(156): error: expression must have a constant value
  		(uint64_t)vq->vq_packed.cached_flags << FLAGS_BITS_OFFSET;
  		          ^

../drivers/net/virtio/virtio_rxtx_packed_avx.c(159): error: function call is not allowed in a constant expression
  	__m128i flag_offset = _mm_set_epi64x(flags_temp, 0);
  	                      ^

../drivers/net/virtio/virtio_rxtx_packed_avx.c(160): error: function call is not allowed in a constant expression
  	__m512i v_offset = _mm512_broadcast_i32x4(flag_offset);
  	                   ^

../drivers/net/virtio/virtio_rxtx_packed_avx.c(161): error: function call is not allowed in a constant expression
  	__m512i v_desc = _mm512_add_epi64(new_descs, v_offset);
  	                 ^

../drivers/net/virtio/virtio_rxtx_packed_avx.c(163): error: expected a declaration
  	if (!vq->hw->has_tx_offload) {
  	^

../drivers/net/virtio/virtio_rxtx_packed_avx.c(185): error #12: parsing restarts here after previous syntax error
  	_mm512_storeu_si512((void *)&vq->vq_packed.ring.desc[idx], v_desc);
  	                                                                  ^

../drivers/net/virtio/virtio_rxtx_packed_avx.c(187): error: expected a type specifier
  	virtio_update_batch_stats(&txvq->stats, tx_pkts[0]->pkt_len,
  	                          ^

../drivers/net/virtio/virtio_rxtx_packed_avx.c(187): error: "tx_pkts" is not a type name
  	virtio_update_batch_stats(&txvq->stats, tx_pkts[0]->pkt_len,
  	                                        ^

../drivers/net/virtio/virtio_rxtx_packed_avx.c(187): error: expected a ")"
  	virtio_update_batch_stats(&txvq->stats, tx_pkts[0]->pkt_len,
  	                                                  ^

../drivers/net/virtio/virtio_rxtx_packed_avx.c(187): error #77: this declaration has no storage class or type specifier
  	virtio_update_batch_stats(&txvq->stats, tx_pkts[0]->pkt_len,
  	^

../drivers/net/virtio/virtio_rxtx_packed_avx.c(191): error #77: this declaration has no storage class or type specifier
  	vq->vq_avail_idx += PACKED_BATCH_SIZE;
  	^

../drivers/net/virtio/virtio_rxtx_packed_avx.c(191): error: expected a ";"
  	vq->vq_avail_idx += PACKED_BATCH_SIZE;
  	  ^

../drivers/net/virtio/virtio_rxtx_packed_avx.c(192): error #77: this declaration has no storage class or type specifier
  	vq->vq_free_cnt -= PACKED_BATCH_SIZE;
  	^

../drivers/net/virtio/virtio_rxtx_packed_avx.c(192): error: expected a ";"
  	vq->vq_free_cnt -= PACKED_BATCH_SIZE;
  	  ^

../drivers/net/virtio/virtio_rxtx_packed_avx.c(194): error: expected a declaration
  	if (vq->vq_avail_idx >= vq->vq_nentries) {
  	^

../drivers/net/virtio/virtio_rxtx_packed_avx.c(200): error #12: parsing restarts here after previous syntax error
  	return 0;
  	        ^

../drivers/net/virtio/virtio_rxtx_packed_avx.c(201): error: expected a declaration
  }
  ^

../drivers/net/virtio/virtio_rxtx_packed_avx.c(227): error #12: parsing restarts here after previous syntax error
  		virtio_xmit_cleanup_inorder_packed(vq, need);
  		                                            ^

../drivers/net/virtio/virtio_rxtx_packed_avx.c(228): error #77: this declaration has no storage class or type specifier
  		need = slots - vq->vq_free_cnt;
  		^

../drivers/net/virtio/virtio_rxtx_packed_avx.c(228): error: identifier "slots" is undefined
  		need = slots - vq->vq_free_cnt;
  		       ^

../drivers/net/virtio/virtio_rxtx_packed_avx.c(228): error: expression must have a constant value
  		need = slots - vq->vq_free_cnt;
  		               ^

../drivers/net/virtio/virtio_rxtx_packed_avx.c(229): error: expected a declaration
  		if (unlikely(need > 0)) {
  		^

../drivers/net/virtio/virtio_rxtx_packed_avx.c(237): error #12: parsing restarts here after previous syntax error
  	virtqueue_enqueue_xmit_packed(txvq, txm, slots, can_push, 1);
  	                                                            ^

../drivers/net/virtio/virtio_rxtx_packed_avx.c(239): error #77: this declaration has no storage class or type specifier
  	txvq->stats.bytes += txm->pkt_len;
  	^

../drivers/net/virtio/virtio_rxtx_packed_avx.c(239): error: expected a ";"
  	txvq->stats.bytes += txm->pkt_len;
  	    ^

../drivers/net/virtio/virtio_rxtx_packed_avx.c(240): error: expected a declaration
  	return 0;
  	^

../drivers/net/virtio/virtio_rxtx_packed_avx.c(241): error: expected a declaration
  }
  ^

../drivers/net/virtio/virtio_rxtx_packed_avx.c(281): error #12: parsing restarts here after previous syntax error
  		break;
  		     ^

../drivers/net/virtio/virtio_rxtx_packed_avx.c(282): error: expected a declaration
  	};
  	^

../drivers/net/virtio/virtio_rxtx_packed_avx.c(284): error #77: this declaration has no storage class or type specifier
  	txvq->stats.packets += nb_tx;
  	^

../drivers/net/virtio/virtio_rxtx_packed_avx.c(284): error: expected a ";"
  	txvq->stats.packets += nb_tx;
  	    ^

../drivers/net/virtio/virtio_rxtx_packed_avx.c(286): error: expected a declaration
  	if (likely(nb_tx)) {
  	^

../drivers/net/virtio/virtio_rxtx_packed_avx.c(293): error #12: parsing restarts here after previous syntax error
  	return nb_tx;
  	            ^

../drivers/net/virtio/virtio_rxtx_packed_avx.c(294): error: expected a declaration
  }
  ^

../drivers/net/virtio/virtio_rxtx_packed_avx.c(345): error #12: parsing restarts here after previous syntax error
  	return 0;
  	        ^

../drivers/net/virtio/virtio_rxtx_packed_avx.c(346): error: expected a declaration
  }
  ^

../drivers/net/virtio/virtio_rxtx_packed_avx.c(372): error #12: parsing restarts here after previous syntax error
  	__m512i v_mask = _mm512_maskz_set1_epi64(0xaa, PACKED_FLAGS_MASK);
  	                                                                 ^

../drivers/net/virtio/virtio_rxtx_packed_avx.c(374): error #77: this declaration has no storage class or type specifier
  	desc_addr = &vq->vq_packed.ring.desc[id];
  	^

../drivers/net/virtio/virtio_rxtx_packed_avx.c(374): error: expression must have a constant value
  	desc_addr = &vq->vq_packed.ring.desc[id];
  	             ^

../drivers/net/virtio/virtio_rxtx_packed_avx.c(374): error: identifier "id" is undefined
  	desc_addr = &vq->vq_packed.ring.desc[id];
  	                                     ^

../drivers/net/virtio/virtio_rxtx_packed_avx.c(376): error: variable "v_desc" has already been initialized
  	__m512i v_desc = _mm512_loadu_si512(desc_addr);
  	        ^

../drivers/net/virtio/virtio_rxtx_packed_avx.c(376): error: function call is not allowed in a constant expression
  	__m512i v_desc = _mm512_loadu_si512(desc_addr);
  	                 ^

../drivers/net/virtio/virtio_rxtx_packed_avx.c(377): error: function call is not allowed in a constant expression
  	__m512i v_flag = _mm512_and_epi64(v_desc, v_mask);
  	                 ^

../drivers/net/virtio/virtio_rxtx_packed_avx.c(377): error: identifier "v_mask" is undefined
  	__m512i v_flag = _mm512_and_epi64(v_desc, v_mask);
  	                                          ^

../drivers/net/virtio/virtio_rxtx_packed_avx.c(379): error: function call is not allowed in a constant expression
  	__m512i v_used_flag = _mm512_setzero_si512();
  	                      ^

../drivers/net/virtio/virtio_rxtx_packed_avx.c(379): error: function call is not allowed in a constant expression
  	__m512i v_used_flag = _mm512_setzero_si512();
  	                      ^

../drivers/net/virtio/virtio_rxtx_packed_avx.c(380): error: expected a declaration
  	if (vq->vq_packed.used_wrap_counter)
  	^

../drivers/net/virtio/virtio_rxtx_packed_avx.c(385): error #12: parsing restarts here after previous syntax error
  		v_used_flag = _mm512_maskz_set1_epi64(0xaa, PACKED_FLAGS_MASK);
  		                                                              ^

../drivers/net/virtio/virtio_rxtx_packed_avx.c(389): error #77: this declaration has no storage class or type specifier
  	desc_stats = _mm512_cmpneq_epu64_mask(v_flag, v_used_flag);
  	^

compilation aborted for ../drivers/net/virtio/virtio_rxtx_packed_avx.c (code 4)
[1609/2573] Compiling C object 'drivers/a715181@@rte_pmd_vdev_netvsc@sta/meson-generated_.._rte_pmd_vdev_netvsc.pmd.c.o'.
[1610/2573] Compiling C object 'drivers/a715181@@tmp_rte_pmd_thunderx@sta/net_thunderx_nicvf_rxtx.c.o'.
[1611/2573] Compiling C object 'drivers/a715181@@tmp_rte_pmd_vhost@sta/net_vhost_rte_eth_vhost.c.o'.
[1612/2573] Compiling C object 'drivers/a715181@@tmp_rte_pmd_tap@sta/net_tap_rte_eth_tap.c.o'.
[1613/2573] Compiling C object 'drivers/a715181@@tmp_rte_pmd_thunderx@sta/net_thunderx_nicvf_ethdev.c.o'.
[1614/2573] Compiling C object 'drivers/a715181@@tmp_rte_pmd_octeontx2@sta/net_octeontx2_otx2_tx.c.o'.
ninja: build stopped: subcommand failed




*Build Failed #21:
OS: UB2004-64
Target: x86_64-gcc-doc
FAILED: drivers/a715181@@tmp_rte_pmd_virtio@sta/net_virtio_virtio_pci.c.o 
gcc -Idrivers/a715181@@tmp_rte_pmd_virtio@sta -Idrivers -I../drivers -Idrivers/net/virtio -I../drivers/net/virtio -Ilib/librte_ethdev -I../lib/librte_ethdev -I. -I../ -Iconfig -I../config -Ilib/librte_eal/include -I../lib/librte_eal/include -Ilib/librte_eal/linux/include -I../lib/librte_eal/linux/include -Ilib/librte_eal/x86/include -I../lib/librte_eal/x86/include -Ilib/librte_eal/common -I../lib/librte_eal/common -Ilib/librte_eal -I../lib/librte_eal -Ilib/librte_kvargs -I../lib/librte_kvargs -Ilib/librte_telemetry/../librte_metrics -I../lib/librte_telemetry/../librte_metrics -Ilib/librte_telemetry -I../lib/librte_telemetry -Ilib/librte_net -I../lib/librte_net -Ilib/librte_mbuf -I../lib/librte_mbuf -Ilib/librte_mempool -I../lib/librte_mempool -Ilib/librte_ring -I../lib/librte_ring -Ilib/librte_meter -I../lib/librte_meter -Idrivers/bus/pci -I../drivers/bus/pci -I../drivers/bus/pci/linux -Ilib/librte_pci -I../lib/librte_pci -Idrivers/bus/vdev -I../drivers/bus/vdev -fdiagnostics-color=always -pipe -D_FILE_OFFSET_BITS=64 -Wall -Winvalid-pch -Werror -O3 -include rte_config.h -Wextra -Wcast-qual -Wdeprecated -Wformat-nonliteral -Wformat-security -Wmissing-declarations -Wmissing-prototypes -Wnested-externs -Wold-style-definition -Wpointer-arith -Wsign-compare -Wstrict-prototypes -Wundef -Wwrite-strings -Wno-address-of-packed-member -Wno-packed-not-aligned -Wno-missing-field-initializers -D_GNU_SOURCE -fPIC -march=native -DALLOW_EXPERIMENTAL_API -DALLOW_INTERNAL_API -Wno-format-truncation -DCC_AVX512_SUPPORT -DVHOST_GCC_UNROLL_PRAGMA -MD -MQ 'drivers/a715181@@tmp_rte_pmd_virtio@sta/net_virtio_virtio_pci.c.o' -MF 'drivers/a715181@@tmp_rte_pmd_virtio@sta/net_virtio_virtio_pci.c.o.d' -o 'drivers/a715181@@tmp_rte_pmd_virtio@sta/net_virtio_virtio_pci.c.o' -c ../drivers/net/virtio/virtio_pci.c
In file included from ../drivers/net/virtio/virtio_pci.c:16:
../drivers/net/virtio/virtqueue.h:615:1: error: expected identifier or ‘(’ before ‘}’ token
  615 | } while (0)
      | ^
../drivers/net/virtio/virtqueue.h:615:3: error: expected identifier or ‘(’ before ‘while’
  615 | } while (0)
      |   ^~~~~
[1628/2432] Compiling C object 'drivers/a715181@@tmp_rte_pmd_virtio@sta/net_virtio_virtio_ethdev.c.o'.
FAILED: drivers/a715181@@tmp_rte_pmd_virtio@sta/net_virtio_virtio_ethdev.c.o 
gcc -Idrivers/a715181@@tmp_rte_pmd_virtio@sta -Idrivers -I../drivers -Idrivers/net/virtio -I../drivers/net/virtio -Ilib/librte_ethdev -I../lib/librte_ethdev -I. -I../ -Iconfig -I../config -Ilib/librte_eal/include -I../lib/librte_eal/include -Ilib/librte_eal/linux/include -I../lib/librte_eal/linux/include -Ilib/librte_eal/x86/include -I../lib/librte_eal/x86/include -Ilib/librte_eal/common -I../lib/librte_eal/common -Ilib/librte_eal -I../lib/librte_eal -Ilib/librte_kvargs -I../lib/librte_kvargs -Ilib/librte_telemetry/../librte_metrics -I../lib/librte_telemetry/../librte_metrics -Ilib/librte_telemetry -I../lib/librte_telemetry -Ilib/librte_net -I../lib/librte_net -Ilib/librte_mbuf -I../lib/librte_mbuf -Ilib/librte_mempool -I../lib/librte_mempool -Ilib/librte_ring -I../lib/librte_ring -Ilib/librte_meter -I../lib/librte_meter -Idrivers/bus/pci -I../drivers/bus/pci -I../drivers/bus/pci/linux -Ilib/librte_pci -I../lib/librte_pci -Idrivers/bus/vdev -I../drivers/bus/vdev -fdiagnostics-color=always -pipe -D_FILE_OFFSET_BITS=64 -Wall -Winvalid-pch -Werror -O3 -include rte_config.h -Wextra -Wcast-qual -Wdeprecated -Wformat-nonliteral -Wformat-security -Wmissing-declarations -Wmissing-prototypes -Wnested-externs -Wold-style-definition -Wpointer-arith -Wsign-compare -Wstrict-prototypes -Wundef -Wwrite-strings -Wno-address-of-packed-member -Wno-packed-not-aligned -Wno-missing-field-initializers -D_GNU_SOURCE -fPIC -march=native -DALLOW_EXPERIMENTAL_API -DALLOW_INTERNAL_API -Wno-format-truncation -DCC_AVX512_SUPPORT -DVHOST_GCC_UNROLL_PRAGMA -MD -MQ 'drivers/a715181@@tmp_rte_pmd_virtio@sta/net_virtio_virtio_ethdev.c.o' -MF 'drivers/a715181@@tmp_rte_pmd_virtio@sta/net_virtio_virtio_ethdev.c.o.d' -o 'drivers/a715181@@tmp_rte_pmd_virtio@sta/net_virtio_virtio_ethdev.c.o' -c ../drivers/net/virtio/virtio_ethdev.c
In file included from ../drivers/net/virtio/virtio_ethdev.c:36:
../drivers/net/virtio/virtqueue.h:615:1: error: expected identifier or ‘(’ before ‘}’ token
  615 | } while (0)
      | ^
../drivers/net/virtio/virtqueue.h:615:3: error: expected identifier or ‘(’ before ‘while’
  615 | } while (0)
      |   ^~~~~
[1629/2432] Generating rte_pmd_softnic.pmd.c with a custom command.
[1630/2432] Compiling C object 'drivers/net/virtio/20670f1@@virtio_avx512_lib@sta/virtio_rxtx_packed_avx.c.o'.
FAILED: drivers/net/virtio/20670f1@@virtio_avx512_lib@sta/virtio_rxtx_packed_avx.c.o 
gcc -Idrivers/net/virtio/20670f1@@virtio_avx512_lib@sta -Idrivers/net/virtio -I../drivers/net/virtio -Ilib/librte_ethdev -I../lib/librte_ethdev -I. -I../ -Iconfig -I../config -Ilib/librte_eal/include -I../lib/librte_eal/include -Ilib/librte_eal/linux/include -I../lib/librte_eal/linux/include -Ilib/librte_eal/x86/include -I../lib/librte_eal/x86/include -Ilib/librte_eal/common -I../lib/librte_eal/common -Ilib/librte_eal -I../lib/librte_eal -Ilib/librte_kvargs -I../lib/librte_kvargs -Ilib/librte_telemetry/../librte_metrics -I../lib/librte_telemetry/../librte_metrics -Ilib/librte_telemetry -I../lib/librte_telemetry -Ilib/librte_net -I../lib/librte_net -Ilib/librte_mbuf -I../lib/librte_mbuf -Ilib/librte_mempool -I../lib/librte_mempool -Ilib/librte_ring -I../lib/librte_ring -Ilib/librte_meter -I../lib/librte_meter -Idrivers/bus/pci -I../drivers/bus/pci -I../drivers/bus/pci/linux -Ilib/librte_pci -I../lib/librte_pci -fdiagnostics-color=always -pipe -D_FILE_OFFSET_BITS=64 -Wall -Winvalid-pch -Werror -O3 -include rte_config.h -Wextra -Wcast-qual -Wdeprecated -Wformat-nonliteral -Wformat-security -Wmissing-declarations -Wmissing-prototypes -Wnested-externs -Wold-style-definition -Wpointer-arith -Wsign-compare -Wstrict-prototypes -Wundef -Wwrite-strings -Wno-address-of-packed-member -Wno-packed-not-aligned -Wno-missing-field-initializers -D_GNU_SOURCE -fPIC -march=native -DALLOW_EXPERIMENTAL_API -DALLOW_INTERNAL_API -Wno-format-truncation -DCC_AVX512_SUPPORT -mavx512f -mavx512bw -mavx512vl -MD -MQ 'drivers/net/virtio/20670f1@@virtio_avx512_lib@sta/virtio_rxtx_packed_avx.c.o' -MF 'drivers/net/virtio/20670f1@@virtio_avx512_lib@sta/virtio_rxtx_packed_avx.c.o.d' -o 'drivers/net/virtio/20670f1@@virtio_avx512_lib@sta/virtio_rxtx_packed_avx.c.o' -c ../drivers/net/virtio/virtio_rxtx_packed_avx.c
In file included from ../drivers/net/virtio/virtio_rxtx_packed_avx.c:16:
../drivers/net/virtio/virtqueue.h:615:1: error: expected identifier or ‘(’ before ‘}’ token
  615 | } while (0)
      | ^
../drivers/net/virtio/virtqueue.h:615:3: error: expected identifier or ‘(’ before ‘while’
  615 | } while (0)
      |   ^~~~~
[1631/2432] Compiling C object 'drivers/a715181@@tmp_rte_pmd_vdev_netvsc@sta/net_vdev_netvsc_vdev_netvsc.c.o'.
[1632/2432] Compiling C object 'drivers/a715181@@tmp_rte_pmd_virtio@sta/net_virtio_virtio_user_vhost_kernel_tap.c.o'.
[1633/2432] Compiling C object 'drivers/a715181@@tmp_rte_pmd_virtio@sta/net_virtio_virtio_rxtx.c.o'.
FAILED: drivers/a715181@@tmp_rte_pmd_virtio@sta/net_virtio_virtio_rxtx.c.o 
gcc -Idrivers/a715181@@tmp_rte_pmd_virtio@sta -Idrivers -I../drivers -Idrivers/net/virtio -I../drivers/net/virtio -Ilib/librte_ethdev -I../lib/librte_ethdev -I. -I../ -Iconfig -I../config -Ilib/librte_eal/include -I../lib/librte_eal/include -Ilib/librte_eal/linux/include -I../lib/librte_eal/linux/include -Ilib/librte_eal/x86/include -I../lib/librte_eal/x86/include -Ilib/librte_eal/common -I../lib/librte_eal/common -Ilib/librte_eal -I../lib/librte_eal -Ilib/librte_kvargs -I../lib/librte_kvargs -Ilib/librte_telemetry/../librte_metrics -I../lib/librte_telemetry/../librte_metrics -Ilib/librte_telemetry -I../lib/librte_telemetry -Ilib/librte_net -I../lib/librte_net -Ilib/librte_mbuf -I../lib/librte_mbuf -Ilib/librte_mempool -I../lib/librte_mempool -Ilib/librte_ring -I../lib/librte_ring -Ilib/librte_meter -I../lib/librte_meter -Idrivers/bus/pci -I../drivers/bus/pci -I../drivers/bus/pci/linux -Ilib/librte_pci -I../lib/librte_pci -Idrivers/bus/vdev -I../drivers/bus/vdev -fdiagnostics-color=always -pipe -D_FILE_OFFSET_BITS=64 -Wall -Winvalid-pch -Werror -O3 -include rte_config.h -Wextra -Wcast-qual -Wdeprecated -Wformat-nonliteral -Wformat-security -Wmissing-declarations -Wmissing-prototypes -Wnested-externs -Wold-style-definition -Wpointer-arith -Wsign-compare -Wstrict-prototypes -Wundef -Wwrite-strings -Wno-address-of-packed-member -Wno-packed-not-aligned -Wno-missing-field-initializers -D_GNU_SOURCE -fPIC -march=native -DALLOW_EXPERIMENTAL_API -DALLOW_INTERNAL_API -Wno-format-truncation -DCC_AVX512_SUPPORT -DVHOST_GCC_UNROLL_PRAGMA -MD -MQ 'drivers/a715181@@tmp_rte_pmd_virtio@sta/net_virtio_virtio_rxtx.c.o' -MF 'drivers/a715181@@tmp_rte_pmd_virtio@sta/net_virtio_virtio_rxtx.c.o.d' -o 'drivers/a715181@@tmp_rte_pmd_virtio@sta/net_virtio_virtio_rxtx.c.o' -c ../drivers/net/virtio/virtio_rxtx.c
In file included from ../drivers/net/virtio/virtio_rxtx.c:31:
../drivers/net/virtio/virtqueue.h:615:1: error: expected identifier or ‘(’ before ‘}’ token
  615 | } while (0)
      | ^
../drivers/net/virtio/virtqueue.h:615:3: error: expected identifier or ‘(’ before ‘while’
  615 | } while (0)
      |   ^~~~~
[1634/2432] Compiling C object 'drivers/a715181@@tmp_rte_pmd_tap@sta/net_tap_rte_eth_tap.c.o'.
[1635/2432] Compiling C object 'drivers/a715181@@tmp_rte_pmd_vhost@sta/net_vhost_rte_eth_vhost.c.o'.
[1636/2432] Compiling C object 'drivers/a715181@@tmp_rte_pmd_thunderx@sta/net_thunderx_nicvf_ethdev.c.o'.
ninja: build stopped: subcommand failed


DPDK STV team

^ permalink raw reply	[flat|nested] only message in thread

only message in thread, back to index

Thread overview: (only message) (download: mbox.gz / follow: Atom feed)
-- links below jump to the message on this page --
2020-09-16  7:38 [dpdk-test-report] |FAILURE| pw(77863) [v4] net/virtio: fix wrong variable assignment in helper macro sys_stv

automatic DPDK test reports

Archives are clonable:
	git clone --mirror http://inbox.dpdk.org/test-report/0 test-report/git/0.git

	# If you have public-inbox 1.1+ installed, you may
	# initialize and index your mirror using the following commands:
	public-inbox-init -V2 test-report test-report/ http://inbox.dpdk.org/test-report \
		test-report@dpdk.org
	public-inbox-index test-report


Newsgroup available over NNTP:
	nntp://inbox.dpdk.org/inbox.dpdk.test-report


AGPL code for this site: git clone https://public-inbox.org/ public-inbox