automatic DPDK test reports
 help / color / mirror / Atom feed
* [dpdk-test-report] |FAILURE| pw25488 [PATCH v5 10/19] bus: introduce bus scan policies
@ 2017-06-21 16:56 sys_stv
  0 siblings, 0 replies; 2+ messages in thread
From: sys_stv @ 2017-06-21 16:56 UTC (permalink / raw)
  To: test-report; +Cc: gaetan.rivet

[-- Attachment #1: Type: text/plain, Size: 2054 bytes --]

Test-Label: Intel-compilation
Test-Status: FAILURE
http://dpdk.org/patch/25488

_apply patch file failure_

Submitter: Gaetan Rivet <gaetan.rivet@6wind.com>
Date: Wed, 21 Jun 2017 01:35:44 +0200
DPDK git baseline: Repo:dpdk-next-eventdev, Branch:master, CommitID:c687cebe095b2ea325aa012e2834b830f1f74eba
                   Repo:dpdk-next-crypto, Branch:master, CommitID:b1cac453935eb8d2f1dee8e7ab081711cfb0cf70
                   Repo:dpdk-next-net, Branch:master, CommitID:e8807e2c6c0b3d8cc321b9202e3ff38766ef0f10
                   Repo:dpdk-next-virtio, Branch:master, CommitID:da5129d9b6b53375667690970f6824565c1f1443
                   Repo:dpdk, Branch:master, CommitID:3566af6be7f968c678a867399ddc644fb762873b
                   
Apply patch file failed:
Repo: dpdk
25488:
patching file lib/librte_eal/common/include/rte_bus.h
Hunk #1 succeeded at 82 with fuzz 1 (offset -55 lines).
Hunk #2 FAILED at 164.
1 out of 2 hunks FAILED -- saving rejects to file lib/librte_eal/common/include/rte_bus.h.rej

Repo: dpdk-next-crypto
25488:
patching file lib/librte_eal/common/include/rte_bus.h
Hunk #1 succeeded at 82 with fuzz 1 (offset -55 lines).
Hunk #2 FAILED at 164.
1 out of 2 hunks FAILED -- saving rejects to file lib/librte_eal/common/include/rte_bus.h.rej

Repo: dpdk-next-net
25488:
patching file lib/librte_eal/common/include/rte_bus.h
Hunk #1 succeeded at 82 with fuzz 1 (offset -55 lines).
Hunk #2 FAILED at 164.
1 out of 2 hunks FAILED -- saving rejects to file lib/librte_eal/common/include/rte_bus.h.rej

Repo: dpdk-next-virtio
25488:
patching file lib/librte_eal/common/include/rte_bus.h
Hunk #1 succeeded at 82 with fuzz 1 (offset -55 lines).
Hunk #2 FAILED at 164.
1 out of 2 hunks FAILED -- saving rejects to file lib/librte_eal/common/include/rte_bus.h.rej

Repo: dpdk-next-eventdev
25488:
patching file lib/librte_eal/common/include/rte_bus.h
Hunk #1 succeeded at 82 with fuzz 1 (offset -55 lines).
Hunk #2 FAILED at 164.
1 out of 2 hunks FAILED -- saving rejects to file lib/librte_eal/common/include/rte_bus.h.rej


DPDK STV team

^ permalink raw reply	[flat|nested] 2+ messages in thread

* [dpdk-test-report] |FAILURE| pw25488 [PATCH v5 10/19] bus: introduce bus scan policies
@ 2017-06-27  2:49 sys_stv
  0 siblings, 0 replies; 2+ messages in thread
From: sys_stv @ 2017-06-27  2:49 UTC (permalink / raw)
  To: test-report; +Cc: gaetan.rivet

[-- Attachment #1: Type: text/plain, Size: 2054 bytes --]

Test-Label: Intel-compilation
Test-Status: FAILURE
http://dpdk.org/patch/25488

_apply patch file failure_

Submitter: Gaetan Rivet <gaetan.rivet@6wind.com>
Date: Wed, 21 Jun 2017 01:35:38 +0200
DPDK git baseline: Repo:dpdk-next-eventdev, Branch:master, CommitID:c687cebe095b2ea325aa012e2834b830f1f74eba
                   Repo:dpdk-next-crypto, Branch:master, CommitID:d90d576825aed49bc69eb5547017f064f776afb1
                   Repo:dpdk-next-net, Branch:master, CommitID:2eda322f22d89d8ed4d88350e29fbacea38485a9
                   Repo:dpdk-next-virtio, Branch:master, CommitID:da5129d9b6b53375667690970f6824565c1f1443
                   Repo:dpdk, Branch:master, CommitID:68918a3b1c03b642dfdcf13568790de55982e64c
                   
Apply patch file failed:
Repo: dpdk
25488:
patching file lib/librte_eal/common/include/rte_bus.h
Hunk #1 succeeded at 82 with fuzz 1 (offset -55 lines).
Hunk #2 FAILED at 164.
1 out of 2 hunks FAILED -- saving rejects to file lib/librte_eal/common/include/rte_bus.h.rej

Repo: dpdk-next-crypto
25488:
patching file lib/librte_eal/common/include/rte_bus.h
Hunk #1 succeeded at 82 with fuzz 1 (offset -55 lines).
Hunk #2 FAILED at 164.
1 out of 2 hunks FAILED -- saving rejects to file lib/librte_eal/common/include/rte_bus.h.rej

Repo: dpdk-next-net
25488:
patching file lib/librte_eal/common/include/rte_bus.h
Hunk #1 succeeded at 82 with fuzz 1 (offset -55 lines).
Hunk #2 FAILED at 164.
1 out of 2 hunks FAILED -- saving rejects to file lib/librte_eal/common/include/rte_bus.h.rej

Repo: dpdk-next-virtio
25488:
patching file lib/librte_eal/common/include/rte_bus.h
Hunk #1 succeeded at 82 with fuzz 1 (offset -55 lines).
Hunk #2 FAILED at 164.
1 out of 2 hunks FAILED -- saving rejects to file lib/librte_eal/common/include/rte_bus.h.rej

Repo: dpdk-next-eventdev
25488:
patching file lib/librte_eal/common/include/rte_bus.h
Hunk #1 succeeded at 82 with fuzz 1 (offset -55 lines).
Hunk #2 FAILED at 164.
1 out of 2 hunks FAILED -- saving rejects to file lib/librte_eal/common/include/rte_bus.h.rej


DPDK STV team

^ permalink raw reply	[flat|nested] 2+ messages in thread

end of thread, other threads:[~2017-06-27  2:49 UTC | newest]

Thread overview: 2+ messages (download: mbox.gz / follow: Atom feed)
-- links below jump to the message on this page --
2017-06-21 16:56 [dpdk-test-report] |FAILURE| pw25488 [PATCH v5 10/19] bus: introduce bus scan policies sys_stv
2017-06-27  2:49 sys_stv

This is a public inbox, see mirroring instructions
for how to clone and mirror all data and code used for this inbox;
as well as URLs for NNTP newsgroup(s).