Test-Label: Intel-compilation Test-Status: FAILURE http://dpdk.org/patch/25843 _apply patch file failure_ Submitter: Thomas Monjalon Date: Wed, 28 Jun 2017 09:44:18 +0200 DPDK git baseline: Repo:dpdk-next-eventdev, Branch:master, CommitID:c687cebe095b2ea325aa012e2834b830f1f74eba Repo:dpdk-next-crypto, Branch:master, CommitID:46622a025067fa9f16968e74834c0e3d5d18b322 Repo:dpdk-next-net, Branch:master, CommitID:7b907aec058e8168646fa2cc1eac470a463c743a Repo:dpdk-next-virtio, Branch:master, CommitID:da5129d9b6b53375667690970f6824565c1f1443 Repo:dpdk, Branch:master, CommitID:c1923afc0999b5b6f109190bc5b69b6c3d334635 Apply patch file failed: Repo: dpdk 25843: patching file lib/librte_eal/common/eal_common_pci.c Hunk #1 FAILED at 533. 1 out of 1 hunk FAILED -- saving rejects to file lib/librte_eal/common/eal_common_pci.c.rej Repo: dpdk-next-crypto 25843: patching file lib/librte_eal/common/eal_common_pci.c Hunk #1 FAILED at 533. 1 out of 1 hunk FAILED -- saving rejects to file lib/librte_eal/common/eal_common_pci.c.rej Repo: dpdk-next-net 25843: patching file lib/librte_eal/common/eal_common_pci.c Hunk #1 FAILED at 533. 1 out of 1 hunk FAILED -- saving rejects to file lib/librte_eal/common/eal_common_pci.c.rej Repo: dpdk-next-virtio 25843: patching file lib/librte_eal/common/eal_common_pci.c Hunk #1 FAILED at 533. 1 out of 1 hunk FAILED -- saving rejects to file lib/librte_eal/common/eal_common_pci.c.rej Repo: dpdk-next-eventdev 25843: patching file lib/librte_eal/common/eal_common_pci.c Hunk #1 FAILED at 533. 1 out of 1 hunk FAILED -- saving rejects to file lib/librte_eal/common/eal_common_pci.c.rej DPDK STV team