automatic DPDK test reports
 help / color / mirror / Atom feed
* [dpdk-test-report] |FAILURE| pw71231-71235 [PATCH] [1/5] net/i40e: add private APIs
@ 2020-06-11 13:00 dpdklab
  0 siblings, 0 replies; only message in thread
From: dpdklab @ 2020-06-11 13:00 UTC (permalink / raw)
  To: test-report; +Cc: dpdk-test-reports

[-- Attachment #1: Type: text/plain, Size: 5166 bytes --]

Test-Label: Performance-Testing
Test-Status: FAILURE
http://dpdk.org/patch/71231

_build patch failure_

Submitter: Chenxu Di <chenxux.di@intel.com>
Date: Thursday, June 11 2020 06:01:38 
Applied on: CommitID:08ad28c22618cfb3de378292bc9fe5060c5e5c0a
Apply patch set 71231-71235 failed:

Configuration done using x86_64-native-linuxapp-gcc
==== NOTE ====
It is recommended to build DPDK using 'meson' and 'ninja'
See https://doc.dpdk.org/guides/linux_gsg/build_dpdk.html for instructions
Building DPDK with 'make' will be deprecated in a future release
==============
== Build lib
== Build lib/librte_kvargs
== Build lib/librte_telemetry
== Build lib/librte_eal
/home-local/jenkins-local/jenkins-agent/workspace/Apply-Custom-Patch-Set/dpdk/mk/toolchain/gcc/rte.toolchain-compat.mk:30: AVX512 support disabled because of binutils 2.30. See Bug 97
== Build lib/librte_eal/include
== Build lib/librte_eal/linux
== Build lib/librte_pci
== Build lib/librte_ring
== Build lib/librte_stack
== Build lib/librte_mempool
== Build lib/librte_mbuf
== Build lib/librte_timer
== Build lib/librte_cfgfile
== Build lib/librte_net
== Build lib/librte_cmdline
== Build lib/librte_meter
== Build lib/librte_ethdev
== Build lib/librte_bbdev
== Build lib/librte_cryptodev
== Build lib/librte_security
== Build lib/librte_compressdev
== Build lib/librte_hash
== Build lib/librte_eventdev
== Build lib/librte_rawdev
== Build lib/librte_vhost
== Build lib/librte_efd
== Build lib/librte_rib
== Build lib/librte_fib
== Build lib/librte_lpm
== Build lib/librte_acl
== Build lib/librte_member
== Build lib/librte_ip_frag
== Build lib/librte_gro
== Build lib/librte_jobstats
== Build lib/librte_metrics
== Build lib/librte_bitratestats
== Build lib/librte_latencystats
== Build lib/librte_power
== Build lib/librte_sched
== Build lib/librte_kni
== Build lib/librte_port
== Build lib/librte_table
== Build lib/librte_flow_classify
== Build lib/librte_distributor
== Build lib/librte_pipeline
== Build lib/librte_reorder
== Build lib/librte_pdump
== Build lib/librte_gso
== Build lib/librte_bpf
== Build lib/librte_ipsec
== Build lib/librte_rcu
== Build lib/librte_graph
== Build lib/librte_node
== Build buildtools
== Build buildtools/pmdinfogen
== Build kernel
== Build kernel/linux
== Build drivers
== Build drivers/common
== Build drivers/common/cpt
== Build drivers/common/octeontx
== Build drivers/common/octeontx2
== Build drivers/common/dpaax
== Build drivers/common/iavf
== Build drivers/bus
== Build drivers/bus/dpaa
== Build drivers/bus/fslmc
== Build drivers/bus/ifpga
== Build drivers/bus/pci
== Build drivers/bus/vdev
== Build drivers/bus/vmbus
== Build drivers/mempool
== Build drivers/mempool/bucket
== Build drivers/mempool/dpaa
== Build drivers/mempool/dpaa2
== Build drivers/mempool/ring
== Build drivers/mempool/stack
== Build drivers/mempool/octeontx
== Build drivers/mempool/octeontx2
== Build drivers/net
== Build drivers/net/af_packet
== Build drivers/net/ark
== Build drivers/net/atlantic
== Build drivers/net/avp
== Build drivers/net/axgbe
== Build drivers/net/bonding
== Build drivers/net/cxgbe
== Build drivers/net/dpaa
== Build drivers/net/dpaa2
== Build drivers/net/e1000
== Build drivers/net/ena
== Build drivers/net/enetc
== Build drivers/net/enic
== Build drivers/net/failsafe
== Build drivers/net/fm10k
== Build drivers/net/hinic
== Build drivers/net/hns3
== Build drivers/net/i40e
  CC rte_pmd_i40e.o
rte_pmd_i40e_get_fdir_info is not flagged as experimental
but is listed in version map
Please add __rte_experimental to the definition of rte_pmd_i40e_get_fdir_info
rte_pmd_i40e_get_fdir_stats is not flagged as experimental
but is listed in version map
Please add __rte_experimental to the definition of rte_pmd_i40e_get_fdir_stats
rte_pmd_i40e_set_gre_key_len is not flagged as experimental
but is listed in version map
Please add __rte_experimental to the definition of rte_pmd_i40e_set_gre_key_len
/home-local/jenkins-local/jenkins-agent/workspace/Apply-Custom-Patch-Set/dpdk/mk/internal/rte.compile-pre.mk:114: recipe for target 'rte_pmd_i40e.o' failed
make[6]: *** [rte_pmd_i40e.o] Error 1
/home-local/jenkins-local/jenkins-agent/workspace/Apply-Custom-Patch-Set/dpdk/mk/rte.subdir.mk:35: recipe for target 'i40e' failed
make[5]: *** [i40e] Error 2
/home-local/jenkins-local/jenkins-agent/workspace/Apply-Custom-Patch-Set/dpdk/mk/rte.subdir.mk:35: recipe for target 'net' failed
make[4]: *** [net] Error 2
/home-local/jenkins-local/jenkins-agent/workspace/Apply-Custom-Patch-Set/dpdk/mk/rte.sdkbuild.mk:51: recipe for target 'drivers' failed
make[3]: *** [drivers] Error 2
/home-local/jenkins-local/jenkins-agent/workspace/Apply-Custom-Patch-Set/dpdk/mk/rte.sdkroot.mk:98: recipe for target 'all' failed
make[2]: *** [all] Error 2
/home-local/jenkins-local/jenkins-agent/workspace/Apply-Custom-Patch-Set/dpdk/mk/rte.sdkinstall.mk:60: recipe for target 'pre_install' failed
make[1]: *** [pre_install] Error 2
/home-local/jenkins-local/jenkins-agent/workspace/Apply-Custom-Patch-Set/dpdk/mk/rte.sdkroot.mk:77: recipe for target 'install' failed
make: *** [install] Error 2

https://lab.dpdk.org/results/dashboard/patchsets/11454/

UNH-IOL DPDK Community Lab

^ permalink raw reply	[flat|nested] only message in thread

only message in thread, other threads:[~2020-06-11 13:00 UTC | newest]

Thread overview: (only message) (download: mbox.gz / follow: Atom feed)
-- links below jump to the message on this page --
2020-06-11 13:00 [dpdk-test-report] |FAILURE| pw71231-71235 [PATCH] [1/5] net/i40e: add private APIs dpdklab

This is a public inbox, see mirroring instructions
for how to clone and mirror all data and code used for this inbox;
as well as URLs for NNTP newsgroup(s).