automatic DPDK test reports
 help / color / mirror / Atom feed
* [dpdk-test-report] |FAILURE| pw88039-88045 [PATCH] [7/7] eal/windows: do not expose POSIX symbols
@ 2021-02-20 23:43 dpdklab
  0 siblings, 0 replies; only message in thread
From: dpdklab @ 2021-02-20 23:43 UTC (permalink / raw)
  To: test-report; +Cc: dpdk-test-reports

[-- Attachment #1: Type: text/plain, Size: 4571 bytes --]

Test-Label: Performance-Testing
Test-Status: FAILURE
http://dpdk.org/patch/88039

_build patch failure_

Submitter: Dmitry Kozlyuk <dmitry.kozliuk@gmail.com>
Date: Saturday, February 20 2021 23:29:10 
Applied on: CommitID:442155f70c6bbdf59aa1f7b4d8039b5140f62927
Apply patch set 88039-88045 failed:

[1/1745] Linking static target lib/librte_vhost.a.
[2/1745] Linking static target lib/librte_pipeline.a.
[3/1745] Linking static target drivers/librte_mempool_bucket.a.
[4/1745] Linking static target drivers/libtmp_rte_net_avp.a.
[5/1745] Linking static target drivers/libtmp_rte_net_atlantic.a.
[6/1745] Generating rte_crypto_bcmfs_def with a custom command.
[7/1745] Generating rte_crypto_bcmfs_mingw with a custom command.
[8/1745] Generating rte_net_axgbe_def with a custom command.
[9/1745] Generating rte_net_axgbe_mingw with a custom command.
[10/1745] Linking target drivers/librte_common_mlx5.so.21.2.
FAILED: drivers/librte_common_mlx5.so.21.2 
cc  -o drivers/librte_common_mlx5.so.21.2 'drivers/a715181@@rte_common_mlx5@sha/meson-generated_.._rte_common_mlx5.pmd.c.o' 'drivers/a715181@@tmp_rte_common_mlx5@sta/common_mlx5_mlx5_devx_cmds.c.o' 'drivers/a715181@@tmp_rte_common_mlx5@sta/common_mlx5_mlx5_common.c.o' 'drivers/a715181@@tmp_rte_common_mlx5@sta/common_mlx5_mlx5_common_mp.c.o' 'drivers/a715181@@tmp_rte_common_mlx5@sta/common_mlx5_mlx5_common_mr.c.o' 'drivers/a715181@@tmp_rte_common_mlx5@sta/common_mlx5_mlx5_malloc.c.o' 'drivers/a715181@@tmp_rte_common_mlx5@sta/common_mlx5_mlx5_common_pci.c.o' 'drivers/a715181@@tmp_rte_common_mlx5@sta/common_mlx5_mlx5_common_devx.c.o' 'drivers/a715181@@tmp_rte_common_mlx5@sta/common_mlx5_linux_mlx5_nl.c.o' 'drivers/a715181@@tmp_rte_common_mlx5@sta/common_mlx5_linux_mlx5_common_os.c.o' 'drivers/a715181@@tmp_rte_common_mlx5@sta/common_mlx5_linux_mlx5_common_verbs.c.o' 'drivers/a715181@@tmp_rte_common_mlx5@sta/common_mlx5_linux_mlx5_glue.c.o' -Wl,--as-needed -Wl,--no-undefined -Wl,-O1 -shared -fPIC -Wl,--start-group -Wl,-soname,librte_common_mlx5.so.21 -Wl,--no-as-needed -pthread -lm -ldl -lnuma -lfdt lib/librte_hash.so.21.2 lib/librte_eal.so.21.2 lib/librte_kvargs.so.21.2 lib/librte_telemetry.so.21.2 lib/librte_ring.so.21.2 lib/librte_rcu.so.21.2 lib/librte_pci.so.21.2 drivers/librte_bus_pci.so.21.2 lib/librte_net.so.21.2 lib/librte_mbuf.so.21.2 lib/librte_mempool.so.21.2 -Wl,--version-script=/home-local/jenkins-local/jenkins-agent/workspace/Apply-Custom-Patch-Set/dpdk/drivers/common/mlx5/version.map -lmlx5 -libverbs -Wl,--end-group '-Wl,-rpath,$ORIGIN/../lib:$ORIGIN/' -Wl,-rpath-link,/home-local/jenkins-local/jenkins-agent/workspace/Apply-Custom-Patch-Set/dpdk/build/lib -Wl,-rpath-link,/home-local/jenkins-local/jenkins-agent/workspace/Apply-Custom-Patch-Set/dpdk/build/drivers
drivers/a715181@@tmp_rte_common_mlx5@sta/common_mlx5_mlx5_common_pci.c.o: In function `bus_cmdline_options_handler':
mlx5_common_pci.c:(.text+0x25e): undefined reference to `rte_strtok'
mlx5_common_pci.c:(.text+0x356): undefined reference to `rte_strtok'
collect2: error: ld returned 1 exit status
[11/1745] Linking target drivers/librte_common_sfc_efx.so.21.2.
[12/1745] Linking target drivers/librte_net_ark.so.21.2.
[13/1745] Generating rte_net_bond_def with a custom command.
[14/1745] Generating rte_net_bond_mingw with a custom command.
[15/1745] Linking target drivers/librte_common_qat.so.21.2.
[16/1745] Generating rte_net_avp.pmd.c with a custom command.
[17/1745] Generating rte_net_atlantic.pmd.c with a custom command.
[18/1745] Compiling C object 'drivers/a715181@@tmp_rte_net_bond@sta/net_bonding_rte_eth_bond_args.c.o'.
[19/1745] Compiling C object 'drivers/a715181@@tmp_rte_net_bond@sta/net_bonding_rte_eth_bond_flow.c.o'.
[20/1745] Compiling C object 'drivers/a715181@@tmp_rte_net_bond@sta/net_bonding_rte_eth_bond_alb.c.o'.
[21/1745] Compiling C object 'drivers/a715181@@tmp_rte_net_axgbe@sta/net_axgbe_axgbe_rxtx_vec_sse.c.o'.
[22/1745] Generating rte_mempool_bucket.sym_chk with a meson_exe.py custom command.
[23/1745] Compiling C object 'drivers/a715181@@tmp_rte_net_bond@sta/net_bonding_rte_eth_bond_api.c.o'.
[24/1745] Generating vhost.sym_chk with a meson_exe.py custom command.
[25/1745] Generating pipeline.sym_chk with a meson_exe.py custom command.
[26/1745] Compiling C object 'drivers/a715181@@tmp_rte_net_bond@sta/net_bonding_rte_eth_bond_8023ad.c.o'.
[27/1745] Compiling C object 'drivers/a715181@@tmp_rte_net_bond@sta/net_bonding_rte_eth_bond_pmd.c.o'.
ninja: build stopped: subcommand failed.

https://lab.dpdk.org/results/dashboard/patchsets/15671/

UNH-IOL DPDK Community Lab

^ permalink raw reply	[flat|nested] only message in thread

only message in thread, other threads:[~2021-02-20 23:43 UTC | newest]

Thread overview: (only message) (download: mbox.gz / follow: Atom feed)
-- links below jump to the message on this page --
2021-02-20 23:43 [dpdk-test-report] |FAILURE| pw88039-88045 [PATCH] [7/7] eal/windows: do not expose POSIX symbols dpdklab

automatic DPDK test reports

This inbox may be cloned and mirrored by anyone:

	git clone --mirror https://inbox.dpdk.org/test-report/0 test-report/git/0.git

	# If you have public-inbox 1.1+ installed, you may
	# initialize and index your mirror using the following commands:
	public-inbox-init -V2 test-report test-report/ https://inbox.dpdk.org/test-report \
		test-report@dpdk.org
	public-inbox-index test-report

Example config snippet for mirrors.
Newsgroup available over NNTP:
	nntp://inbox.dpdk.org/inbox.dpdk.test-report


AGPL code for this site: git clone https://public-inbox.org/public-inbox.git