automatic DPDK test reports
 help / color / mirror / Atom feed
* [dpdk-test-report] |SUCCESS| pw88037 [PATCH 7/7] eventdev: fix ABI breakage due to event vector
       [not found] <20210220220957.4583-8-pbhagavatula@marvell.com>
@ 2021-02-20 22:11 ` checkpatch
  2021-02-21  0:05 ` [dpdk-test-report] |FAILURE| pw88037 " 0-day Robot
  2021-02-21  0:09 ` [dpdk-test-report] |FAILURE| pw88037 [dpdk-dev] [PATCH 7/7] " 0-day Robot
  2 siblings, 0 replies; 3+ messages in thread
From: checkpatch @ 2021-02-20 22:11 UTC (permalink / raw)
  To: test-report

Test-Label: checkpatch
Test-Status: SUCCESS
http://dpdk.org/patch/88037

_coding style OK_



^ permalink raw reply	[flat|nested] 3+ messages in thread

* [dpdk-test-report] |FAILURE| pw88037 eventdev: fix ABI breakage due to event vector
       [not found] <20210220220957.4583-8-pbhagavatula@marvell.com>
  2021-02-20 22:11 ` [dpdk-test-report] |SUCCESS| pw88037 [PATCH 7/7] eventdev: fix ABI breakage due to event vector checkpatch
@ 2021-02-21  0:05 ` 0-day Robot
  2021-02-21  0:09 ` [dpdk-test-report] |FAILURE| pw88037 [dpdk-dev] [PATCH 7/7] " 0-day Robot
  2 siblings, 0 replies; 3+ messages in thread
From: 0-day Robot @ 2021-02-21  0:05 UTC (permalink / raw)
  To: test-report; +Cc: pbhagavatula, robot

From: robot@bytheb.org

Test-Label: travis-robot
Test-Status: FAILURE
http://dpdk.org/patch/88037

_travis build: failed_
Build URL: https://travis-ci.com/ovsrobot/dpdk/builds/217732262

^ permalink raw reply	[flat|nested] 3+ messages in thread

* [dpdk-test-report] |FAILURE| pw88037 [dpdk-dev] [PATCH 7/7] eventdev: fix ABI breakage due to event vector
       [not found] <20210220220957.4583-8-pbhagavatula@marvell.com>
  2021-02-20 22:11 ` [dpdk-test-report] |SUCCESS| pw88037 [PATCH 7/7] eventdev: fix ABI breakage due to event vector checkpatch
  2021-02-21  0:05 ` [dpdk-test-report] |FAILURE| pw88037 " 0-day Robot
@ 2021-02-21  0:09 ` 0-day Robot
  2 siblings, 0 replies; 3+ messages in thread
From: 0-day Robot @ 2021-02-21  0:09 UTC (permalink / raw)
  To: test-report; +Cc: pbhagavatula, robot

[-- Warning: decoded text below may be mangled, UTF-8 assumed --]
[-- Attachment #1: Type: text/plain; charset=pw|patchwork.dpdk.org|build|15317|SHA|34682135112611a078e822f90129a7e64396651b|failed|https://github.com/ovsrobot/dpdk/actions/runs/585275022|[dpdk-dev] [PATCH 7/7] eal/windows: do not expose POSIX symbols|ovsrobot/dpdk, Size: 15956 bytes --]

From: robot@bytheb.org

Test-Label: github-robot
Test-Status: FAILURE
http://dpdk.org/patch/88037

_github build: failed_
Build URL: https://github.com/ovsrobot/dpdk/actions/runs/585186773
Build Logs:
-----------------------Summary of failed steps-----------------------
ubuntu-18.04-gcc-shared-abi+doc+tests failed at step "Build and test"
ubuntu-18.04-clang-static failed at step "Build and test"
ubuntu-18.04-clang-shared-doc+tests failed at step "Build and test"
ubuntu-18.04-gcc-static-i386 failed at step "Build and test"
----------------------End summary of failed steps--------------------

-------------------------------BEGIN LOGS----------------------------
####################################################################################
#### [Begin job log] ubuntu-18.04-gcc-shared-abi+doc+tests at step "Build and test"
####################################################################################
[2761/3380] Linking target examples/dpdk-eventdev_pipeline.
[2762/3380] Compiling C object 'examples/examples@@dpdk-fips_validation@exe/fips_validation_fips_validation_aes.c.o'.
[2763/3380] Compiling C object 'examples/examples@@dpdk-flow_classify@exe/flow_classify_flow_classify.c.o'.
[2764/3380] Compiling C object 'examples/examples@@dpdk-ioat@exe/ioat_ioatfwd.c.o'.
[2765/3380] Compiling C object 'examples/examples@@dpdk-fips_validation@exe/fips_validation_fips_validation_tdes.c.o'.
[2766/3380] Compiling C object 'examples/examples@@dpdk-fips_validation@exe/fips_validation_fips_validation_gcm.c.o'.
[2767/3380] Compiling C object 'examples/examples@@dpdk-fips_validation@exe/fips_validation_fips_validation_cmac.c.o'.
[2768/3380] Compiling C object 'examples/examples@@dpdk-fips_validation@exe/fips_validation_fips_validation_ccm.c.o'.
[2769/3380] Compiling C object 'examples/examples@@dpdk-fips_validation@exe/fips_validation_fips_validation_sha.c.o'.
[2770/3380] Compiling C object 'examples/examples@@dpdk-fips_validation@exe/fips_validation_fips_validation_xts.c.o'.
[2771/3380] Compiling C object 'examples/examples@@dpdk-fips_validation@exe/fips_validation_fips_dev_self_test.c.o'.
[2772/3380] Compiling C object 'examples/examples@@dpdk-fips_validation@exe/fips_validation_main.c.o'.
[2773/3380] Compiling C object 'examples/examples@@dpdk-helloworld@exe/helloworld_main.c.o'.
[2774/3380] Linking target examples/dpdk-fips_validation.
[2775/3380] Compiling C object 'examples/examples@@dpdk-ip_pipeline@exe/ip_pipeline_conn.c.o'.
[2776/3380] Linking target examples/dpdk-flow_classify.
[2777/3380] Generating doxygen with a custom command.
FAILED: doc/api/html 
/home/runner/work/dpdk/dpdk/doc/api/generate_doxygen.sh doc/api/doxy-api.conf doc/api/html /home/runner/work/dpdk/dpdk/doc/api/doxy-html-custom.sh
/home/runner/work/dpdk/dpdk/lib/librte_eventdev/rte_event_eth_rx_adapter.h:444: error: The following parameters of rte_event_eth_rx_adapter_queue_event_vector_config(uint8_t id, uint16_t eth_dev_id, int32_t rx_queue_id, struct rte_event_eth_rx_adapter_event_vector_config *config) are not documented:
  parameter 'config' (warning treated as error, aborting now)
[2778/3380] Compiling C object 'examples/examples@@dpdk-flow_filtering@exe/flow_filtering_main.c.o'.
[2779/3380] Generating html_guides with a custom command.
ninja: build stopped: subcommand failed.
##[error]Process completed with exit code 1.
####################################################################################
#### [End job log] ubuntu-18.04-gcc-shared-abi+doc+tests at step "Build and test"
####################################################################################




####################################################################################
#### [Begin job log] ubuntu-18.04-clang-static at step "Build and test"
####################################################################################
[274/3166] Linking target lib/librte_efd.so.21.2.
[275/3166] Generating rte_eventdev_mingw with a custom command.
[276/3166] Compiling C object 'lib/lib@@rte_eventdev@sta/librte_eventdev_rte_event_ring.c.o'.
[277/3166] Compiling C object 'lib/lib@@rte_eventdev@sta/librte_eventdev_rte_eventdev.c.o'.
[278/3166] Compiling C object 'lib/lib@@rte_eventdev@sta/librte_eventdev_eventdev_trace_points.c.o'.
[279/3166] Compiling C object 'lib/lib@@rte_eventdev@sta/librte_eventdev_rte_event_eth_rx_adapter.c.o'.
[280/3166] Compiling C object 'lib/lib@@rte_eventdev@sta/librte_eventdev_rte_event_crypto_adapter.c.o'.
[281/3166] Generating rte_eventdev_def with a custom command.
[282/3166] Compiling C object 'lib/lib@@rte_gro@sta/librte_gro_gro_vxlan_tcp4.c.o'.
[283/3166] Compiling C object 'lib/lib@@rte_gro@sta/librte_gro_gro_udp4.c.o'.
[284/3166] Compiling C object 'lib/lib@@rte_eventdev@sta/librte_eventdev_rte_event_eth_tx_adapter.c.o'.
FAILED: lib/lib@@rte_eventdev@sta/librte_eventdev_rte_event_eth_tx_adapter.c.o 
ccache clang -Ilib/lib@@rte_eventdev@sta -Ilib -I../lib -Ilib/librte_eventdev -I../lib/librte_eventdev -I. -I../ -Iconfig -I../config -Ilib/librte_eal/include -I../lib/librte_eal/include -Ilib/librte_eal/linux/include -I../lib/librte_eal/linux/include -Ilib/librte_eal/x86/include -I../lib/librte_eal/x86/include -Ilib/librte_eal/common -I../lib/librte_eal/common -Ilib/librte_eal -I../lib/librte_eal -Ilib/librte_kvargs -I../lib/librte_kvargs -Ilib/librte_telemetry/../librte_metrics -I../lib/librte_telemetry/../librte_metrics -Ilib/librte_telemetry -I../lib/librte_telemetry -Ilib/librte_ring -I../lib/librte_ring -Ilib/librte_ethdev -I../lib/librte_ethdev -Ilib/librte_net -I../lib/librte_net -Ilib/librte_mbuf -I../lib/librte_mbuf -Ilib/librte_mempool -I../lib/librte_mempool -Ilib/librte_meter -I../lib/librte_meter -Ilib/librte_hash -I../lib/librte_hash -Ilib/librte_rcu -I../lib/librte_rcu -Ilib/librte_timer -I../lib/librte_timer -Ilib/librte_cryptodev -I../lib/librte_cryptodev -Xclang -fcolor-diagnostics -pipe -D_FILE_OFFSET_BITS=64 -Wall -Winvalid-pch -Werror -O2 -g -include rte_config.h -Wextra -Wcast-qual -Wdeprecated -Wformat -Wformat-nonliteral -Wformat-security -Wmissing-declarations -Wmissing-prototypes -Wnested-externs -Wold-style-definition -Wpointer-arith -Wsign-compare -Wstrict-prototypes -Wundef -Wwrite-strings -Wno-address-of-packed-member -Wno-missing-field-initializers -D_GNU_SOURCE -fPIC -march=corei7 -DALLOW_EXPERIMENTAL_API -DALLOW_INTERNAL_API -DLINUX  -MD -MQ 'lib/lib@@rte_eventdev@sta/librte_eventdev_rte_event_eth_tx_adapter.c.o' -MF 'lib/lib@@rte_eventdev@sta/librte_eventdev_rte_event_eth_tx_adapter.c.o.d' -o 'lib/lib@@rte_eventdev@sta/librte_eventdev_rte_event_eth_tx_adapter.c.o' -c ../lib/librte_eventdev/rte_event_eth_tx_adapter.c
../lib/librte_eventdev/rte_event_eth_tx_adapter.c:533:4: error: variable 'nb_tx' is uninitialized when used here [-Werror,-Wuninitialized]
                        nb_tx += rte_eth_tx_buffer(port, queue, tqi->tx_buf,
                        ^~~~~
../lib/librte_eventdev/rte_event_eth_tx_adapter.c:518:29: note: initialize the variable 'nb_tx' to silence this warning
        uint16_t port, queue, nb_tx;
                                   ^
                                    = 0
1 error generated.
[285/3166] Compiling C object 'lib/lib@@rte_gro@sta/librte_gro_rte_gro.c.o'.
[286/3166] Compiling C object 'lib/lib@@rte_eventdev@sta/librte_eventdev_rte_event_timer_adapter.c.o'.
ninja: build stopped: subcommand failed.
##[error]Process completed with exit code 1.
####################################################################################
#### [End job log] ubuntu-18.04-clang-static at step "Build and test"
####################################################################################




####################################################################################
#### [Begin job log] ubuntu-18.04-clang-shared-doc+tests at step "Build and test"
####################################################################################
[275/3382] Linking target lib/librte_efd.so.21.2.
[276/3382] Generating symbol file 'lib/lib@@rte_efd@sha/librte_efd.so.21.2.symbols'.
[277/3382] Compiling C object 'lib/lib@@rte_eventdev@sta/librte_eventdev_rte_event_ring.c.o'.
[278/3382] Generating rte_eventdev_mingw with a custom command.
[279/3382] Compiling C object 'lib/lib@@rte_eventdev@sta/librte_eventdev_rte_eventdev.c.o'.
[280/3382] Compiling C object 'lib/lib@@rte_eventdev@sta/librte_eventdev_eventdev_trace_points.c.o'.
[281/3382] Compiling C object 'lib/lib@@rte_eventdev@sta/librte_eventdev_rte_event_eth_rx_adapter.c.o'.
[282/3382] Compiling C object 'lib/lib@@rte_eventdev@sta/librte_eventdev_rte_event_crypto_adapter.c.o'.
[283/3382] Generating rte_eventdev_def with a custom command.
[284/3382] Compiling C object 'lib/lib@@rte_gro@sta/librte_gro_rte_gro.c.o'.
[285/3382] Compiling C object 'lib/lib@@rte_eventdev@sta/librte_eventdev_rte_event_eth_tx_adapter.c.o'.
FAILED: lib/lib@@rte_eventdev@sta/librte_eventdev_rte_event_eth_tx_adapter.c.o 
ccache clang -Ilib/lib@@rte_eventdev@sta -Ilib -I../lib -Ilib/librte_eventdev -I../lib/librte_eventdev -I. -I../ -Iconfig -I../config -Ilib/librte_eal/include -I../lib/librte_eal/include -Ilib/librte_eal/linux/include -I../lib/librte_eal/linux/include -Ilib/librte_eal/x86/include -I../lib/librte_eal/x86/include -Ilib/librte_eal/common -I../lib/librte_eal/common -Ilib/librte_eal -I../lib/librte_eal -Ilib/librte_kvargs -I../lib/librte_kvargs -Ilib/librte_telemetry/../librte_metrics -I../lib/librte_telemetry/../librte_metrics -Ilib/librte_telemetry -I../lib/librte_telemetry -Ilib/librte_ring -I../lib/librte_ring -Ilib/librte_ethdev -I../lib/librte_ethdev -Ilib/librte_net -I../lib/librte_net -Ilib/librte_mbuf -I../lib/librte_mbuf -Ilib/librte_mempool -I../lib/librte_mempool -Ilib/librte_meter -I../lib/librte_meter -Ilib/librte_hash -I../lib/librte_hash -Ilib/librte_rcu -I../lib/librte_rcu -Ilib/librte_timer -I../lib/librte_timer -Ilib/librte_cryptodev -I../lib/librte_cryptodev -Xclang -fcolor-diagnostics -pipe -D_FILE_OFFSET_BITS=64 -Wall -Winvalid-pch -Werror -O2 -g -include rte_config.h -Wextra -Wcast-qual -Wdeprecated -Wformat -Wformat-nonliteral -Wformat-security -Wmissing-declarations -Wmissing-prototypes -Wnested-externs -Wold-style-definition -Wpointer-arith -Wsign-compare -Wstrict-prototypes -Wundef -Wwrite-strings -Wno-address-of-packed-member -Wno-missing-field-initializers -D_GNU_SOURCE -fPIC -march=corei7 -DALLOW_EXPERIMENTAL_API -DALLOW_INTERNAL_API -DLINUX  -MD -MQ 'lib/lib@@rte_eventdev@sta/librte_eventdev_rte_event_eth_tx_adapter.c.o' -MF 'lib/lib@@rte_eventdev@sta/librte_eventdev_rte_event_eth_tx_adapter.c.o.d' -o 'lib/lib@@rte_eventdev@sta/librte_eventdev_rte_event_eth_tx_adapter.c.o' -c ../lib/librte_eventdev/rte_event_eth_tx_adapter.c
../lib/librte_eventdev/rte_event_eth_tx_adapter.c:533:4: error: variable 'nb_tx' is uninitialized when used here [-Werror,-Wuninitialized]
                        nb_tx += rte_eth_tx_buffer(port, queue, tqi->tx_buf,
                        ^~~~~
../lib/librte_eventdev/rte_event_eth_tx_adapter.c:518:29: note: initialize the variable 'nb_tx' to silence this warning
        uint16_t port, queue, nb_tx;
                                   ^
                                    = 0
1 error generated.
[286/3382] Compiling C object 'lib/lib@@rte_gro@sta/librte_gro_gro_vxlan_tcp4.c.o'.
[287/3382] Compiling C object 'lib/lib@@rte_eventdev@sta/librte_eventdev_rte_event_timer_adapter.c.o'.
ninja: build stopped: subcommand failed.
##[error]Process completed with exit code 1.
####################################################################################
#### [End job log] ubuntu-18.04-clang-shared-doc+tests at step "Build and test"
####################################################################################




####################################################################################
#### [Begin job log] ubuntu-18.04-gcc-static-i386 at step "Build and test"
####################################################################################
[1926/2571] Compiling C object 'app/app@@dpdk-test-flow-perf@exe/test-flow-perf_main.c.o'.
[1927/2571] Compiling C object 'app/app@@dpdk-test-eventdev@exe/test-eventdev_test_perf_atq.c.o'.
[1928/2571] Compiling C object 'app/app@@dpdk-test-eventdev@exe/test-eventdev_test_perf_queue.c.o'.
[1929/2571] Compiling C object 'app/app@@dpdk-test-pipeline@exe/test-pipeline_pipeline_acl.c.o'.
[1930/2571] Compiling C object 'app/app@@dpdk-test-eventdev@exe/test-eventdev_test_pipeline_common.c.o'.
FAILED: app/app@@dpdk-test-eventdev@exe/test-eventdev_test_pipeline_common.c.o 
ccache gcc -Iapp/app@@dpdk-test-eventdev@exe -Iapp -I../app -Ilib/librte_eventdev -I../lib/librte_eventdev -I. -I../ -Iconfig -I../config -Ilib/librte_eal/include -I../lib/librte_eal/include -Ilib/librte_eal/linux/include -I../lib/librte_eal/linux/include -Ilib/librte_eal/x86/include -I../lib/librte_eal/x86/include -Ilib/librte_eal/common -I../lib/librte_eal/common -Ilib/librte_eal -I../lib/librte_eal -Ilib/librte_kvargs -I../lib/librte_kvargs -Ilib/librte_telemetry/../librte_metrics -I../lib/librte_telemetry/../librte_metrics -Ilib/librte_telemetry -I../lib/librte_telemetry -Ilib/librte_ring -I../lib/librte_ring -Ilib/librte_ethdev -I../lib/librte_ethdev -Ilib/librte_net -I../lib/librte_net -Ilib/librte_mbuf -I../lib/librte_mbuf -Ilib/librte_mempool -I../lib/librte_mempool -Ilib/librte_meter -I../lib/librte_meter -Ilib/librte_hash -I../lib/librte_hash -Ilib/librte_rcu -I../lib/librte_rcu -Ilib/librte_timer -I../lib/librte_timer -Ilib/librte_cryptodev -I../lib/librte_cryptodev -fdiagnostics-color=always -pipe -D_FILE_OFFSET_BITS=64 -Wall -Winvalid-pch -Werror -O2 -g -include rte_config.h -Wextra -Wcast-qual -Wdeprecated -Wformat -Wformat-nonliteral -Wformat-security -Wmissing-declarations -Wmissing-prototypes -Wnested-externs -Wold-style-definition -Wpointer-arith -Wsign-compare -Wstrict-prototypes -Wundef -Wwrite-strings -Wno-missing-field-initializers -Wno-pointer-to-int-cast -D_GNU_SOURCE -m32 -march=corei7 -DALLOW_EXPERIMENTAL_API  -MD -MQ 'app/app@@dpdk-test-eventdev@exe/test-eventdev_test_pipeline_common.c.o' -MF 'app/app@@dpdk-test-eventdev@exe/test-eventdev_test_pipeline_common.c.o.d' -o 'app/app@@dpdk-test-eventdev@exe/test-eventdev_test_pipeline_common.c.o' -c ../app/test-eventdev/test_pipeline_common.c
In file included from ../app/test-eventdev/test_pipeline_common.h:26:0,
                 from ../app/test-eventdev/test_pipeline_common.c:6:
../app/test-eventdev/test_pipeline_common.c: In function ‘pipeline_opt_dump’:
../app/test-eventdev/evt_common.h:27:9: error: format ‘%ld’ expects argument of type ‘long int’, but argument 4 has type ‘uint64_t {aka long long unsigned int}’ [-Werror=format=]
  printf("\t%-*s : "fmt"\n", EVT_STR_FMT, str, ## val)
         ^
../app/test-eventdev/test_pipeline_common.c:43:3: note: in expansion of macro ‘evt_dump’
   evt_dump("vector_tmo_ns", "%ld", opt->vector_tmo_nsec);
   ^~~~~~~~
../app/test-eventdev/test_pipeline_common.c:43:32: note: format string is defined here
   evt_dump("vector_tmo_ns", "%ld", opt->vector_tmo_nsec);
                              ~~^
                              %lld
cc1: all warnings being treated as errors
[1931/2571] Compiling C object 'app/app@@dpdk-test-eventdev@exe/test-eventdev_test_pipeline_atq.c.o'.
[1932/2571] Compiling C object 'app/app@@dpdk-test-eventdev@exe/test-eventdev_test_pipeline_queue.c.o'.
ninja: build stopped: subcommand failed.
##[error]Process completed with exit code 1.
####################################################################################
#### [End job log] ubuntu-18.04-gcc-static-i386 at step "Build and test"
####################################################################################
--------------------------------END LOGS-----------------------------

^ permalink raw reply	[flat|nested] 3+ messages in thread

end of thread, other threads:[~2021-02-21  0:11 UTC | newest]

Thread overview: 3+ messages (download: mbox.gz / follow: Atom feed)
-- links below jump to the message on this page --
     [not found] <20210220220957.4583-8-pbhagavatula@marvell.com>
2021-02-20 22:11 ` [dpdk-test-report] |SUCCESS| pw88037 [PATCH 7/7] eventdev: fix ABI breakage due to event vector checkpatch
2021-02-21  0:05 ` [dpdk-test-report] |FAILURE| pw88037 " 0-day Robot
2021-02-21  0:09 ` [dpdk-test-report] |FAILURE| pw88037 [dpdk-dev] [PATCH 7/7] " 0-day Robot

automatic DPDK test reports

This inbox may be cloned and mirrored by anyone:

	git clone --mirror https://inbox.dpdk.org/test-report/0 test-report/git/0.git

	# If you have public-inbox 1.1+ installed, you may
	# initialize and index your mirror using the following commands:
	public-inbox-init -V2 test-report test-report/ https://inbox.dpdk.org/test-report \
		test-report@dpdk.org
	public-inbox-index test-report

Example config snippet for mirrors.
Newsgroup available over NNTP:
	nntp://inbox.dpdk.org/inbox.dpdk.test-report


AGPL code for this site: git clone https://public-inbox.org/public-inbox.git