automatic DPDK test reports
 help / color / mirror / Atom feed
From: 0-day Robot <robot@bytheb.org>
To: test-report@dpdk.org
Cc: wei.huang@intel.com, robot@bytheb.org
Subject: [dpdk-test-report] |FAILURE| pw88074 [dpdk-dev] [PATCH v14 4/4] examples/ifpga: add example for ifpga APIs
Date: Mon, 22 Feb 2021 00:09:42 -0500
Message-ID: <20210222050942.32675-1-robot@bytheb.org> (raw)
In-Reply-To: <1613963747-30047-5-git-send-email-wei.huang@intel.com>

From: robot@bytheb.org

Test-Label: github-robot
Test-Status: FAILURE
http://dpdk.org/project/dpdk/patch/1613963747-30047-5-git-send-email-wei.huang@intel.com

_github build: failed_
Build URL: https://github.com/ovsrobot/dpdk/actions/runs/587919147
Build Logs:
-----------------------Summary of failed steps-----------------------
ubuntu-18.04-gcc-shared-abi+doc+tests failed at step "Build and test"
ubuntu-18.04-clang-shared-doc+tests failed at step "Build and test"
----------------------End summary of failed steps--------------------

-------------------------------BEGIN LOGS----------------------------
####################################################################################
#### [Begin job log] ubuntu-18.04-gcc-shared-abi+doc+tests at step "Build and test"
####################################################################################
[2756/3388] Compiling C object 'examples/examples@@dpdk-eventdev_pipeline@exe/eventdev_pipeline_main.c.o'.
[2757/3388] Compiling C object 'examples/examples@@dpdk-distributor@exe/distributor_main.c.o'.
[2758/3388] Linking target examples/dpdk-bond.
[2759/3388] Compiling C object 'examples/examples@@dpdk-cmdline@exe/cmdline_commands.c.o'.
[2760/3388] Linking target examples/dpdk-cmdline.
[2761/3388] Compiling C object 'examples/examples@@dpdk-bbdev_app@exe/bbdev_app_main.c.o'.
[2762/3388] Linking target examples/dpdk-bbdev_app.
[2763/3388] Linking target app/test/dpdk-test.
[2764/3388] Compiling C object 'examples/examples@@dpdk-ethtool@exe/ethtool_lib_rte_ethtool.c.o'.
[2765/3388] Linking target examples/dpdk-ethtool.
[2766/3388] Linking target examples/dpdk-distributor.
[2767/3388] Compiling C object 'examples/examples@@dpdk-eventdev_pipeline@exe/eventdev_pipeline_pipeline_worker_generic.c.o'.
[2768/3388] Compiling C object 'examples/examples@@dpdk-eventdev_pipeline@exe/eventdev_pipeline_pipeline_worker_tx.c.o'.
[2769/3388] Compiling C object 'examples/examples@@dpdk-fips_validation@exe/fips_validation_fips_validation_aes.c.o'.
[2770/3388] Compiling C object 'examples/examples@@dpdk-helloworld@exe/helloworld_main.c.o'.
[2771/3388] Linking target examples/dpdk-eventdev_pipeline.
[2772/3388] Compiling C object 'examples/examples@@dpdk-fips_validation@exe/fips_validation_fips_validation.c.o'.
[2773/3388] Generating doxygen with a custom command.
FAILED: doc/api/html 
/home/runner/work/dpdk/dpdk/doc/api/generate_doxygen.sh doc/api/doxy-api.conf doc/api/html /home/runner/work/dpdk/dpdk/doc/api/doxy-html-custom.sh
/home/runner/work/dpdk/dpdk/doc/api/doxy-api-index.md:59: error: unable to resolve reference to `rte_pmd_ifpga.h' for \ref command (warning treated as error, aborting now)
[2774/3388] Compiling C object 'examples/examples@@dpdk-fips_validation@exe/fips_validation_fips_validation_hmac.c.o'.
[2775/3388] Generating html_guides with a custom command.
ninja: build stopped: subcommand failed.
##[error]Process completed with exit code 1.
####################################################################################
#### [End job log] ubuntu-18.04-gcc-shared-abi+doc+tests at step "Build and test"
####################################################################################




####################################################################################
#### [Begin job log] ubuntu-18.04-clang-shared-doc+tests at step "Build and test"
####################################################################################
[2757/3390] Compiling C object 'examples/examples@@dpdk-ethtool@exe/ethtool_lib_rte_ethtool.c.o'.
[2758/3390] Compiling C object 'examples/examples@@dpdk-bond@exe/bond_main.c.o'.
[2759/3390] Linking target examples/dpdk-bond.
[2760/3390] Compiling C object 'examples/examples@@dpdk-ethtool@exe/ethtool_ethtool-app_main.c.o'.
[2761/3390] Generating examples.dox with a custom command.
[2762/3390] Compiling C object 'examples/examples@@dpdk-eventdev_pipeline@exe/eventdev_pipeline_main.c.o'.
[2763/3390] Compiling C object 'examples/examples@@dpdk-distributor@exe/distributor_main.c.o'.
[2764/3390] Linking target examples/dpdk-distributor.
[2765/3390] Compiling C object 'examples/examples@@dpdk-cmdline@exe/cmdline_parse_obj_list.c.o'.
[2766/3390] Linking target examples/dpdk-cmdline.
[2767/3390] Compiling C object 'examples/examples@@dpdk-bbdev_app@exe/bbdev_app_main.c.o'.
[2768/3390] Linking target examples/dpdk-bbdev_app.
[2769/3390] Linking target app/test/dpdk-test.
[2770/3390] Compiling C object 'examples/examples@@dpdk-eventdev_pipeline@exe/eventdev_pipeline_pipeline_worker_generic.c.o'.
[2771/3390] Compiling C object 'examples/examples@@dpdk-ethtool@exe/ethtool_ethtool-app_ethapp.c.o'.
[2772/3390] Linking target examples/dpdk-ethtool.
[2773/3390] Compiling C object 'examples/examples@@dpdk-eventdev_pipeline@exe/eventdev_pipeline_pipeline_worker_tx.c.o'.
[2774/3390] Generating doxygen with a custom command.
FAILED: doc/api/html 
/home/runner/work/dpdk/dpdk/doc/api/generate_doxygen.sh doc/api/doxy-api.conf doc/api/html /home/runner/work/dpdk/dpdk/doc/api/doxy-html-custom.sh
/home/runner/work/dpdk/dpdk/doc/api/doxy-api-index.md:59: error: unable to resolve reference to `rte_pmd_ifpga.h' for \ref command (warning treated as error, aborting now)
[2775/3390] Compiling C object 'examples/examples@@dpdk-fips_validation@exe/fips_validation_fips_validation_hmac.c.o'.
[2776/3390] Generating html_guides with a custom command.
ninja: build stopped: subcommand failed.
##[error]Process completed with exit code 1.
####################################################################################
#### [End job log] ubuntu-18.04-clang-shared-doc+tests at step "Build and test"
####################################################################################
--------------------------------END LOGS-----------------------------

      parent reply	other threads:[~2021-02-22  5:11 UTC|newest]

Thread overview: 3+ messages / expand[flat|nested]  mbox.gz  Atom feed  top
     [not found] <1613963747-30047-5-git-send-email-wei.huang@intel.com>
2021-02-22  3:17 ` [dpdk-test-report] |SUCCESS| pw88074 " checkpatch
2021-02-22  5:05 ` [dpdk-test-report] |FAILURE| pw88074 " 0-day Robot
2021-02-22  5:09 ` 0-day Robot [this message]

Reply instructions:

You may reply publicly to this message via plain-text email
using any one of the following methods:

* Save the following mbox file, import it into your mail client,
  and reply-to-all from there: mbox

  Avoid top-posting and favor interleaved quoting:
  https://en.wikipedia.org/wiki/Posting_style#Interleaved_style

* Reply using the --to, --cc, and --in-reply-to
  switches of git-send-email(1):

  git send-email \
    --in-reply-to=20210222050942.32675-1-robot@bytheb.org \
    --to=robot@bytheb.org \
    --cc=test-report@dpdk.org \
    --cc=wei.huang@intel.com \
    /path/to/YOUR_REPLY

  https://kernel.org/pub/software/scm/git/docs/git-send-email.html

* If your mail client supports setting the In-Reply-To header
  via mailto: links, try the mailto: link

automatic DPDK test reports

This inbox may be cloned and mirrored by anyone:

	git clone --mirror https://inbox.dpdk.org/test-report/0 test-report/git/0.git

	# If you have public-inbox 1.1+ installed, you may
	# initialize and index your mirror using the following commands:
	public-inbox-init -V2 test-report test-report/ https://inbox.dpdk.org/test-report \
		test-report@dpdk.org
	public-inbox-index test-report

Example config snippet for mirrors.
Newsgroup available over NNTP:
	nntp://inbox.dpdk.org/inbox.dpdk.test-report


AGPL code for this site: git clone https://public-inbox.org/public-inbox.git