automatic DPDK test reports
 help / color / mirror / Atom feed
* [dpdk-test-report] |SUCCESS| pw89896 [PATCH v6] app/testpmd: support multi-process
       [not found] <1616741174-57660-1-git-send-email-humin29@huawei.com>
@ 2021-03-26  6:46 ` checkpatch
  2021-03-26  7:55 ` [dpdk-test-report] |FAILURE| pw89896 " 0-day Robot
  2021-03-26  7:57 ` [dpdk-test-report] |FAILURE| pw89896 [dpdk-dev] [PATCH v6] " 0-day Robot
  2 siblings, 0 replies; 3+ messages in thread
From: checkpatch @ 2021-03-26  6:46 UTC (permalink / raw)
  To: test-report

Test-Label: checkpatch
Test-Status: SUCCESS
http://dpdk.org/patch/89896

_coding style OK_



^ permalink raw reply	[flat|nested] 3+ messages in thread

* [dpdk-test-report] |FAILURE| pw89896 app/testpmd: support multi-process
       [not found] <1616741174-57660-1-git-send-email-humin29@huawei.com>
  2021-03-26  6:46 ` [dpdk-test-report] |SUCCESS| pw89896 [PATCH v6] app/testpmd: support multi-process checkpatch
@ 2021-03-26  7:55 ` 0-day Robot
  2021-03-26  7:57 ` [dpdk-test-report] |FAILURE| pw89896 [dpdk-dev] [PATCH v6] " 0-day Robot
  2 siblings, 0 replies; 3+ messages in thread
From: 0-day Robot @ 2021-03-26  7:55 UTC (permalink / raw)
  To: test-report; +Cc: humin29, robot

From: robot@bytheb.org

Test-Label: travis-robot
Test-Status: FAILURE
http://patchwork.dpdk.org/patch/89896/

_travis build: failed_
Build URL: https://travis-ci.com/ovsrobot/dpdk/builds/221270644

^ permalink raw reply	[flat|nested] 3+ messages in thread

* [dpdk-test-report] |FAILURE| pw89896 [dpdk-dev] [PATCH v6] app/testpmd: support multi-process
       [not found] <1616741174-57660-1-git-send-email-humin29@huawei.com>
  2021-03-26  6:46 ` [dpdk-test-report] |SUCCESS| pw89896 [PATCH v6] app/testpmd: support multi-process checkpatch
  2021-03-26  7:55 ` [dpdk-test-report] |FAILURE| pw89896 " 0-day Robot
@ 2021-03-26  7:57 ` 0-day Robot
  2 siblings, 0 replies; 3+ messages in thread
From: 0-day Robot @ 2021-03-26  7:57 UTC (permalink / raw)
  To: test-report; +Cc: humin29, robot

From: robot@bytheb.org

Test-Label: github-robot
Test-Status: FAILURE
http://patchwork.dpdk.org/patch/89896/

_github build: failed_
Build URL: https://github.com/ovsrobot/dpdk/actions/runs/689119290
Build Logs:
-----------------------Summary of failed steps-----------------------
ubuntu-18.04-gcc-shared-abi+doc+tests failed at step "Build and test"
ubuntu-18.04-clang-shared-doc+tests failed at step "Build and test"
----------------------End summary of failed steps--------------------

-------------------------------BEGIN LOGS----------------------------
####################################################################################
#### [Begin job log] ubuntu-18.04-gcc-shared-abi+doc+tests at step "Build and test"
####################################################################################
[2839/3399] Compiling C object 'examples/examples@@dpdk-ipsec-secgw@exe/ipsec-secgw_rt.c.o'.
[2840/3399] Compiling C object 'examples/examples@@dpdk-ipsec-secgw@exe/ipsec-secgw_sp4.c.o'.
[2841/3399] Compiling C object 'examples/examples@@dpdk-ipsec-secgw@exe/ipsec-secgw_sa.c.o'.
[2842/3399] Compiling C object 'examples/examples@@dpdk-l2fwd-event@exe/l2fwd-event_l2fwd_common.c.o'.
[2843/3399] Compiling C object 'examples/examples@@dpdk-kni@exe/kni_main.c.o'.
[2844/3399] Linking target examples/dpdk-ipsec-secgw.
[2845/3399] Compiling C object 'examples/examples@@dpdk-l2fwd@exe/l2fwd_main.c.o'.
[2846/3399] Compiling C object 'examples/examples@@dpdk-l2fwd-event@exe/l2fwd-event_l2fwd_poll.c.o'.
[2847/3399] Linking target examples/dpdk-l2fwd.
[2848/3399] Compiling C object 'examples/examples@@dpdk-ipv4_multicast@exe/ipv4_multicast_main.c.o'.
[2849/3399] Linking target examples/dpdk-ipv4_multicast.
[2850/3399] Linking target examples/dpdk-kni.
[2851/3399] Compiling C object 'examples/examples@@dpdk-l2fwd-event@exe/l2fwd-event_main.c.o'.
[2852/3399] Compiling C object 'examples/examples@@dpdk-l2fwd-event@exe/l2fwd-event_l2fwd_event.c.o'.
[2853/3399] Compiling C object 'examples/examples@@dpdk-l2fwd-event@exe/l2fwd-event_l2fwd_event_internal_port.c.o'.
[2854/3399] Generating html_guides with a custom command.
FAILED: doc/guides/html 
/usr/bin/python3 ../buildtools/call-sphinx-build.py /usr/bin/sphinx-build 21.05.0-rc0 /home/runner/work/dpdk/dpdk/doc/guides /home/runner/work/dpdk/dpdk/build/doc/guides -W

Warning, treated as error:
/home/runner/work/dpdk/dpdk/doc/guides/testpmd_app_ug/run_app.rst:588:Block quote ends without a blank line; unexpected unindent.
[2855/3399] Compiling C object 'examples/examples@@dpdk-l2fwd-event@exe/l2fwd-event_l2fwd_event_generic.c.o'.
[2856/3399] Compiling C object 'examples/examples@@dpdk-l2fwd-crypto@exe/l2fwd-crypto_main.c.o'.
ninja: build stopped: subcommand failed.
##[error]Process completed with exit code 1.
####################################################################################
#### [End job log] ubuntu-18.04-gcc-shared-abi+doc+tests at step "Build and test"
####################################################################################




####################################################################################
#### [Begin job log] ubuntu-18.04-clang-shared-doc+tests at step "Build and test"
####################################################################################
[2820/3401] Compiling C object 'examples/examples@@dpdk-ioat@exe/ioat_ioatfwd.c.o'.
[2821/3401] Linking target examples/dpdk-ioat.
[2822/3401] Compiling C object 'examples/examples@@dpdk-ip_pipeline@exe/ip_pipeline_link.c.o'.
[2823/3401] Compiling C object 'examples/examples@@dpdk-ip_pipeline@exe/ip_pipeline_main.c.o'.
[2824/3401] Compiling C object 'examples/examples@@dpdk-ip_pipeline@exe/ip_pipeline_mempool.c.o'.
[2825/3401] Compiling C object 'examples/examples@@dpdk-ip_pipeline@exe/ip_pipeline_parser.c.o'.
[2826/3401] Compiling C object 'examples/examples@@dpdk-ip_pipeline@exe/ip_pipeline_swq.c.o'.
[2827/3401] Compiling C object 'examples/examples@@dpdk-ip_pipeline@exe/ip_pipeline_tap.c.o'.
[2828/3401] Compiling C object 'examples/examples@@dpdk-ip_pipeline@exe/ip_pipeline_pipeline.c.o'.
[2829/3401] Compiling C object 'examples/examples@@dpdk-ip_pipeline@exe/ip_pipeline_tmgr.c.o'.
[2830/3401] Compiling C object 'examples/examples@@dpdk-ipsec-secgw@exe/ipsec-secgw_flow.c.o'.
[2831/3401] Compiling C object 'examples/examples@@dpdk-ipsec-secgw@exe/ipsec-secgw_event_helper.c.o'.
[2832/3401] Linking target examples/dpdk-ip_pipeline.
[2833/3401] Compiling C object 'examples/examples@@dpdk-ip_reassembly@exe/ip_reassembly_main.c.o'.
[2834/3401] Linking target examples/dpdk-ip_reassembly.
[2835/3401] Generating html_guides with a custom command.
FAILED: doc/guides/html 
/usr/bin/python3 ../buildtools/call-sphinx-build.py /usr/bin/sphinx-build 21.05.0-rc0 /home/runner/work/dpdk/dpdk/doc/guides /home/runner/work/dpdk/dpdk/build/doc/guides -W

Warning, treated as error:
/home/runner/work/dpdk/dpdk/doc/guides/testpmd_app_ug/run_app.rst:588:Block quote ends without a blank line; unexpected unindent.
[2836/3401] Compiling C object 'examples/examples@@dpdk-ipsec-secgw@exe/ipsec-secgw_sad.c.o'.
[2837/3401] Compiling C object 'examples/examples@@dpdk-ipsec-secgw@exe/ipsec-secgw_ipsec.c.o'.
ninja: build stopped: subcommand failed.
##[error]Process completed with exit code 1.
####################################################################################
#### [End job log] ubuntu-18.04-clang-shared-doc+tests at step "Build and test"
####################################################################################
--------------------------------END LOGS-----------------------------

^ permalink raw reply	[flat|nested] 3+ messages in thread

end of thread, other threads:[~2021-03-26  7:57 UTC | newest]

Thread overview: 3+ messages (download: mbox.gz / follow: Atom feed)
-- links below jump to the message on this page --
     [not found] <1616741174-57660-1-git-send-email-humin29@huawei.com>
2021-03-26  6:46 ` [dpdk-test-report] |SUCCESS| pw89896 [PATCH v6] app/testpmd: support multi-process checkpatch
2021-03-26  7:55 ` [dpdk-test-report] |FAILURE| pw89896 " 0-day Robot
2021-03-26  7:57 ` [dpdk-test-report] |FAILURE| pw89896 [dpdk-dev] [PATCH v6] " 0-day Robot

This is a public inbox, see mirroring instructions
for how to clone and mirror all data and code used for this inbox;
as well as URLs for NNTP newsgroup(s).