automatic DPDK test reports
 help / color / mirror / Atom feed
* [dpdk-test-report] |SUCCESS| pw90741 [PATCH v3 11/11] mempool/cnxk: add cn10k batch dequeue op
       [not found] <20210406151115.1889455-12-asekhar@marvell.com>
@ 2021-04-06 15:13 ` checkpatch
  2021-04-06 16:55 ` [dpdk-test-report] |FAILURE| pw90741 " 0-day Robot
  2021-04-06 16:57 ` [dpdk-test-report] |FAILURE| pw90741 [dpdk-dev] [PATCH v3 11/11] " 0-day Robot
  2 siblings, 0 replies; 3+ messages in thread
From: checkpatch @ 2021-04-06 15:13 UTC (permalink / raw)
  To: test-report

Test-Label: checkpatch
Test-Status: SUCCESS
http://dpdk.org/patch/90741

_coding style OK_



^ permalink raw reply	[flat|nested] 3+ messages in thread

* [dpdk-test-report] |FAILURE| pw90741 mempool/cnxk: add cn10k batch dequeue op
       [not found] <20210406151115.1889455-12-asekhar@marvell.com>
  2021-04-06 15:13 ` [dpdk-test-report] |SUCCESS| pw90741 [PATCH v3 11/11] mempool/cnxk: add cn10k batch dequeue op checkpatch
@ 2021-04-06 16:55 ` 0-day Robot
  2021-04-06 16:57 ` [dpdk-test-report] |FAILURE| pw90741 [dpdk-dev] [PATCH v3 11/11] " 0-day Robot
  2 siblings, 0 replies; 3+ messages in thread
From: 0-day Robot @ 2021-04-06 16:55 UTC (permalink / raw)
  To: test-report; +Cc: asekhar, robot

From: robot@bytheb.org

Test-Label: travis-robot
Test-Status: FAILURE
http://patchwork.dpdk.org/patch/90741/

_travis build: failed_
Build URL: https://travis-ci.com/ovsrobot/dpdk/builds/222296343

^ permalink raw reply	[flat|nested] 3+ messages in thread

* [dpdk-test-report] |FAILURE| pw90741 [dpdk-dev] [PATCH v3 11/11] mempool/cnxk: add cn10k batch dequeue op
       [not found] <20210406151115.1889455-12-asekhar@marvell.com>
  2021-04-06 15:13 ` [dpdk-test-report] |SUCCESS| pw90741 [PATCH v3 11/11] mempool/cnxk: add cn10k batch dequeue op checkpatch
  2021-04-06 16:55 ` [dpdk-test-report] |FAILURE| pw90741 " 0-day Robot
@ 2021-04-06 16:57 ` 0-day Robot
  2 siblings, 0 replies; 3+ messages in thread
From: 0-day Robot @ 2021-04-06 16:57 UTC (permalink / raw)
  To: test-report; +Cc: asekhar, robot

From: robot@bytheb.org

Test-Label: github-robot
Test-Status: FAILURE
http://patchwork.dpdk.org/patch/90741/

_github build: failed_
Build URL: https://github.com/ovsrobot/dpdk/actions/runs/723113316
Build Logs:
-----------------------Summary of failed steps-----------------------
ubuntu-18.04-gcc-shared-abi+doc+tests failed at step "Build and test"
ubuntu-18.04-clang-shared-doc+tests failed at step "Build and test"
----------------------End summary of failed steps--------------------

-------------------------------BEGIN LOGS----------------------------
####################################################################################
#### [Begin job log] ubuntu-18.04-gcc-shared-abi+doc+tests at step "Build and test"
####################################################################################
[3382/3399] Compiling C object 'buildtools/chkincs/buildtools@chkincs@@chkincs@exe/meson-generated_rte_swx_table_wm.c.o'.
[3383/3399] Compiling C object 'buildtools/chkincs/buildtools@chkincs@@chkincs@exe/meson-generated_rte_port_in_action.c.o'.
[3384/3399] Compiling C object 'buildtools/chkincs/buildtools@chkincs@@chkincs@exe/meson-generated_rte_pipeline.c.o'.
[3385/3399] Compiling C object 'buildtools/chkincs/buildtools@chkincs@@chkincs@exe/meson-generated_rte_swx_pipeline.c.o'.
[3386/3399] Compiling C object 'buildtools/chkincs/buildtools@chkincs@@chkincs@exe/meson-generated_rte_swx_extern.c.o'.
[3387/3399] Compiling C object 'buildtools/chkincs/buildtools@chkincs@@chkincs@exe/meson-generated_rte_swx_ctl.c.o'.
[3388/3399] Compiling C object 'buildtools/chkincs/buildtools@chkincs@@chkincs@exe/meson-generated_rte_table_action.c.o'.
[3389/3399] Compiling C object 'buildtools/chkincs/buildtools@chkincs@@chkincs@exe/meson-generated_bpf_def.c.o'.
[3390/3399] Compiling C object 'buildtools/chkincs/buildtools@chkincs@@chkincs@exe/meson-generated_rte_flow_classify.c.o'.
[3391/3399] Compiling C object 'buildtools/chkincs/buildtools@chkincs@@chkincs@exe/meson-generated_rte_bpf.c.o'.
[3392/3399] Compiling C object 'buildtools/chkincs/buildtools@chkincs@@chkincs@exe/meson-generated_rte_graph.c.o'.
[3393/3399] Compiling C object 'buildtools/chkincs/buildtools@chkincs@@chkincs@exe/meson-generated_rte_bpf_ethdev.c.o'.
[3394/3399] Compiling C object 'buildtools/chkincs/buildtools@chkincs@@chkincs@exe/meson-generated_rte_graph_worker.c.o'.
[3395/3399] Compiling C object 'buildtools/chkincs/buildtools@chkincs@@chkincs@exe/meson-generated_rte_node_ip4_api.c.o'.
[3396/3399] Compiling C object 'buildtools/chkincs/buildtools@chkincs@@chkincs@exe/main.c.o'.
[3397/3399] Compiling C object 'buildtools/chkincs/buildtools@chkincs@@chkincs@exe/meson-generated_rte_node_eth_api.c.o'.
[3398/3399] Linking target buildtools/chkincs/chkincs.
[3399/3399] Generating html_guides with a custom command.
FAILED: doc/guides/html 
/usr/bin/python3 ../buildtools/call-sphinx-build.py /usr/bin/sphinx-build 21.05.0-rc0 /home/runner/work/dpdk/dpdk/doc/guides /home/runner/work/dpdk/dpdk/build/doc/guides -W

Warning, treated as error:
/home/runner/work/dpdk/dpdk/doc/guides/mempool/cnxk.rst:36:unknown document: ../platform/cnxk
ninja: build stopped: subcommand failed.
##[error]Process completed with exit code 1.
####################################################################################
#### [End job log] ubuntu-18.04-gcc-shared-abi+doc+tests at step "Build and test"
####################################################################################




####################################################################################
#### [Begin job log] ubuntu-18.04-clang-shared-doc+tests at step "Build and test"
####################################################################################
[3335/3401] Compiling C object 'buildtools/chkincs/buildtools@chkincs@@chkincs@exe/meson-generated_rte_regexdev_driver.c.o'.
[3336/3401] Compiling C object 'buildtools/chkincs/buildtools@chkincs@@chkincs@exe/meson-generated_rte_rib.c.o'.
[3337/3401] Compiling C object 'buildtools/chkincs/buildtools@chkincs@@chkincs@exe/meson-generated_rte_rib6.c.o'.
[3338/3401] Compiling C object 'buildtools/chkincs/buildtools@chkincs@@chkincs@exe/meson-generated_rte_reorder.c.o'.
[3339/3401] Compiling C object 'buildtools/chkincs/buildtools@chkincs@@chkincs@exe/meson-generated_rte_sched.c.o'.
[3340/3401] Compiling C object 'buildtools/chkincs/buildtools@chkincs@@chkincs@exe/meson-generated_rte_sched_common.c.o'.
[3341/3401] Compiling C object 'buildtools/chkincs/buildtools@chkincs@@chkincs@exe/meson-generated_rte_approx.c.o'.
[3342/3401] Compiling C object 'buildtools/chkincs/buildtools@chkincs@@chkincs@exe/meson-generated_rte_red.c.o'.
[3343/3401] Compiling C object 'buildtools/chkincs/buildtools@chkincs@@chkincs@exe/meson-generated_rte_security.c.o'.
[3344/3401] Compiling C object 'buildtools/chkincs/buildtools@chkincs@@chkincs@exe/meson-generated_rte_security_driver.c.o'.
[3345/3401] Compiling C object 'buildtools/chkincs/buildtools@chkincs@@chkincs@exe/meson-generated_rte_stack.c.o'.
[3346/3401] Compiling C object 'buildtools/chkincs/buildtools@chkincs@@chkincs@exe/meson-generated_rte_vhost.c.o'.
[3347/3401] Compiling C object 'buildtools/chkincs/buildtools@chkincs@@chkincs@exe/meson-generated_rte_vdpa.c.o'.
[3348/3401] Compiling C object 'buildtools/chkincs/buildtools@chkincs@@chkincs@exe/meson-generated_rte_vdpa_dev.c.o'.
[3349/3401] Compiling C object 'buildtools/chkincs/buildtools@chkincs@@chkincs@exe/meson-generated_rte_vhost_crypto.c.o'.
[3350/3401] Generating html_guides with a custom command.
FAILED: doc/guides/html 
/usr/bin/python3 ../buildtools/call-sphinx-build.py /usr/bin/sphinx-build 21.05.0-rc0 /home/runner/work/dpdk/dpdk/doc/guides /home/runner/work/dpdk/dpdk/build/doc/guides -W

Warning, treated as error:
/home/runner/work/dpdk/dpdk/doc/guides/mempool/cnxk.rst:36:unknown document: ../platform/cnxk
[3351/3401] Compiling C object 'buildtools/chkincs/buildtools@chkincs@@chkincs@exe/meson-generated_rte_vhost_async.c.o'.
[3352/3401] Compiling C object 'buildtools/chkincs/buildtools@chkincs@@chkincs@exe/meson-generated_rte_ipsec.c.o'.
ninja: build stopped: subcommand failed.
##[error]Process completed with exit code 1.
####################################################################################
#### [End job log] ubuntu-18.04-clang-shared-doc+tests at step "Build and test"
####################################################################################
--------------------------------END LOGS-----------------------------

^ permalink raw reply	[flat|nested] 3+ messages in thread

end of thread, other threads:[~2021-04-06 16:57 UTC | newest]

Thread overview: 3+ messages (download: mbox.gz / follow: Atom feed)
-- links below jump to the message on this page --
     [not found] <20210406151115.1889455-12-asekhar@marvell.com>
2021-04-06 15:13 ` [dpdk-test-report] |SUCCESS| pw90741 [PATCH v3 11/11] mempool/cnxk: add cn10k batch dequeue op checkpatch
2021-04-06 16:55 ` [dpdk-test-report] |FAILURE| pw90741 " 0-day Robot
2021-04-06 16:57 ` [dpdk-test-report] |FAILURE| pw90741 [dpdk-dev] [PATCH v3 11/11] " 0-day Robot

automatic DPDK test reports

This inbox may be cloned and mirrored by anyone:

	git clone --mirror https://inbox.dpdk.org/test-report/0 test-report/git/0.git

	# If you have public-inbox 1.1+ installed, you may
	# initialize and index your mirror using the following commands:
	public-inbox-init -V2 test-report test-report/ https://inbox.dpdk.org/test-report \
		test-report@dpdk.org
	public-inbox-index test-report

Example config snippet for mirrors.
Newsgroup available over NNTP:
	nntp://inbox.dpdk.org/inbox.dpdk.test-report


AGPL code for this site: git clone https://public-inbox.org/public-inbox.git