automatic DPDK test reports
 help / color / mirror / Atom feed
* [dpdk-test-report] |SUCCESS| pw90746 [PATCH 4/4] vhost: remove unnecessary level of indirection
       [not found] <e52542758fb627a709dfb03d96a164fd58135f3b.1617723339.git.bnemeth@redhat.com>
@ 2021-04-06 15:45 ` checkpatch
  2021-04-06 16:55 ` [dpdk-test-report] |FAILURE| pw90746 " 0-day Robot
  2021-04-06 16:57 ` [dpdk-test-report] |FAILURE| pw90746 [dpdk-dev] [PATCH 4/4] " 0-day Robot
  2 siblings, 0 replies; 3+ messages in thread
From: checkpatch @ 2021-04-06 15:45 UTC (permalink / raw)
  To: test-report

Test-Label: checkpatch
Test-Status: SUCCESS
http://dpdk.org/patch/90746

_coding style OK_



^ permalink raw reply	[flat|nested] 3+ messages in thread

* [dpdk-test-report] |FAILURE| pw90746 vhost: remove unnecessary level of indirection
       [not found] <e52542758fb627a709dfb03d96a164fd58135f3b.1617723339.git.bnemeth@redhat.com>
  2021-04-06 15:45 ` [dpdk-test-report] |SUCCESS| pw90746 [PATCH 4/4] vhost: remove unnecessary level of indirection checkpatch
@ 2021-04-06 16:55 ` 0-day Robot
  2021-04-06 16:57 ` [dpdk-test-report] |FAILURE| pw90746 [dpdk-dev] [PATCH 4/4] " 0-day Robot
  2 siblings, 0 replies; 3+ messages in thread
From: 0-day Robot @ 2021-04-06 16:55 UTC (permalink / raw)
  To: test-report; +Cc: bnemeth, robot

From: robot@bytheb.org

Test-Label: travis-robot
Test-Status: FAILURE
http://patchwork.dpdk.org/patch/90746/

_travis build: failed_
Build URL: https://travis-ci.com/ovsrobot/dpdk/builds/222296446

^ permalink raw reply	[flat|nested] 3+ messages in thread

* [dpdk-test-report] |FAILURE| pw90746 [dpdk-dev] [PATCH 4/4] vhost: remove unnecessary level of indirection
       [not found] <e52542758fb627a709dfb03d96a164fd58135f3b.1617723339.git.bnemeth@redhat.com>
  2021-04-06 15:45 ` [dpdk-test-report] |SUCCESS| pw90746 [PATCH 4/4] vhost: remove unnecessary level of indirection checkpatch
  2021-04-06 16:55 ` [dpdk-test-report] |FAILURE| pw90746 " 0-day Robot
@ 2021-04-06 16:57 ` 0-day Robot
  2 siblings, 0 replies; 3+ messages in thread
From: 0-day Robot @ 2021-04-06 16:57 UTC (permalink / raw)
  To: test-report; +Cc: bnemeth, robot

From: robot@bytheb.org

Test-Label: github-robot
Test-Status: FAILURE
http://patchwork.dpdk.org/patch/90746/

_github build: failed_
Build URL: https://github.com/ovsrobot/dpdk/actions/runs/723116223
Build Logs:
-----------------------Summary of failed steps-----------------------
ubuntu-18.04-gcc-static failed at step "Build and test"
ubuntu-18.04-gcc-shared-abi+doc+tests failed at step "Build and test"
ubuntu-18.04-clang-static failed at step "Build and test"
ubuntu-18.04-clang-shared-doc+tests failed at step "Build and test"
ubuntu-18.04-gcc-static-i386 failed at step "Build and test"
ubuntu-18.04-gcc-static-aarch64 failed at step "Build and test"
ubuntu-18.04-gcc-shared-aarch64 failed at step "Build and test"
----------------------End summary of failed steps--------------------

-------------------------------BEGIN LOGS----------------------------
####################################################################################
#### [Begin job log] ubuntu-18.04-gcc-static at step "Build and test"
####################################################################################
[586/3183] Compiling C object 'drivers/drivers@@rte_common_iavf@sha/meson-generated_.._rte_common_iavf.pmd.c.o'.
[587/3183] Compiling C object 'drivers/drivers@@tmp_rte_common_octeontx@sta/common_octeontx_octeontx_mbox.c.o'.
[588/3183] Linking static target drivers/libtmp_rte_common_octeontx.a.
[589/3183] Linking target drivers/librte_common_iavf.so.21.2.
[590/3183] Generating rte_common_dpaax.sym_chk with a meson_exe.py custom command.
[591/3183] Linking target drivers/librte_common_dpaax.so.21.2.
[592/3183] Generating symbol file 'drivers/drivers@@rte_common_iavf@sha/librte_common_iavf.so.21.2.symbols'.
[593/3183] Generating symbol file 'drivers/drivers@@rte_common_dpaax@sha/librte_common_dpaax.so.21.2.symbols'.
[594/3183] Generating rte_common_octeontx_def with a custom command.
[595/3183] Generating rte_common_octeontx_mingw with a custom command.
[596/3183] Generating rte_common_octeontx.pmd.c with a custom command.
[597/3183] Compiling C object 'drivers/drivers@@rte_common_octeontx@sta/meson-generated_.._rte_common_octeontx.pmd.c.o'.
[598/3183] Linking static target drivers/librte_common_octeontx.a.
[599/3183] Compiling C object 'lib/lib@@rte_vhost@sta/librte_vhost_virtio_net.c.o'.
FAILED: lib/lib@@rte_vhost@sta/librte_vhost_virtio_net.c.o 
ccache gcc -Ilib/lib@@rte_vhost@sta -Ilib -I../lib -Ilib/librte_vhost -I../lib/librte_vhost -I. -I../ -Iconfig -I../config -Ilib/librte_eal/include -I../lib/librte_eal/include -Ilib/librte_eal/linux/include -I../lib/librte_eal/linux/include -Ilib/librte_eal/x86/include -I../lib/librte_eal/x86/include -Ilib/librte_eal/common -I../lib/librte_eal/common -Ilib/librte_eal -I../lib/librte_eal -Ilib/librte_kvargs -I../lib/librte_kvargs -Ilib/librte_telemetry/../librte_metrics -I../lib/librte_telemetry/../librte_metrics -Ilib/librte_telemetry -I../lib/librte_telemetry -Ilib/librte_ethdev -I../lib/librte_ethdev -Ilib/librte_net -I../lib/librte_net -Ilib/librte_mbuf -I../lib/librte_mbuf -Ilib/librte_mempool -I../lib/librte_mempool -Ilib/librte_ring -I../lib/librte_ring -Ilib/librte_meter -I../lib/librte_meter -Ilib/librte_cryptodev -I../lib/librte_cryptodev -Ilib/librte_rcu -I../lib/librte_rcu -Ilib/librte_hash -I../lib/librte_hash -Ilib/librte_pci -I../lib/librte_pci -fdiagnostics-color=always -pipe -D_FILE_OFFSET_BITS=64 -Wall -Winvalid-pch -Werror -O2 -g -include rte_config.h -Wextra -Wcast-qual -Wdeprecated -Wformat -Wformat-nonliteral -Wformat-security -Wmissing-declarations -Wmissing-prototypes -Wnested-externs -Wold-style-definition -Wpointer-arith -Wsign-compare -Wstrict-prototypes -Wundef -Wwrite-strings -Wno-missing-field-initializers -D_GNU_SOURCE -fPIC -march=corei7 -DALLOW_EXPERIMENTAL_API -DALLOW_INTERNAL_API -Wno-format-truncation -fno-strict-aliasing  -MD -MQ 'lib/lib@@rte_vhost@sta/librte_vhost_virtio_net.c.o' -MF 'lib/lib@@rte_vhost@sta/librte_vhost_virtio_net.c.o.d' -o 'lib/lib@@rte_vhost@sta/librte_vhost_virtio_net.c.o' -c ../lib/librte_vhost/virtio_net.c
../lib/librte_vhost/virtio_net.c: In function ‘virtio_dev_tx_packed’:
../lib/librte_vhost/virtio_net.c:2472:11: error: unused variable ‘i’ [-Werror=unused-variable]
  uint16_t i;
           ^
cc1: all warnings being treated as errors
[600/3183] Generating rte_common_octeontx.sym_chk with a meson_exe.py custom command.
[601/3183] Compiling C object 'drivers/drivers@@tmp_rte_common_octeontx2@sta/common_octeontx2_otx2_dev.c.o'.
ninja: build stopped: subcommand failed.
##[error]Process completed with exit code 1.
####################################################################################
#### [End job log] ubuntu-18.04-gcc-static at step "Build and test"
####################################################################################




####################################################################################
#### [Begin job log] ubuntu-18.04-gcc-shared-abi+doc+tests at step "Build and test"
####################################################################################
[588/3399] Generating rte_common_dpaax_def with a custom command.
[589/3399] Generating rte_common_dpaax_mingw with a custom command.
[590/3399] Linking static target drivers/librte_common_dpaax.a.
[591/3399] Compiling C object 'drivers/drivers@@rte_common_dpaax@sha/meson-generated_.._rte_common_dpaax.pmd.c.o'.
[592/3399] Compiling C object 'drivers/drivers@@tmp_rte_common_iavf@sta/common_iavf_iavf_common.c.o'.
[593/3399] Compiling C object 'drivers/drivers@@tmp_rte_common_iavf@sta/common_iavf_iavf_adminq.c.o'.
[594/3399] Compiling C object 'drivers/drivers@@tmp_rte_common_iavf@sta/common_iavf_iavf_impl.c.o'.
[595/3399] Linking static target drivers/libtmp_rte_common_iavf.a.
[596/3399] Generating rte_common_iavf.pmd.c with a custom command.
[597/3399] Compiling C object 'drivers/drivers@@rte_common_iavf@sta/meson-generated_.._rte_common_iavf.pmd.c.o'.
[598/3399] Linking static target drivers/librte_common_iavf.a.
[599/3399] Generating rte_common_iavf_def with a custom command.
[600/3399] Generating rte_common_iavf_mingw with a custom command.
[601/3399] Compiling C object 'lib/lib@@rte_vhost@sta/librte_vhost_virtio_net.c.o'.
FAILED: lib/lib@@rte_vhost@sta/librte_vhost_virtio_net.c.o 
ccache gcc -Ilib/lib@@rte_vhost@sta -Ilib -I../lib -Ilib/librte_vhost -I../lib/librte_vhost -I. -I../ -Iconfig -I../config -Ilib/librte_eal/include -I../lib/librte_eal/include -Ilib/librte_eal/linux/include -I../lib/librte_eal/linux/include -Ilib/librte_eal/x86/include -I../lib/librte_eal/x86/include -Ilib/librte_eal/common -I../lib/librte_eal/common -Ilib/librte_eal -I../lib/librte_eal -Ilib/librte_kvargs -I../lib/librte_kvargs -Ilib/librte_telemetry/../librte_metrics -I../lib/librte_telemetry/../librte_metrics -Ilib/librte_telemetry -I../lib/librte_telemetry -Ilib/librte_ethdev -I../lib/librte_ethdev -Ilib/librte_net -I../lib/librte_net -Ilib/librte_mbuf -I../lib/librte_mbuf -Ilib/librte_mempool -I../lib/librte_mempool -Ilib/librte_ring -I../lib/librte_ring -Ilib/librte_meter -I../lib/librte_meter -Ilib/librte_cryptodev -I../lib/librte_cryptodev -Ilib/librte_rcu -I../lib/librte_rcu -Ilib/librte_hash -I../lib/librte_hash -Ilib/librte_pci -I../lib/librte_pci -fdiagnostics-color=always -pipe -D_FILE_OFFSET_BITS=64 -Wall -Winvalid-pch -Werror -O2 -g -include rte_config.h -Wextra -Wcast-qual -Wdeprecated -Wformat -Wformat-nonliteral -Wformat-security -Wmissing-declarations -Wmissing-prototypes -Wnested-externs -Wold-style-definition -Wpointer-arith -Wsign-compare -Wstrict-prototypes -Wundef -Wwrite-strings -Wno-missing-field-initializers -D_GNU_SOURCE -fPIC -march=corei7 -DALLOW_EXPERIMENTAL_API -DALLOW_INTERNAL_API -Wno-format-truncation -fno-strict-aliasing  -MD -MQ 'lib/lib@@rte_vhost@sta/librte_vhost_virtio_net.c.o' -MF 'lib/lib@@rte_vhost@sta/librte_vhost_virtio_net.c.o.d' -o 'lib/lib@@rte_vhost@sta/librte_vhost_virtio_net.c.o' -c ../lib/librte_vhost/virtio_net.c
../lib/librte_vhost/virtio_net.c: In function ‘virtio_dev_tx_packed’:
../lib/librte_vhost/virtio_net.c:2472:11: error: unused variable ‘i’ [-Werror=unused-variable]
  uint16_t i;
           ^
cc1: all warnings being treated as errors
[602/3399] Generating rte_common_dpaax.sym_chk with a meson_exe.py custom command.
[603/3399] Generating rte_common_iavf.sym_chk with a meson_exe.py custom command.
ninja: build stopped: subcommand failed.
##[error]Process completed with exit code 1.
####################################################################################
#### [End job log] ubuntu-18.04-gcc-shared-abi+doc+tests at step "Build and test"
####################################################################################




####################################################################################
#### [Begin job log] ubuntu-18.04-clang-static at step "Build and test"
####################################################################################
[443/3185] Generating rte_ipsec_def with a custom command.
[444/3185] Generating rte_ipsec_mingw with a custom command.
[445/3185] Generating symbol file 'lib/lib@@rte_stack@sha/librte_stack.so.21.2.symbols'.
[446/3185] Compiling C object 'lib/lib@@rte_ipsec@sta/librte_ipsec_sa.c.o'.
[447/3185] Compiling C object 'lib/lib@@rte_ipsec@sta/librte_ipsec_ipsec_sad.c.o'.
[448/3185] Compiling C object 'lib/librte_fib/lib@librte_fib@@dir24_8_avx512_tmp@sta/dir24_8_avx512.c.o'.
[449/3185] Compiling C object 'lib/librte_fib/lib@librte_fib@@trie_avx512_tmp@sta/trie_avx512.c.o'.
[450/3185] Linking static target lib/librte_ipsec.a.
[451/3185] Linking static target lib/librte_fib/libdir24_8_avx512_tmp.a.
[452/3185] Linking static target lib/librte_fib/libtrie_avx512_tmp.a.
[453/3185] Compiling C object 'lib/lib@@rte_fib@sta/librte_fib_rte_fib.c.o'.
[454/3185] Compiling C object 'lib/lib@@rte_fib@sta/librte_fib_rte_fib6.c.o'.
[455/3185] Compiling C object 'lib/lib@@rte_fib@sta/librte_fib_dir24_8.c.o'.
[456/3185] Compiling C object 'lib/lib@@rte_fib@sta/librte_fib_trie.c.o'.
[457/3185] Compiling C object 'lib/lib@@rte_vhost@sta/librte_vhost_virtio_net.c.o'.
FAILED: lib/lib@@rte_vhost@sta/librte_vhost_virtio_net.c.o 
ccache clang -Ilib/lib@@rte_vhost@sta -Ilib -I../lib -Ilib/librte_vhost -I../lib/librte_vhost -I. -I../ -Iconfig -I../config -Ilib/librte_eal/include -I../lib/librte_eal/include -Ilib/librte_eal/linux/include -I../lib/librte_eal/linux/include -Ilib/librte_eal/x86/include -I../lib/librte_eal/x86/include -Ilib/librte_eal/common -I../lib/librte_eal/common -Ilib/librte_eal -I../lib/librte_eal -Ilib/librte_kvargs -I../lib/librte_kvargs -Ilib/librte_telemetry/../librte_metrics -I../lib/librte_telemetry/../librte_metrics -Ilib/librte_telemetry -I../lib/librte_telemetry -Ilib/librte_ethdev -I../lib/librte_ethdev -Ilib/librte_net -I../lib/librte_net -Ilib/librte_mbuf -I../lib/librte_mbuf -Ilib/librte_mempool -I../lib/librte_mempool -Ilib/librte_ring -I../lib/librte_ring -Ilib/librte_meter -I../lib/librte_meter -Ilib/librte_cryptodev -I../lib/librte_cryptodev -Ilib/librte_rcu -I../lib/librte_rcu -Ilib/librte_hash -I../lib/librte_hash -Ilib/librte_pci -I../lib/librte_pci -Xclang -fcolor-diagnostics -pipe -D_FILE_OFFSET_BITS=64 -Wall -Winvalid-pch -Werror -O2 -g -include rte_config.h -Wextra -Wcast-qual -Wdeprecated -Wformat -Wformat-nonliteral -Wformat-security -Wmissing-declarations -Wmissing-prototypes -Wnested-externs -Wold-style-definition -Wpointer-arith -Wsign-compare -Wstrict-prototypes -Wundef -Wwrite-strings -Wno-address-of-packed-member -Wno-missing-field-initializers -D_GNU_SOURCE -fPIC -march=corei7 -DALLOW_EXPERIMENTAL_API -DALLOW_INTERNAL_API -DVHOST_CLANG_UNROLL_PRAGMA -fno-strict-aliasing  -MD -MQ 'lib/lib@@rte_vhost@sta/librte_vhost_virtio_net.c.o' -MF 'lib/lib@@rte_vhost@sta/librte_vhost_virtio_net.c.o.d' -o 'lib/lib@@rte_vhost@sta/librte_vhost_virtio_net.c.o' -c ../lib/librte_vhost/virtio_net.c
../lib/librte_vhost/virtio_net.c:2472:11: error: unused variable 'i' [-Werror,-Wunused-variable]
        uint16_t i;
                 ^
1 error generated.
[458/3185] Generating rte_fib_def with a custom command.
[459/3185] Generating ipsec.sym_chk with a meson_exe.py custom command.
ninja: build stopped: subcommand failed.
##[error]Process completed with exit code 1.
####################################################################################
#### [End job log] ubuntu-18.04-clang-static at step "Build and test"
####################################################################################




####################################################################################
#### [Begin job log] ubuntu-18.04-clang-shared-doc+tests at step "Build and test"
####################################################################################
[439/3401] Generating symbol file 'lib/lib@@rte_sched@sha/librte_sched.so.21.2.symbols'.
[440/3401] Compiling C object 'lib/lib@@rte_vhost@sta/librte_vhost_iotlb.c.o'.
[441/3401] Compiling C object 'lib/lib@@rte_vhost@sta/librte_vhost_fd_man.c.o'.
[442/3401] Compiling C object 'lib/lib@@rte_vhost@sta/librte_vhost_socket.c.o'.
[443/3401] Compiling C object 'lib/lib@@rte_vhost@sta/librte_vhost_vdpa.c.o'.
[444/3401] Compiling C object 'lib/lib@@rte_vhost@sta/librte_vhost_vhost.c.o'.
[445/3401] Compiling C object 'lib/lib@@rte_vhost@sta/librte_vhost_vhost_user.c.o'.
[446/3401] Generating security.sym_chk with a meson_exe.py custom command.
[447/3401] Generating rte_vhost_def with a custom command.
[448/3401] Linking target lib/librte_security.so.21.2.
[449/3401] Generating stack.sym_chk with a meson_exe.py custom command.
[450/3401] Linking target lib/librte_stack.so.21.2.
[451/3401] Generating symbol file 'lib/lib@@rte_security@sha/librte_security.so.21.2.symbols'.
[452/3401] Compiling C object 'lib/lib@@rte_vhost@sta/librte_vhost_vhost_crypto.c.o'.
[453/3401] Compiling C object 'lib/lib@@rte_vhost@sta/librte_vhost_virtio_net.c.o'.
FAILED: lib/lib@@rte_vhost@sta/librte_vhost_virtio_net.c.o 
ccache clang -Ilib/lib@@rte_vhost@sta -Ilib -I../lib -Ilib/librte_vhost -I../lib/librte_vhost -I. -I../ -Iconfig -I../config -Ilib/librte_eal/include -I../lib/librte_eal/include -Ilib/librte_eal/linux/include -I../lib/librte_eal/linux/include -Ilib/librte_eal/x86/include -I../lib/librte_eal/x86/include -Ilib/librte_eal/common -I../lib/librte_eal/common -Ilib/librte_eal -I../lib/librte_eal -Ilib/librte_kvargs -I../lib/librte_kvargs -Ilib/librte_telemetry/../librte_metrics -I../lib/librte_telemetry/../librte_metrics -Ilib/librte_telemetry -I../lib/librte_telemetry -Ilib/librte_ethdev -I../lib/librte_ethdev -Ilib/librte_net -I../lib/librte_net -Ilib/librte_mbuf -I../lib/librte_mbuf -Ilib/librte_mempool -I../lib/librte_mempool -Ilib/librte_ring -I../lib/librte_ring -Ilib/librte_meter -I../lib/librte_meter -Ilib/librte_cryptodev -I../lib/librte_cryptodev -Ilib/librte_rcu -I../lib/librte_rcu -Ilib/librte_hash -I../lib/librte_hash -Ilib/librte_pci -I../lib/librte_pci -Xclang -fcolor-diagnostics -pipe -D_FILE_OFFSET_BITS=64 -Wall -Winvalid-pch -Werror -O2 -g -include rte_config.h -Wextra -Wcast-qual -Wdeprecated -Wformat -Wformat-nonliteral -Wformat-security -Wmissing-declarations -Wmissing-prototypes -Wnested-externs -Wold-style-definition -Wpointer-arith -Wsign-compare -Wstrict-prototypes -Wundef -Wwrite-strings -Wno-address-of-packed-member -Wno-missing-field-initializers -D_GNU_SOURCE -fPIC -march=corei7 -DALLOW_EXPERIMENTAL_API -DALLOW_INTERNAL_API -DVHOST_CLANG_UNROLL_PRAGMA -fno-strict-aliasing  -MD -MQ 'lib/lib@@rte_vhost@sta/librte_vhost_virtio_net.c.o' -MF 'lib/lib@@rte_vhost@sta/librte_vhost_virtio_net.c.o.d' -o 'lib/lib@@rte_vhost@sta/librte_vhost_virtio_net.c.o' -c ../lib/librte_vhost/virtio_net.c
../lib/librte_vhost/virtio_net.c:2472:11: error: unused variable 'i' [-Werror,-Wunused-variable]
        uint16_t i;
                 ^
1 error generated.
[454/3401] Generating rte_vhost_mingw with a custom command.
[455/3401] Generating symbol file 'lib/lib@@rte_stack@sha/librte_stack.so.21.2.symbols'.
ninja: build stopped: subcommand failed.
##[error]Process completed with exit code 1.
####################################################################################
#### [End job log] ubuntu-18.04-clang-shared-doc+tests at step "Build and test"
####################################################################################




####################################################################################
#### [Begin job log] ubuntu-18.04-gcc-static-i386 at step "Build and test"
####################################################################################
[633/2587] Linking target drivers/librte_bus_fslmc.so.21.2.
[634/2587] Generating rte_bus_ifpga.pmd.c with a custom command.
[635/2587] Compiling C object 'drivers/drivers@@rte_bus_ifpga@sta/meson-generated_.._rte_bus_ifpga.pmd.c.o'.
[636/2587] Linking static target drivers/librte_bus_ifpga.a.
[637/2587] Generating rte_bus_ifpga_def with a custom command.
[638/2587] Generating rte_bus_ifpga_mingw with a custom command.
[639/2587] Generating symbol file 'drivers/drivers@@rte_bus_fslmc@sha/librte_bus_fslmc.so.21.2.symbols'.
[640/2587] Compiling C object 'drivers/drivers@@rte_bus_ifpga@sha/meson-generated_.._rte_bus_ifpga.pmd.c.o'.
[641/2587] Generating rte_bus_ifpga.sym_chk with a meson_exe.py custom command.
[642/2587] Linking target drivers/librte_bus_ifpga.so.21.2.
[643/2587] Compiling C object 'drivers/drivers@@tmp_rte_bus_pci@sta/bus_pci_pci_common.c.o'.
[644/2587] Compiling C object 'drivers/drivers@@tmp_rte_bus_pci@sta/bus_pci_pci_params.c.o'.
[645/2587] Compiling C object 'drivers/drivers@@tmp_rte_bus_pci@sta/bus_pci_pci_common_uio.c.o'.
[646/2587] Compiling C object 'lib/lib@@rte_vhost@sta/librte_vhost_virtio_net.c.o'.
FAILED: lib/lib@@rte_vhost@sta/librte_vhost_virtio_net.c.o 
ccache gcc -Ilib/lib@@rte_vhost@sta -Ilib -I../lib -Ilib/librte_vhost -I../lib/librte_vhost -I. -I../ -Iconfig -I../config -Ilib/librte_eal/include -I../lib/librte_eal/include -Ilib/librte_eal/linux/include -I../lib/librte_eal/linux/include -Ilib/librte_eal/x86/include -I../lib/librte_eal/x86/include -Ilib/librte_eal/common -I../lib/librte_eal/common -Ilib/librte_eal -I../lib/librte_eal -Ilib/librte_kvargs -I../lib/librte_kvargs -Ilib/librte_telemetry/../librte_metrics -I../lib/librte_telemetry/../librte_metrics -Ilib/librte_telemetry -I../lib/librte_telemetry -Ilib/librte_ethdev -I../lib/librte_ethdev -Ilib/librte_net -I../lib/librte_net -Ilib/librte_mbuf -I../lib/librte_mbuf -Ilib/librte_mempool -I../lib/librte_mempool -Ilib/librte_ring -I../lib/librte_ring -Ilib/librte_meter -I../lib/librte_meter -Ilib/librte_cryptodev -I../lib/librte_cryptodev -Ilib/librte_rcu -I../lib/librte_rcu -Ilib/librte_hash -I../lib/librte_hash -Ilib/librte_pci -I../lib/librte_pci -fdiagnostics-color=always -pipe -D_FILE_OFFSET_BITS=64 -Wall -Winvalid-pch -Werror -O2 -g -include rte_config.h -Wextra -Wcast-qual -Wdeprecated -Wformat -Wformat-nonliteral -Wformat-security -Wmissing-declarations -Wmissing-prototypes -Wnested-externs -Wold-style-definition -Wpointer-arith -Wsign-compare -Wstrict-prototypes -Wundef -Wwrite-strings -Wno-missing-field-initializers -Wno-pointer-to-int-cast -D_GNU_SOURCE -m32 -fPIC -march=corei7 -DALLOW_EXPERIMENTAL_API -DALLOW_INTERNAL_API -Wno-format-truncation -fno-strict-aliasing  -MD -MQ 'lib/lib@@rte_vhost@sta/librte_vhost_virtio_net.c.o' -MF 'lib/lib@@rte_vhost@sta/librte_vhost_virtio_net.c.o.d' -o 'lib/lib@@rte_vhost@sta/librte_vhost_virtio_net.c.o' -c ../lib/librte_vhost/virtio_net.c
../lib/librte_vhost/virtio_net.c: In function ‘virtio_dev_tx_packed’:
../lib/librte_vhost/virtio_net.c:2472:11: error: unused variable ‘i’ [-Werror=unused-variable]
  uint16_t i;
           ^
cc1: all warnings being treated as errors
[647/2587] Compiling C object 'drivers/drivers@@tmp_rte_bus_pci@sta/bus_pci_linux_pci_uio.c.o'.
[648/2587] Compiling C object 'drivers/drivers@@tmp_rte_bus_pci@sta/bus_pci_linux_pci.c.o'.
ninja: build stopped: subcommand failed.
##[error]Process completed with exit code 1.
####################################################################################
#### [End job log] ubuntu-18.04-gcc-static-i386 at step "Build and test"
####################################################################################




####################################################################################
#### [Begin job log] ubuntu-18.04-gcc-static-aarch64 at step "Build and test"
####################################################################################
[593/3183] Compiling C object 'drivers/drivers@@rte_common_octeontx@sta/meson-generated_.._rte_common_octeontx.pmd.c.o'.
[594/3183] Linking static target drivers/librte_common_octeontx.a.
[595/3183] Generating rte_common_octeontx_def with a custom command.
[596/3183] Generating rte_common_octeontx_mingw with a custom command.
[597/3183] Generating rte_common_iavf.sym_chk with a meson_exe.py custom command.
[598/3183] Linking target drivers/librte_common_iavf.so.21.2.
[599/3183] Generating symbol file 'drivers/drivers@@rte_common_iavf@sha/librte_common_iavf.so.21.2.symbols'.
[600/3183] Compiling C object 'drivers/drivers@@rte_common_octeontx@sha/meson-generated_.._rte_common_octeontx.pmd.c.o'.
[601/3183] Generating rte_common_octeontx.sym_chk with a meson_exe.py custom command.
[602/3183] Linking target drivers/librte_common_octeontx.so.21.2.
[603/3183] Generating symbol file 'drivers/drivers@@rte_common_octeontx@sha/librte_common_octeontx.so.21.2.symbols'.
[604/3183] Compiling C object 'drivers/drivers@@tmp_rte_common_octeontx2@sta/common_octeontx2_otx2_irq.c.o'.
[605/3183] Compiling C object 'drivers/drivers@@tmp_rte_common_octeontx2@sta/common_octeontx2_otx2_dev.c.o'.
[606/3183] Compiling C object 'lib/lib@@rte_vhost@sta/librte_vhost_virtio_net.c.o'.
FAILED: lib/lib@@rte_vhost@sta/librte_vhost_virtio_net.c.o 
ccache gcc -Ilib/lib@@rte_vhost@sta -Ilib -I../lib -Ilib/librte_vhost -I../lib/librte_vhost -I. -I../ -Iconfig -I../config -Ilib/librte_eal/include -I../lib/librte_eal/include -Ilib/librte_eal/linux/include -I../lib/librte_eal/linux/include -Ilib/librte_eal/x86/include -I../lib/librte_eal/x86/include -Ilib/librte_eal/common -I../lib/librte_eal/common -Ilib/librte_eal -I../lib/librte_eal -Ilib/librte_kvargs -I../lib/librte_kvargs -Ilib/librte_telemetry/../librte_metrics -I../lib/librte_telemetry/../librte_metrics -Ilib/librte_telemetry -I../lib/librte_telemetry -Ilib/librte_ethdev -I../lib/librte_ethdev -Ilib/librte_net -I../lib/librte_net -Ilib/librte_mbuf -I../lib/librte_mbuf -Ilib/librte_mempool -I../lib/librte_mempool -Ilib/librte_ring -I../lib/librte_ring -Ilib/librte_meter -I../lib/librte_meter -Ilib/librte_cryptodev -I../lib/librte_cryptodev -Ilib/librte_rcu -I../lib/librte_rcu -Ilib/librte_hash -I../lib/librte_hash -Ilib/librte_pci -I../lib/librte_pci -fdiagnostics-color=always -pipe -D_FILE_OFFSET_BITS=64 -Wall -Winvalid-pch -Werror -O2 -g -include rte_config.h -Wextra -Wcast-qual -Wdeprecated -Wformat -Wformat-nonliteral -Wformat-security -Wmissing-declarations -Wmissing-prototypes -Wnested-externs -Wold-style-definition -Wpointer-arith -Wsign-compare -Wstrict-prototypes -Wundef -Wwrite-strings -Wno-missing-field-initializers -D_GNU_SOURCE -fPIC -march=corei7 -DALLOW_EXPERIMENTAL_API -DALLOW_INTERNAL_API -Wno-format-truncation -fno-strict-aliasing  -MD -MQ 'lib/lib@@rte_vhost@sta/librte_vhost_virtio_net.c.o' -MF 'lib/lib@@rte_vhost@sta/librte_vhost_virtio_net.c.o.d' -o 'lib/lib@@rte_vhost@sta/librte_vhost_virtio_net.c.o' -c ../lib/librte_vhost/virtio_net.c
../lib/librte_vhost/virtio_net.c: In function ‘virtio_dev_tx_packed’:
../lib/librte_vhost/virtio_net.c:2472:11: error: unused variable ‘i’ [-Werror=unused-variable]
  uint16_t i;
           ^
cc1: all warnings being treated as errors
[607/3183] Compiling C object 'drivers/drivers@@tmp_rte_common_octeontx2@sta/common_octeontx2_otx2_common.c.o'.
[608/3183] Compiling C object 'drivers/drivers@@tmp_rte_common_octeontx2@sta/common_octeontx2_otx2_mbox.c.o'.
ninja: build stopped: subcommand failed.
##[error]Process completed with exit code 1.
####################################################################################
#### [End job log] ubuntu-18.04-gcc-static-aarch64 at step "Build and test"
####################################################################################




####################################################################################
#### [Begin job log] ubuntu-18.04-gcc-shared-aarch64 at step "Build and test"
####################################################################################
[604/3396] Compiling C object 'drivers/drivers@@rte_common_iavf@sha/meson-generated_.._rte_common_iavf.pmd.c.o'.
[605/3396] Compiling C object 'drivers/drivers@@tmp_rte_common_octeontx@sta/common_octeontx_octeontx_mbox.c.o'.
[606/3396] Generating rte_common_dpaax.sym_chk with a meson_exe.py custom command.
[607/3396] Linking static target drivers/libtmp_rte_common_octeontx.a.
[608/3396] Linking target drivers/librte_common_dpaax.so.21.2.
[609/3396] Linking target drivers/librte_common_iavf.so.21.2.
[610/3396] Generating symbol file 'drivers/drivers@@rte_common_dpaax@sha/librte_common_dpaax.so.21.2.symbols'.
[611/3396] Generating symbol file 'drivers/drivers@@rte_common_iavf@sha/librte_common_iavf.so.21.2.symbols'.
[612/3396] Generating rte_common_octeontx_def with a custom command.
[613/3396] Generating rte_common_octeontx_mingw with a custom command.
[614/3396] Generating rte_common_octeontx.pmd.c with a custom command.
[615/3396] Compiling C object 'drivers/drivers@@rte_common_octeontx@sta/meson-generated_.._rte_common_octeontx.pmd.c.o'.
[616/3396] Linking static target drivers/librte_common_octeontx.a.
[617/3396] Compiling C object 'lib/lib@@rte_vhost@sta/librte_vhost_virtio_net.c.o'.
FAILED: lib/lib@@rte_vhost@sta/librte_vhost_virtio_net.c.o 
ccache gcc -Ilib/lib@@rte_vhost@sta -Ilib -I../lib -Ilib/librte_vhost -I../lib/librte_vhost -I. -I../ -Iconfig -I../config -Ilib/librte_eal/include -I../lib/librte_eal/include -Ilib/librte_eal/linux/include -I../lib/librte_eal/linux/include -Ilib/librte_eal/x86/include -I../lib/librte_eal/x86/include -Ilib/librte_eal/common -I../lib/librte_eal/common -Ilib/librte_eal -I../lib/librte_eal -Ilib/librte_kvargs -I../lib/librte_kvargs -Ilib/librte_telemetry/../librte_metrics -I../lib/librte_telemetry/../librte_metrics -Ilib/librte_telemetry -I../lib/librte_telemetry -Ilib/librte_ethdev -I../lib/librte_ethdev -Ilib/librte_net -I../lib/librte_net -Ilib/librte_mbuf -I../lib/librte_mbuf -Ilib/librte_mempool -I../lib/librte_mempool -Ilib/librte_ring -I../lib/librte_ring -Ilib/librte_meter -I../lib/librte_meter -Ilib/librte_cryptodev -I../lib/librte_cryptodev -Ilib/librte_rcu -I../lib/librte_rcu -Ilib/librte_hash -I../lib/librte_hash -Ilib/librte_pci -I../lib/librte_pci -fdiagnostics-color=always -pipe -D_FILE_OFFSET_BITS=64 -Wall -Winvalid-pch -Werror -O2 -g -include rte_config.h -Wextra -Wcast-qual -Wdeprecated -Wformat -Wformat-nonliteral -Wformat-security -Wmissing-declarations -Wmissing-prototypes -Wnested-externs -Wold-style-definition -Wpointer-arith -Wsign-compare -Wstrict-prototypes -Wundef -Wwrite-strings -Wno-missing-field-initializers -D_GNU_SOURCE -fPIC -march=corei7 -DALLOW_EXPERIMENTAL_API -DALLOW_INTERNAL_API -Wno-format-truncation -fno-strict-aliasing  -MD -MQ 'lib/lib@@rte_vhost@sta/librte_vhost_virtio_net.c.o' -MF 'lib/lib@@rte_vhost@sta/librte_vhost_virtio_net.c.o.d' -o 'lib/lib@@rte_vhost@sta/librte_vhost_virtio_net.c.o' -c ../lib/librte_vhost/virtio_net.c
../lib/librte_vhost/virtio_net.c: In function ‘virtio_dev_tx_packed’:
../lib/librte_vhost/virtio_net.c:2472:11: error: unused variable ‘i’ [-Werror=unused-variable]
  uint16_t i;
           ^
cc1: all warnings being treated as errors
[618/3396] Generating rte_common_octeontx.sym_chk with a meson_exe.py custom command.
[619/3396] Compiling C object 'drivers/drivers@@tmp_rte_common_octeontx2@sta/common_octeontx2_otx2_dev.c.o'.
ninja: build stopped: subcommand failed.
##[error]Process completed with exit code 1.
####################################################################################
#### [End job log] ubuntu-18.04-gcc-shared-aarch64 at step "Build and test"
####################################################################################
--------------------------------END LOGS-----------------------------

^ permalink raw reply	[flat|nested] 3+ messages in thread

end of thread, other threads:[~2021-04-06 16:57 UTC | newest]

Thread overview: 3+ messages (download: mbox.gz / follow: Atom feed)
-- links below jump to the message on this page --
     [not found] <e52542758fb627a709dfb03d96a164fd58135f3b.1617723339.git.bnemeth@redhat.com>
2021-04-06 15:45 ` [dpdk-test-report] |SUCCESS| pw90746 [PATCH 4/4] vhost: remove unnecessary level of indirection checkpatch
2021-04-06 16:55 ` [dpdk-test-report] |FAILURE| pw90746 " 0-day Robot
2021-04-06 16:57 ` [dpdk-test-report] |FAILURE| pw90746 [dpdk-dev] [PATCH 4/4] " 0-day Robot

automatic DPDK test reports

This inbox may be cloned and mirrored by anyone:

	git clone --mirror https://inbox.dpdk.org/test-report/0 test-report/git/0.git

	# If you have public-inbox 1.1+ installed, you may
	# initialize and index your mirror using the following commands:
	public-inbox-init -V2 test-report test-report/ https://inbox.dpdk.org/test-report \
		test-report@dpdk.org
	public-inbox-index test-report

Example config snippet for mirrors.
Newsgroup available over NNTP:
	nntp://inbox.dpdk.org/inbox.dpdk.test-report


AGPL code for this site: git clone https://public-inbox.org/public-inbox.git