automatic DPDK test reports
 help / color / mirror / Atom feed
* [dpdk-test-report] |FAILURE| pw90749 [PATCH] build: list symbols exports in a single file
@ 2021-04-07  0:03 dpdklab
  0 siblings, 0 replies; only message in thread
From: dpdklab @ 2021-04-07  0:03 UTC (permalink / raw)
  To: Test Report; +Cc: dpdk-test-reports

[-- Attachment #1: Type: text/plain, Size: 6017 bytes --]

Test-Label: iol-testing
Test-Status: FAILURE
http://dpdk.org/patch/90749

_Testing issues_

Submitter: David Marchand <david.marchand@redhat.com>
Date: Tuesday, April 06 2021 16:32:30 
DPDK git baseline: Repo:dpdk
  Branch: master
  CommitID:aa9cb78f66c53728593c1f65f69f2bbc7ca4a4a9

90749 --> testing fail

Test environment and result as below:

+---------------------+----------------------+--------------------+-------------------+----------------+
|     Environment     | dpdk_mingw64_compile | dpdk_meson_compile | dpdk_compile_spdk | dpdk_unit_test |
+=====================+======================+====================+===================+================+
| Windows Server 2019 | PASS                 | FAIL               | SKIPPED           | SKIPPED        |
+---------------------+----------------------+--------------------+-------------------+----------------+
| Ubuntu 18.04        | SKIPPED              | PASS               | PASS              | PASS           |
+---------------------+----------------------+--------------------+-------------------+----------------+
| CentOS Stream 8     | SKIPPED              | PASS               | SKIPPED           | SKIPPED        |
+---------------------+----------------------+--------------------+-------------------+----------------+
| Fedora 31           | SKIPPED              | PASS               | PASS              | SKIPPED        |
+---------------------+----------------------+--------------------+-------------------+----------------+
| Fedora 32           | SKIPPED              | PASS               | SKIPPED           | SKIPPED        |
+---------------------+----------------------+--------------------+-------------------+----------------+
| Ubuntu 20.04        | SKIPPED              | PASS               | SKIPPED           | SKIPPED        |
+---------------------+----------------------+--------------------+-------------------+----------------+
| RHEL 7              | SKIPPED              | PASS               | SKIPPED           | SKIPPED        |
+---------------------+----------------------+--------------------+-------------------+----------------+
| openSUSE Leap 15    | SKIPPED              | PASS               | SKIPPED           | SKIPPED        |
+---------------------+----------------------+--------------------+-------------------+----------------+
| Arch Linux          | SKIPPED              | PASS               | SKIPPED           | SKIPPED        |
+---------------------+----------------------+--------------------+-------------------+----------------+
| RHEL8               | SKIPPED              | PASS               | SKIPPED           | SKIPPED        |
+---------------------+----------------------+--------------------+-------------------+----------------+
| FreeBSD 11.2        | SKIPPED              | PASS               | SKIPPED           | SKIPPED        |
+---------------------+----------------------+--------------------+-------------------+----------------+
| Ubuntu 18.04 ARM    | SKIPPED              | PASS               | SKIPPED           | PASS           |
+---------------------+----------------------+--------------------+-------------------+----------------+

==== 20 line log output for Windows Server 2019 (dpdk_meson_compile): ====
rte_common_mlx5_exports.def : error LNK2001: unresolved external symbol mlx5_nl_mac_addr_add
rte_common_mlx5_exports.def : error LNK2001: unresolved external symbol mlx5_nl_mac_addr_flush
rte_common_mlx5_exports.def : error LNK2001: unresolved external symbol mlx5_nl_mac_addr_remove
rte_common_mlx5_exports.def : error LNK2001: unresolved external symbol mlx5_nl_mac_addr_sync
rte_common_mlx5_exports.def : error LNK2001: unresolved external symbol mlx5_nl_portnum
rte_common_mlx5_exports.def : error LNK2001: unresolved external symbol mlx5_nl_promisc
rte_common_mlx5_exports.def : error LNK2001: unresolved external symbol mlx5_nl_switch_info
rte_common_mlx5_exports.def : error LNK2001: unresolved external symbol mlx5_nl_vf_mac_addr_modify
rte_common_mlx5_exports.def : error LNK2001: unresolved external symbol mlx5_nl_vlan_vmwa_create
rte_common_mlx5_exports.def : error LNK2001: unresolved external symbol mlx5_nl_vlan_vmwa_delete
rte_common_mlx5_exports.def : error LNK2001: unresolved external symbol mlx5_translate_port_name
drivers\rte_common_mlx5.lib : fatal error LNK1120: 22 unresolved externals
clang: error: linker command failed with exit code 1120 (use -v to see invocation)
[277/290] Linking target lib/rte_cmdline-21.dll
Creating library lib\rte_cmdline.lib and object lib\rte_cmdline.exp
[278/290] Linking target lib/rte_ethdev-21.dll
Creating library lib\rte_ethdev.lib and object lib\rte_ethdev.exp
[279/290] Compiling C object drivers/libtmp_rte_net_mlx5.a.p/net_mlx5_mlx5_rxtx.c.obj
ninja: build stopped: subcommand failed.
[1] Error running command.
==== End log output ====

Windows Server 2019
	Kernel: 10.0
	Compiler: clang 9.0 and gcc 8.1.0 (MinGW)

Ubuntu 18.04
	Kernel: 4.18.0-240.10.1.el8_3.x86_64
	Compiler: gcc 7.5.0-3ubuntu1~18.04

CentOS Stream 8
	Kernel: 4.18.0-240.10.1.el8_3.x86_64
	Compiler: gcc 8.4.1 20200928

Fedora 31
	Kernel: 4.18.0-240.10.1.el8_3.x86_64
	Compiler: gcc 9.3.1

Fedora 32
	Kernel: 4.18.0-240.10.1.el8_3.x86_64
	Compiler: gcc 10.2.1

Ubuntu 20.04
	Kernel: 4.18.0-240.10.1.el8_3.x86_64
	Compiler: gcc 9.3.0-17ubuntu1~20.04

RHEL 7
	Kernel: 4.18.0-240.10.1.el8_3.x86_64
	Compiler: gcc 4.8.5 20150623 (Red Hat 4.8.5-44)

openSUSE Leap 15
	Kernel: 4.18.0-240.10.1.el8_3.x86_64
	Compiler: gcc 7.5.0

Arch Linux
	Kernel: 4.18.0-240.10.1.el8_3.x86_64
	Compiler: gcc 10.2.0

RHEL8
	Kernel: 4.18.0-240.10.1.el8_3.x86_64
	Compiler: gcc 8.3.1 20191121 (Red Hat 8.3.1-5)

FreeBSD 11.2
	Kernel: 11.2
	Compiler: gcc 8.3

Ubuntu 18.04 ARM
	Kernel: 5.4.0-53-generic
	Compiler: gcc 9.3

To view detailed results, visit:
https://lab.dpdk.org/results/dashboard/patchsets/16327/

UNH-IOL DPDK Community Lab

To manage your email subscriptions, visit: 
https://lab.dpdk.org/results/dashboard/preferences/subscriptions/

^ permalink raw reply	[flat|nested] only message in thread

only message in thread, other threads:[~2021-04-07  0:03 UTC | newest]

Thread overview: (only message) (download: mbox.gz / follow: Atom feed)
-- links below jump to the message on this page --
2021-04-07  0:03 [dpdk-test-report] |FAILURE| pw90749 [PATCH] build: list symbols exports in a single file dpdklab

automatic DPDK test reports

This inbox may be cloned and mirrored by anyone:

	git clone --mirror https://inbox.dpdk.org/test-report/0 test-report/git/0.git

	# If you have public-inbox 1.1+ installed, you may
	# initialize and index your mirror using the following commands:
	public-inbox-init -V2 test-report test-report/ https://inbox.dpdk.org/test-report \
		test-report@dpdk.org
	public-inbox-index test-report

Example config snippet for mirrors.
Newsgroup available over NNTP:
	nntp://inbox.dpdk.org/inbox.dpdk.test-report


AGPL code for this site: git clone https://public-inbox.org/public-inbox.git