automatic DPDK test reports
 help / color / mirror / Atom feed
* [dpdk-test-report] |FAILURE| pw93035 [PATCH] [PATCH-V7] config/arm: add Qualcomm Centriq 2400 SoC config
@ 2021-05-14 19:46 dpdklab
  0 siblings, 0 replies; 5+ messages in thread
From: dpdklab @ 2021-05-14 19:46 UTC (permalink / raw)
  To: Ali Alnubani, Thomas Monjalon, Test Report; +Cc: dpdk-test-reports

[-- Attachment #1: Type: text/plain, Size: 1090 bytes --]

Test-Label: iol-mellanox-Functional
Test-Status: FAILURE
http://dpdk.org/patch/93035

_Functional Testing issues_

Submitter: Thierry Herbelot <thierry.herbelot@6wind.com>
Date: Friday, May 07 2021 08:48:15 
DPDK git baseline: Repo:dpdk
  Branch: master
  CommitID:7fb41a8cbe2108a7634343c3abb7f9d01aed3777

93035 --> functional testing fail

Test environment and result as below:

Ubuntu 18.04
Kernel: 4.15.0-generic
Compiler: gcc 7.4
NIC: Mellanox ConnectX-4 Lx 25000 Mbps
Target: x86_64-native-linuxapp-gcc
Fail/Total: 0/5


Ubuntu 18.04
Kernel: 4.15.0-generic
Compiler: gcc 7.4
NIC: Mellanox ConnectX-4 Lx 40000 Mbps
Target: x86_64-native-linuxapp-gcc
Fail/Total: 1/5
	Failed Tests:
		- dynamic_config


Ubuntu 18.04 ARM
Kernel: 4.15.0-132-generic
Compiler: gcc 7.5
NIC: Arm Mellanox ConnectX-5 10000 Mbps
Target: x86_64-native-linuxapp-gcc
Fail/Total: 0/4


To view detailed results, visit:
https://lab.dpdk.org/results/dashboard/patchsets/16981/

UNH-IOL DPDK Community Lab

To manage your email subscriptions, visit: 
https://lab.dpdk.org/results/dashboard/preferences/subscriptions/

^ permalink raw reply	[flat|nested] 5+ messages in thread

* [dpdk-test-report] |FAILURE| pw93035 [PATCH] [PATCH-V7] config/arm: add Qualcomm Centriq 2400 SoC config
@ 2021-05-14 20:26 dpdklab
  0 siblings, 0 replies; 5+ messages in thread
From: dpdklab @ 2021-05-14 20:26 UTC (permalink / raw)
  To: Ali Alnubani, Thomas Monjalon, Test Report; +Cc: dpdk-test-reports

[-- Attachment #1: Type: text/plain, Size: 1090 bytes --]

Test-Label: iol-mellanox-Functional
Test-Status: FAILURE
http://dpdk.org/patch/93035

_Functional Testing issues_

Submitter: Thierry Herbelot <thierry.herbelot@6wind.com>
Date: Friday, May 07 2021 08:48:15 
DPDK git baseline: Repo:dpdk
  Branch: master
  CommitID:7fb41a8cbe2108a7634343c3abb7f9d01aed3777

93035 --> functional testing fail

Test environment and result as below:

Ubuntu 18.04
Kernel: 4.15.0-generic
Compiler: gcc 7.4
NIC: Mellanox ConnectX-4 Lx 25000 Mbps
Target: x86_64-native-linuxapp-gcc
Fail/Total: 0/5


Ubuntu 18.04
Kernel: 4.15.0-generic
Compiler: gcc 7.4
NIC: Mellanox ConnectX-4 Lx 40000 Mbps
Target: x86_64-native-linuxapp-gcc
Fail/Total: 1/5
	Failed Tests:
		- dynamic_config


Ubuntu 18.04 ARM
Kernel: 4.15.0-132-generic
Compiler: gcc 7.5
NIC: Arm Mellanox ConnectX-5 10000 Mbps
Target: x86_64-native-linuxapp-gcc
Fail/Total: 0/4


To view detailed results, visit:
https://lab.dpdk.org/results/dashboard/patchsets/16981/

UNH-IOL DPDK Community Lab

To manage your email subscriptions, visit: 
https://lab.dpdk.org/results/dashboard/preferences/subscriptions/

^ permalink raw reply	[flat|nested] 5+ messages in thread

* [dpdk-test-report] |FAILURE| pw93035 [PATCH] [PATCH-V7] config/arm: add Qualcomm Centriq 2400 SoC config
@ 2021-05-08  1:21 dpdklab
  0 siblings, 0 replies; 5+ messages in thread
From: dpdklab @ 2021-05-08  1:21 UTC (permalink / raw)
  To: Ali Alnubani, Thomas Monjalon, Test Report; +Cc: dpdk-test-reports

[-- Attachment #1: Type: text/plain, Size: 1124 bytes --]

Test-Label: iol-mellanox-Functional
Test-Status: FAILURE
http://dpdk.org/patch/93035

_Functional Testing issues_

Submitter: Thierry Herbelot <thierry.herbelot@6wind.com>
Date: Friday, May 07 2021 08:48:15 
DPDK git baseline: Repo:dpdk
  Branch: master
  CommitID:7fb41a8cbe2108a7634343c3abb7f9d01aed3777

93035 --> functional testing fail

Test environment and result as below:

Ubuntu 18.04
Kernel: 4.15.0-generic
Compiler: gcc 7.4
NIC: Mellanox ConnectX-4 Lx 25000 Mbps
Target: x86_64-native-linuxapp-gcc
Fail/Total: 1/5
	Failed Tests:
		- dynamic_config


Ubuntu 18.04
Kernel: 4.15.0-generic
Compiler: gcc 7.4
NIC: Mellanox ConnectX-4 Lx 40000 Mbps
Target: x86_64-native-linuxapp-gcc
Fail/Total: 1/5
	Failed Tests:
		- dynamic_config


Ubuntu 18.04 ARM
Kernel: 4.15.0-132-generic
Compiler: gcc 7.5
NIC: Arm Mellanox ConnectX-5 10000 Mbps
Target: x86_64-native-linuxapp-gcc
Fail/Total: 0/4


To view detailed results, visit:
https://lab.dpdk.org/results/dashboard/patchsets/16981/

UNH-IOL DPDK Community Lab

To manage your email subscriptions, visit: 
https://lab.dpdk.org/results/dashboard/preferences/subscriptions/

^ permalink raw reply	[flat|nested] 5+ messages in thread

* [dpdk-test-report] |FAILURE| pw93035 [PATCH] [PATCH-V7] config/arm: add Qualcomm Centriq 2400 SoC config
@ 2021-05-07 21:14 dpdklab
  0 siblings, 0 replies; 5+ messages in thread
From: dpdklab @ 2021-05-07 21:14 UTC (permalink / raw)
  To: Ali Alnubani, Thomas Monjalon, Test Report; +Cc: dpdk-test-reports

[-- Attachment #1: Type: text/plain, Size: 969 bytes --]

Test-Label: iol-mellanox-Functional
Test-Status: FAILURE
http://dpdk.org/patch/93035

_Functional Testing issues_

Submitter: Thierry Herbelot <thierry.herbelot@6wind.com>
Date: Friday, May 07 2021 08:48:15 
DPDK git baseline: Repo:dpdk
  Branch: master
  CommitID:7fb41a8cbe2108a7634343c3abb7f9d01aed3777

93035 --> functional testing fail

Test environment and result as below:

Ubuntu 18.04
Kernel: 4.15.0-generic
Compiler: gcc 7.4
NIC: Mellanox ConnectX-4 Lx 25000 Mbps
Target: x86_64-native-linuxapp-gcc
Fail/Total: 1/5
	Failed Tests:
		- dynamic_config


Ubuntu 18.04
Kernel: 4.15.0-generic
Compiler: gcc 7.4
NIC: Mellanox ConnectX-4 Lx 40000 Mbps
Target: x86_64-native-linuxapp-gcc
Fail/Total: 1/5
	Failed Tests:
		- dynamic_config


To view detailed results, visit:
https://lab.dpdk.org/results/dashboard/patchsets/16981/

UNH-IOL DPDK Community Lab

To manage your email subscriptions, visit: 
https://lab.dpdk.org/results/dashboard/preferences/subscriptions/

^ permalink raw reply	[flat|nested] 5+ messages in thread

* [dpdk-test-report] |FAILURE| pw93035 [PATCH] [PATCH-V7] config/arm: add Qualcomm Centriq 2400 SoC config
@ 2021-05-07 20:22 dpdklab
  0 siblings, 0 replies; 5+ messages in thread
From: dpdklab @ 2021-05-07 20:22 UTC (permalink / raw)
  To: Ali Alnubani, Thomas Monjalon, Test Report; +Cc: dpdk-test-reports

[-- Attachment #1: Type: text/plain, Size: 789 bytes --]

Test-Label: iol-mellanox-Functional
Test-Status: FAILURE
http://dpdk.org/patch/93035

_Functional Testing issues_

Submitter: Thierry Herbelot <thierry.herbelot@6wind.com>
Date: Friday, May 07 2021 08:48:15 
DPDK git baseline: Repo:dpdk
  Branch: master
  CommitID:7fb41a8cbe2108a7634343c3abb7f9d01aed3777

93035 --> functional testing fail

Test environment and result as below:

Ubuntu 18.04
Kernel: 4.15.0-generic
Compiler: gcc 7.4
NIC: Mellanox ConnectX-4 Lx 25000 Mbps
Target: x86_64-native-linuxapp-gcc
Fail/Total: 1/5
	Failed Tests:
		- dynamic_config


To view detailed results, visit:
https://lab.dpdk.org/results/dashboard/patchsets/16981/

UNH-IOL DPDK Community Lab

To manage your email subscriptions, visit: 
https://lab.dpdk.org/results/dashboard/preferences/subscriptions/

^ permalink raw reply	[flat|nested] 5+ messages in thread

end of thread, other threads:[~2021-05-14 20:27 UTC | newest]

Thread overview: 5+ messages (download: mbox.gz / follow: Atom feed)
-- links below jump to the message on this page --
2021-05-14 19:46 [dpdk-test-report] |FAILURE| pw93035 [PATCH] [PATCH-V7] config/arm: add Qualcomm Centriq 2400 SoC config dpdklab
  -- strict thread matches above, loose matches on Subject: below --
2021-05-14 20:26 dpdklab
2021-05-08  1:21 dpdklab
2021-05-07 21:14 dpdklab
2021-05-07 20:22 dpdklab

This is a public inbox, see mirroring instructions
for how to clone and mirror all data and code used for this inbox;
as well as URLs for NNTP newsgroup(s).