From mboxrd@z Thu Jan  1 00:00:00 1970
Return-Path: <test-report-bounces@dpdk.org>
Received: from mails.dpdk.org (mails.dpdk.org [217.70.189.124])
	by inbox.dpdk.org (Postfix) with ESMTP id C0B4D43BE9
	for <public@inbox.dpdk.org>; Tue, 27 Feb 2024 19:06:36 +0100 (CET)
Received: from mails.dpdk.org (localhost [127.0.0.1])
	by mails.dpdk.org (Postfix) with ESMTP id B98DE40A6B;
	Tue, 27 Feb 2024 19:06:36 +0100 (CET)
Received: from mail.loongson.cn (mail.loongson.cn [114.242.206.163])
 by mails.dpdk.org (Postfix) with ESMTP id 88C6C40150
 for <test-report@dpdk.org>; Tue, 27 Feb 2024 19:06:33 +0100 (CET)
Received: from loongson.cn (unknown [192.168.100.1])
 by gateway (Coremail) with SMTP id _____8CxifClJN5l8gwSAA--.46478S3;
 Wed, 28 Feb 2024 02:06:30 +0800 (CST)
Received: from localhost.localdomain (unknown [192.168.100.1])
 by localhost.localdomain (Coremail) with SMTP id
 AQAAf8BxnhOkJN5lMLJIAA--.6980S3; 
 Wed, 28 Feb 2024 02:06:28 +0800 (CST)
Received: from localhost.localdomain (localhost.localdomain [127.0.0.1])
 by localhost.localdomain (8.15.2/8.15.2) with ESMTPS id 41RHff7X075530
 (version=TLSv1.3 cipher=TLS_AES_256_GCM_SHA384 bits=256 verify=NOT);
 Wed, 28 Feb 2024 01:41:42 +0800
Received: (from root@localhost)
 by localhost.localdomain (8.15.2/8.15.2/Submit) id 41RHfejH075529;
 Wed, 28 Feb 2024 01:41:40 +0800
Date: Wed, 28 Feb 2024 01:41:40 +0800
From: qemudev@loongson.cn
Message-Id: <202402271741.41RHfejH075529@localhost.localdomain>
Content-Type: text/plain; charset="utf-8"
Subject: |FAILURE| pw137363 [PATCH] lib/hash: add SipHash function
In-Reply-To: <20240227174012.343004-1-stephen@networkplumber.org>
References: <20240227174012.343004-1-stephen@networkplumber.org>
To: test-report@dpdk.org
Cc: Stephen Hemminger <stephen@networkplumber.org>, zhoumin@loongson.cn
X-CM-TRANSID: AQAAf8BxnhOkJN5lMLJIAA--.6980S3
Authentication-Results: localhost.localdomain; spf=neutral smtp.mail=q
 emudev@loongson.cn;
X-CM-SenderInfo: pthp3vthy6z05rqj20fqof0/1tbiAQAAD2XdnWUDLQABsh
X-Coremail-Antispam: 1Uk129KBj93XoW3XFWUGr4kWrW5Zr17Jr1fAFc_yoWxKF47pF
 93GrnrAFW7JF1xJ39rua109rn7WF4v9r47KrW8Xry0v3Wjyw1jqF1UJ34v9Fya93srJrZ8
 Wa13Wa15WryxurbCm3ZEXasCq-sJn29KB7ZKAUJUUUU8529EdanIXcx71UUUUU7KY7ZEXa
 sCq-sGcSsGvfJ3Ic02F40EFcxC0VAKzVAqx4xG6I80ebIjqfuFe4nvWSU5nxnvy29KBjDU
 0xBIdaVrnRJUUUyCb4IE77IF4wAFF20E14v26r1j6r4UM7CY07I20VC2zVCF04k26cxKx2
 IYs7xG6rWj6s0DM7CIcVAFz4kK6r1j6r18M28lY4IEw2IIxxk0rwA2F7IY1VAKz4vEj48v
 e4kI8wA2z4x0Y4vE2Ix0cI8IcVAFwI0_Jr0_JF4l84ACjcxK6xIIjxv20xvEc7CjxVAFwI
 0_Jr0_Gr1l84ACjcxK6I8E87Iv67AKxVWUJVW8JwA2z4x0Y4vEx4A2jsIEc7CjxVAFwI0_
 Jr0_Gr1le2I262IYc4CY6c8Ij28IcVAaY2xG8wAqjxCEc2xF0cIa020Ex4CE44I27wAqx4
 xG64xvF2IEw4CE5I8CrVC2j2WlYx0E2Ix0cI8IcVAFwI0_Jrv_JF1lYx0Ex4A2jsIE14v2
 6r1j6r4UMcvjeVCFs4IE7xkEbVWUJVW8JwAKzVCY07xG64k0F24l42xK82IYc2Ij64vIr4
 1l4I8I3I0E4IkC6x0Yz7v_Jr0_Gr1lx2IqxVAqx4xG67AKxVWUJVWUGwC20s026x8GjcxK
 67AKxVWUGVWUWwC2zVAF1VAY17CE14v26r1Y6r17MIIYrxkI7VAKI48JMIIF0xvE2Ix0cI
 8IcVAFwI0_Jr0_JF4lIxAIcVC0I7IYx2IY6xkF7I0E14v26r1j6r4UMIIF0xvE42xK8VAv
 wI8IcIk0rVWUJVWUCwCI42IY6I8E87Iv67AKxVWUJVW8JwCI42IY6I8E87Iv6xkF7I0E14
 v26r1j6r4UYxBIdaVFxhVjvjDU0xZFpf9x07UEiihUUUUU=
X-BeenThere: test-report@dpdk.org
X-Mailman-Version: 2.1.29
Precedence: list
List-Id: automatic DPDK test reports <test-report.dpdk.org>
List-Unsubscribe: <https://mails.dpdk.org/options/test-report>,
 <mailto:test-report-request@dpdk.org?subject=unsubscribe>
List-Archive: <http://mails.dpdk.org/archives/test-report/>
List-Post: <mailto:test-report@dpdk.org>
List-Help: <mailto:test-report-request@dpdk.org?subject=help>
List-Subscribe: <https://mails.dpdk.org/listinfo/test-report>,
 <mailto:test-report-request@dpdk.org?subject=subscribe>
Errors-To: test-report-bounces@dpdk.org

Test-Label: loongarch-compilation
Test-Status: FAILURE
http://dpdk.org/patch/137363

_ninja build failure_

Submitter: Stephen Hemminger <stephen@networkplumber.org>
Date: Tue, 27 Feb 2024 09:39:01 -0800
DPDK git baseline: Repo:dpdk
  Branch: main
  CommitID: 92c0ad70caf3ed6f4b93de6ddaf7bc369737c049

137363 --> ninja build failed

Test environment and result as below:

+---------------------+----------------+
|     Environment     | compilation    |
+---------------------+----------------+
| Loongnix-Server 8.3 | FAIL           |
+---------------------+----------------+

Loongnix-Server 8.3
    Kernel: 4.19.190+
    Compiler: gcc 8.3


Ninja build logs:
-------------------------------BEGIN LOGS----------------------------
FAILED: lib/librte_hash.a.p/hash_rte_siphash.c.o
cc -Ilib/librte_hash.a.p -Ilib -I../lib -Ilib/hash -I../lib/hash -I. -I.. -Iconfig -I../config -Ilib/eal/include -I../lib/eal/include -Ilib/eal/linux/include -I../lib/eal/linux/include -Ilib/eal/loongarch/include -I../lib/eal/loongarch/include -Ilib/eal/common -I../lib/eal/common -Ilib/eal -I../lib/eal -Ilib/kvargs -I../lib/kvargs -Ilib/log -I../lib/log -Ilib/metrics -I../lib/metrics -Ilib/telemetry -I../lib/telemetry -Ilib/net -I../lib/net -Ilib/mbuf -I../lib/mbuf -Ilib/mempool -I../lib/mempool -Ilib/ring -I../lib/ring -Ilib/rcu -I../lib/rcu -fdiagnostics-color=always -pipe -D_FILE_OFFSET_BITS=64 -Wall -Winvalid-pch -Wextra -std=c11 -O3 -include rte_config.h -Wcast-qual -Wdeprecated -Wformat -Wformat-nonliteral -Wformat-security -Wmissing-declarations -Wmissing-prototypes -Wnested-externs -Wold-style-definition -Wpointer-arith -Wsign-compare -Wstrict-prototypes -Wundef -Wwrite-strings -Wno-packed-not-aligned -Wno-missing-field-initializers -D_GNU_SOURCE -fPIC -march=loongarch64 -DAL
 LOW_EXPERIMENTAL_API -DALLOW_INTERNAL_API -Wno-format-truncation -DRTE_LOG_DEFAULT_LOGTYPE=lib.hash -MD -MQ lib/librte_hash.a.p/hash_rte_siphash.c.o -MF lib/librte_hash.a.p/hash_rte_siphash.c.o.d -o lib/librte_hash.a.p/hash_rte_siphash.c.o -c ../lib/hash/rte_siphash.c
./lib/hash/rte_siphash.c: In function ‘u8to64_le’:
./lib/hash/rte_siphash.c:41:46: error: expected ‘;’ before ‘)’ token
(uint64_t)p[6] << 48 | (uint64_t)p[7] << 56);
^
;
./lib/hash/rte_siphash.c:41:46: error: expected statement before ‘)’ token
./lib/hash/rte_siphash.c: In function ‘u8to32_le’:
./lib/hash/rte_siphash.c:46:20: warning: pointer of type ‘void *’ used in arithmetic [-Wpointer-arith]
return (uint32_t)p[0] | (uint32_t)p[1] << 8 |
^
./lib/hash/rte_siphash.c:46:20: warning: dereferencing ‘void *’ pointer
./lib/hash/rte_siphash.c:46:9: error: invalid use of void expression
return (uint32_t)p[0] | (uint32_t)p[1] << 8 |
^
./lib/hash/rte_siphash.c:46:43: warning: pointer of type ‘void *’ used in arithmetic [-Wpointer-arith]
return (uint32_t)p[0] | (uint32_t)p[1] << 8 |
^
./lib/hash/rte_siphash.c:46:43: warning: dereferencing ‘void *’ pointer
./lib/hash/rte_siphash.c:46:32: error: invalid use of void expression
return (uint32_t)p[0] | (uint32_t)p[1] << 8 |
^
./lib/hash/rte_siphash.c:47:14: warning: pointer of type ‘void *’ used in arithmetic [-Wpointer-arith]
(uint32_t)p[2] << 16 | (uint32_t)p[3] << 24;
^
./lib/hash/rte_siphash.c:47:14: warning: dereferencing ‘void *’ pointer
./lib/hash/rte_siphash.c:47:3: error: invalid use of void expression
(uint32_t)p[2] << 16 | (uint32_t)p[3] << 24;
^
./lib/hash/rte_siphash.c:47:37: warning: pointer of type ‘void *’ used in arithmetic [-Wpointer-arith]
(uint32_t)p[2] << 16 | (uint32_t)p[3] << 24;
^
./lib/hash/rte_siphash.c:47:37: warning: dereferencing ‘void *’ pointer
./lib/hash/rte_siphash.c:47:26: error: invalid use of void expression
(uint32_t)p[2] << 16 | (uint32_t)p[3] << 24;
^
./lib/hash/rte_siphash.c:48:1: warning: control reaches end of non-void function [-Wreturn-type]
}
^
[116/2451] Compiling C object lib/librte_hash.a.p/hash_rte_hash_crc.c.o
[117/2451] Compiling C object lib/librte_hash.a.p/hash_rte_thash_gfni.c.o
[118/2451] Compiling C object lib/librte_mempool.a.p/mempool_rte_mempool.c.o
[119/2451] Compiling C object lib/librte_eal.a.p/eal_linux_eal_vfio.c.o
[120/2451] Compiling C object lib/librte_metrics.a.p/metrics_rte_metrics_telemetry.c.o
[121/2451] Compiling C object lib/librte_hash.a.p/hash_rte_fbk_hash.c.o
[122/2451] Generating kvargs.sym_chk with a custom command (wrapped by meson to capture output)
[123/2451] Compiling C object lib/librte_metrics.a.p/metrics_rte_metrics.c.o
[124/2451] Compiling C object lib/librte_mbuf.a.p/mbuf_rte_mbuf.c.o
[125/2451] Compiling C object lib/librte_ethdev.a.p/ethdev_sff_8636.c.o
[126/2451] Compiling C object lib/librte_acl.a.p/acl_rte_acl.c.o
[127/2451] Compiling C object lib/librte_cmdline.a.p/cmdline_cmdline_rdline.c.o
[128/2451] Compiling C object lib/librte_ethdev.a.p/ethdev_rte_mtr.c.o
[129/2451] Generating argparse.sym_chk with a custom command (wrapped by meson to capture output)
[130/2451] Compiling C object lib/librte_acl.a.p/acl_acl_gen.c.o
[131/2451] Compiling C object lib/librte_ethdev.a.p/ethdev_rte_ethdev_telemetry.c.o
[132/2451] Compiling C object lib/librte_ethdev.a.p/ethdev_rte_tm.c.o
[133/2451] Compiling C object lib/librte_acl.a.p/acl_acl_run_scalar.c.o
[134/2451] Compiling C object lib/librte_timer.a.p/timer_rte_timer.c.o
[135/2451] Generating log.sym_chk with a custom command (wrapped by meson to capture output)
[136/2451] Generating meter.sym_chk with a custom command (wrapped by meson to capture output)
[137/2451] Compiling C object lib/librte_hash.a.p/hash_rte_thash.c.o
[138/2451] Generating ring.sym_chk with a custom command (wrapped by meson to capture output)
[139/2451] Generating pci.sym_chk with a custom command (wrapped by meson to capture output)
[140/2451] Generating rcu.sym_chk with a custom command (wrapped by meson to capture output)
[141/2451] Compiling C object lib/librte_ipsec.a.p/ipsec_ipsec_sad.c.o
[142/2451] Generating net.sym_chk with a custom command (wrapped by meson to capture output)
[143/2451] Generating telemetry.sym_chk with a custom command (wrapped by meson to capture output)
[144/2451] Compiling C object lib/librte_ethdev.a.p/ethdev_ethdev_trace_points.c.o
[145/2451] Compiling C object lib/librte_ethdev.a.p/ethdev_rte_flow.c.o
[146/2451] Compiling C object lib/librte_acl.a.p/acl_acl_bld.c.o
[147/2451] Compiling C object lib/librte_hash.a.p/hash_rte_cuckoo_hash.c.o
[148/2451] Compiling C object lib/librte_ethdev.a.p/ethdev_rte_ethdev.c.o
ninja: build stopped: subcommand failed.
-------------------------------END LOGS------------------------------