automatic DPDK test reports
 help / color / mirror / Atom feed
* [dpdk-test-report] |FAILURE| pw(97841) sid(18636) job(PER_PATCH_BUILD7541)[v2, 5/5] net/enetfec: add features
@ 2021-09-03  0:39 sys_stv
  0 siblings, 0 replies; only message in thread
From: sys_stv @ 2021-09-03  0:39 UTC (permalink / raw)
  To: test-report, apeksha.gupta

[-- Attachment #1: Type: text/plain, Size: 40510 bytes --]


Test-Label: Intel-compilation
Test-Status: FAILURE
http://dpdk.org/patch/97841

_Compilation issues_

Submitter: Apeksha Gupta <apeksha.gupta@nxp.com>
Date: 2021-09-02 17:59:55
Reply_mail: 20210902175955.9202-6-apeksha.gupta@nxp.com

DPDK git baseline: Repo:dpdk, CommitID: b344eb5d941a7522ff27b6b7b5419f68c3fea9a0


Meson Build Summary: 22 Builds Done, 13 Successful, 9 Failures, 0 Blocked

+----------------+------------+--------------+------------+------------+-----------+----------+
| os             | gcc-static | clang-static | icc-static | gcc-shared | gcc-debug | document |
+----------------+------------+--------------+------------+------------+-----------+----------+
| UB2004-64      | fail       | fail         | pass       |            |           | pass     |
| RHEL83-64      | pass       | fail         | pass       | pass       | pass      |          |
| FC34-64        | fail       | fail         |            |            |           |          |
| UB2104-64      | fail       |              |            |            |           |          |
| WIN10-64       |            | pass         |            |            |           |          |
| UB2004-32      | fail       |              |            |            |           |          |
| CENTOS83-64    | pass       | fail         |            |            |           |          |
| FreeBSD1201-64 | pass       | pass         |            | pass       | pass      |          |
| SUSE15-64      | pass       | fail         |            |            |           |          |
+----------------+------------+--------------+------------+------------+-----------+----------+
Test environment and configuration as below:


OS: UB2004-64
	Kernel Version: 5.8.0-48-generic
	GCC Version: gcc (Ubuntu 10.2.0-5ubuntu1~20.04) 10.2.0
	Clang Version: 10.0.0-4ubuntu1
	x86_64-native-linuxapp-clang
	x86_64-native-linuxapp-gcc
	x86_64-native-linuxapp-icc
	x86_64-native-linuxapp-doc

OS: RHEL83-64
	Kernel Version: 4.18.0-305.3.1.el8.x86_64
	GCC Version: gcc (GCC) 8.4.1 20200928 (Red Hat 8.4.1-1)
	Clang Version: 11.0.0 (Red Hat 11.0.0-1.module_el8.4.0+587+5187cac0)
	x86_64-native-linuxapp-gcc
	x86_64-native-linuxapp-clang
	x86_64-native-linuxapp-gcc+shared
	x86_64-native-linuxapp-gcc+debug
	x86_64-native-linuxapp-icc

OS: FC34-64
	Kernel Version: 5.11.15-300.fc34.x86_64
	GCC Version: gcc (GCC) 11.0.1 20210324 (Red Hat 11.0.1-0)
	Clang Version: 12.0.0 (Fedora 12.0.0-0.3.rc1.fc34)
	x86_64-native-linuxapp-gcc
	x86_64-native-linuxapp-clang

OS: UB2104-64
	Kernel Version: 5.11.0-16-generic
	GCC Version: gcc (Ubuntu 10.3.0-1ubuntu1) 10.3.0
	Clang Version: 12.0.0-1ubuntu1
	x86_64-native-linuxapp-gcc

OS: WIN10-64
	Kernel Version: N/A
	GCC Version: N/A
	Clang Version: Clang 8.0.0
	x86_64-windows-clang

OS: UB2004-32
	Kernel Version: 5.8.0-48-generic
	GCC Version: gcc (Ubuntu 10.2.0-5ubuntu1~20.04) 10.2.0
	Clang Version: 10.0.0-4ubuntu1
	i686-native-linuxapp-gcc

OS: CENTOS83-64
	Kernel Version: 4.18.0-240.1.1.el8_3.x86_64
	GCC Version: gcc (GCC) 8.3.1 20191121 (Red Hat 8.3.1-5)
	Clang Version: 10.0.1 (Red Hat 10.0.1-1.module_el8.3.0+467+cb298d5b)
	x86_64-native-linuxapp-gcc
	x86_64-native-linuxapp-clang

OS: FreeBSD1201-64
	Kernel Version: 12.1-RELEASE
	GCC Version: gcc (FreeBSD Ports Collection) 9.2.0
	Clang Version: 8.0.1 (tags/RELEASE_801/final 366581) (based on LLVM 8.0.1)
	x86_64-native-bsdapp-gcc
	x86_64-native-bsdapp-clang
	x86_64-native-bsdapp-gcc+shared
	x86_64-native-bsdapp-gcc+debug

OS: SUSE15-64
	Kernel Version: 5.3.18-lp152.57-default
	GCC Version: gcc (SUSE Linux) 7.5.0
	Clang Version: 9.0.1
	x86_64-native-linuxapp-clang
	x86_64-native-linuxapp-gcc



*Build Failed #1:
OS: CENTOS83-64
Target: x86_64-native-linuxapp-clang
FAILED: drivers/libtmp_rte_net_enetfec.a.p/net_enetfec_enet_rxtx.c.o 
clang -Idrivers/libtmp_rte_net_enetfec.a.p -Idrivers -I../drivers -Idrivers/net/enetfec -I../drivers/net/enetfec -Ilib/ethdev -I../lib/ethdev -I. -I.. -Iconfig -I../config -Ilib/eal/include -I../lib/eal/include -Ilib/eal/linux/include -I../lib/eal/linux/include -Ilib/eal/x86/include -I../lib/eal/x86/include -Ilib/eal/common -I../lib/eal/common -Ilib/eal -I../lib/eal -Ilib/kvargs -I../lib/kvargs -Ilib/metrics -I../lib/metrics -Ilib/telemetry -I../lib/telemetry -Ilib/net -I../lib/net -Ilib/mbuf -I../lib/mbuf -Ilib/mempool -I../lib/mempool -Ilib/ring -I../lib/ring -Ilib/meter -I../lib/meter -Idrivers/bus/pci -I../drivers/bus/pci -I../drivers/bus/pci/linux -Ilib/pci -I../lib/pci -Idrivers/bus/vdev -I../drivers/bus/vdev -Idrivers/common/dpaax -I../drivers/common/dpaax -I../drivers/common/dpaax/caamflib -Xclang -fcolor-diagnostics -pipe -D_FILE_OFFSET_BITS=64 -Wall -Winvalid-pch -Werror -O3 -include rte_config.h -Wextra -Wcast-qual -Wdeprecated -Wformat -Wformat-nonliteral -Wformat-security -Wmissing-declarations -Wmissing-prototypes -Wnested-externs -Wold-style-definition -Wpointer-arith -Wsign-compare -Wstrict-prototypes -Wundef -Wwrite-strings -Wno-address-of-packed-member -Wno-missing-field-initializers -D_GNU_SOURCE -fPIC -march=native -DALLOW_EXPERIMENTAL_API -DALLOW_INTERNAL_API -Wno-pointer-arith -DRTE_LOG_DEFAULT_LOGTYPE=pmd.net.enetfec -MD -MQ drivers/libtmp_rte_net_enetfec.a.p/net_enetfec_enet_rxtx.c.o -MF drivers/libtmp_rte_net_enetfec.a.p/net_enetfec_enet_rxtx.c.o.d -o drivers/libtmp_rte_net_enetfec.a.p/net_enetfec_enet_rxtx.c.o -c ../drivers/net/enetfec/enet_rxtx.c
../drivers/net/enetfec/enet_rxtx.c:15:22: error: unused variable 'lb_quit' [-Werror,-Wunused-variable]
static volatile bool lb_quit;
                     ^
1 error generated.
[1319/3050] Compiling C object drivers/libtmp_rte_net_enetfec.a.p/net_enetfec_enet_ethdev.c.o
[1320/3050] Generating rte_net_e1000.pmd.c with a custom command
[1321/3050] Compiling C object drivers/libtmp_rte_net_ena.a.p/net_ena_base_ena_com.c.o
[1322/3050] Generating rte_net_enetc.sym_chk with a meson_exe.py custom command
[1323/3050] Compiling C object drivers/libtmp_rte_net_enic.a.p/net_enic_base_vnic_rq.c.o
[1324/3050] Compiling C object drivers/libtmp_rte_net_enic.a.p/net_enic_base_vnic_cq.c.o
[1325/3050] Compiling C object drivers/libtmp_rte_net_ena.a.p/net_ena_ena_ethdev.c.o
[1326/3050] Compiling C object drivers/libtmp_rte_net_enic.a.p/net_enic_base_vnic_wq.c.o
[1327/3050] Compiling C object drivers/libtmp_rte_net_enic.a.p/net_enic_base_vnic_dev.c.o
ninja: build stopped




*Build Failed #2:
OS: SUSE15-64
Target: x86_64-native-linuxapp-clang
FAILED: drivers/libtmp_rte_net_enetfec.a.p/net_enetfec_enet_rxtx.c.o 
clang -Idrivers/libtmp_rte_net_enetfec.a.p -Idrivers -I../drivers -Idrivers/net/enetfec -I../drivers/net/enetfec -Ilib/ethdev -I../lib/ethdev -I. -I.. -Iconfig -I../config -Ilib/eal/include -I../lib/eal/include -Ilib/eal/linux/include -I../lib/eal/linux/include -Ilib/eal/x86/include -I../lib/eal/x86/include -Ilib/eal/common -I../lib/eal/common -Ilib/eal -I../lib/eal -Ilib/kvargs -I../lib/kvargs -Ilib/metrics -I../lib/metrics -Ilib/telemetry -I../lib/telemetry -Ilib/net -I../lib/net -Ilib/mbuf -I../lib/mbuf -Ilib/mempool -I../lib/mempool -Ilib/ring -I../lib/ring -Ilib/meter -I../lib/meter -Idrivers/bus/pci -I../drivers/bus/pci -I../drivers/bus/pci/linux -Ilib/pci -I../lib/pci -Idrivers/bus/vdev -I../drivers/bus/vdev -Idrivers/common/dpaax -I../drivers/common/dpaax -I../drivers/common/dpaax/caamflib -Xclang -fcolor-diagnostics -pipe -D_FILE_OFFSET_BITS=64 -Wall -Winvalid-pch -Werror -O3 -include rte_config.h -Wextra -Wcast-qual -Wdeprecated -Wformat -Wformat-nonliteral -Wformat-security -Wmissing-declarations -Wmissing-prototypes -Wnested-externs -Wold-style-definition -Wpointer-arith -Wsign-compare -Wstrict-prototypes -Wundef -Wwrite-strings -Wno-address-of-packed-member -Wno-missing-field-initializers -D_GNU_SOURCE -fPIC -march=native -DALLOW_EXPERIMENTAL_API -DALLOW_INTERNAL_API -Wno-pointer-arith -DRTE_LOG_DEFAULT_LOGTYPE=pmd.net.enetfec -MD -MQ drivers/libtmp_rte_net_enetfec.a.p/net_enetfec_enet_rxtx.c.o -MF drivers/libtmp_rte_net_enetfec.a.p/net_enetfec_enet_rxtx.c.o.d -o drivers/libtmp_rte_net_enetfec.a.p/net_enetfec_enet_rxtx.c.o -c ../drivers/net/enetfec/enet_rxtx.c
../drivers/net/enetfec/enet_rxtx.c:15:22: error: unused variable 'lb_quit' [-Werror,-Wunused-variable]
static volatile bool lb_quit;
                     ^
1 error generated.
[1317/3051] Compiling C object drivers/libtmp_rte_net_ena.a.p/net_ena_ena_ethdev.c.o
[1318/3051] Compiling C object drivers/libtmp_rte_net_ena.a.p/net_ena_base_ena_com.c.o
[1319/3051] Compiling C object drivers/libtmp_rte_net_enetfec.a.p/net_enetfec_enet_ethdev.c.o
[1320/3051] Generating rte_net_enetc.pmd.c with a custom command
[1321/3051] Generating rte_net_e1000.pmd.c with a custom command
[1322/3051] Compiling C object drivers/libtmp_rte_net_enic.a.p/net_enic_base_vnic_cq.c.o
[1323/3051] Compiling C object drivers/libtmp_rte_net_enic.a.p/net_enic_base_vnic_rq.c.o
[1324/3051] Compiling C object drivers/libtmp_rte_net_enic.a.p/net_enic_base_vnic_dev.c.o
[1325/3051] Compiling C object drivers/libtmp_rte_net_enic.a.p/net_enic_base_vnic_wq.c.o
ninja: build stopped




*Build Failed #3:
OS: UB2004-32
Target: i686-native-linuxapp-gcc
FAILED: examples/dpdk-flow_classify 
gcc  -o examples/dpdk-flow_classify examples/dpdk-flow_classify.p/flow_classify_flow_classify.c.o -Wl,--as-needed -Wl,--no-undefined -Wl,-O1 -Wl,--whole-archive -Wl,--start-group lib/librte_node.a lib/librte_graph.a lib/librte_bpf.a lib/librte_flow_classify.a lib/librte_pipeline.a lib/librte_table.a lib/librte_port.a lib/librte_fib.a lib/librte_ipsec.a lib/librte_vhost.a lib/librte_stack.a lib/librte_security.a lib/librte_sched.a lib/librte_reorder.a lib/librte_rib.a lib/librte_regexdev.a lib/librte_rawdev.a lib/librte_pdump.a lib/librte_power.a lib/librte_member.a lib/librte_lpm.a lib/librte_latencystats.a lib/librte_jobstats.a lib/librte_ip_frag.a lib/librte_gso.a lib/librte_gro.a lib/librte_eventdev.a lib/librte_efd.a lib/librte_distributor.a lib/librte_cryptodev.a lib/librte_compressdev.a lib/librte_cfgfile.a lib/librte_bitratestats.a lib/librte_bbdev.a lib/librte_acl.a lib/librte_timer.a lib/librte_hash.a lib/librte_metrics.a lib/librte_cmdline.a lib/librte_pci.a lib/librte_ethdev.a lib/librte_meter.a lib/librte_net.a lib/librte_mbuf.a lib/librte_mempool.a lib/librte_rcu.a lib/librte_ring.a lib/librte_eal.a lib/librte_telemetry.a lib/librte_kvargs.a drivers/librte_common_cpt.a drivers/librte_common_dpaax.a drivers/librte_common_iavf.a drivers/librte_common_octeontx.a drivers/librte_bus_auxiliary.a drivers/librte_bus_dpaa.a drivers/librte_bus_fslmc.a drivers/librte_bus_ifpga.a drivers/librte_bus_pci.a drivers/librte_bus_vdev.a drivers/librte_bus_vmbus.a drivers/librte_common_qat.a drivers/librte_mempool_bucket.a drivers/librte_mempool_dpaa.a drivers/librte_mempool_dpaa2.a drivers/librte_mempool_octeontx.a drivers/librte_mempool_ring.a drivers/librte_mempool_stack.a drivers/librte_net_af_packet.a drivers/librte_net_ark.a drivers/librte_net_atlantic.a drivers/librte_net_avp.a drivers/librte_net_axgbe.a drivers/librte_net_bnxt.a drivers/librte_net_bond.a drivers/librte_net_cxgbe.a drivers/librte_net_dpaa.a drivers/librte_net_dpaa2.a drivers/librte_net_e1000.a drivers/librte_net_ena.a drivers/librte_net_enetc.a drivers/librte_net_enetfec.a drivers/librte_net_enic.a drivers/librte_net_failsafe.a drivers/librte_net_fm10k.a drivers/librte_net_hinic.a drivers/librte_net_i40e.a drivers/librte_net_iavf.a drivers/librte_net_ice.a drivers/librte_net_igc.a drivers/librte_net_ionic.a drivers/librte_net_ipn3ke.a drivers/librte_net_ixgbe.a drivers/librte_net_liquidio.a drivers/librte_net_memif.a drivers/librte_net_netvsc.a drivers/librte_net_ngbe.a drivers/librte_net_null.a drivers/librte_net_octeontx.a drivers/librte_net_pcap.a drivers/librte_net_pfe.a drivers/librte_net_qede.a drivers/librte_net_ring.a drivers/librte_net_softnic.a drivers/librte_net_tap.a drivers/librte_net_thunderx.a drivers/librte_net_txgbe.a drivers/librte_net_vdev_netvsc.a drivers/librte_net_vhost.a drivers/librte_net_virtio.a drivers/librte_net_vmxnet3.a drivers/librte_raw_dpaa2_cmdif.a drivers/librte_raw_dpaa2_qdma.a drivers/librte_raw_ifpga.a drivers/librte_raw_ioat.a drivers/librte_raw_ntb.a drivers/librte_raw_skeleton.a drivers/librte_crypto_bcmfs.a drivers/librte_crypto_caam_jr.a drivers/librte_crypto_ccp.a drivers/librte_crypto_dpaa_sec.a drivers/librte_crypto_dpaa2_sec.a drivers/librte_crypto_nitrox.a drivers/librte_crypto_null.a drivers/librte_crypto_octeontx.a drivers/librte_crypto_openssl.a drivers/librte_crypto_scheduler.a drivers/librte_crypto_virtio.a drivers/librte_compress_octeontx.a drivers/librte_vdpa_ifc.a drivers/librte_event_dpaa.a drivers/librte_event_dpaa2.a drivers/librte_event_dsw.a drivers/librte_event_opdl.a drivers/librte_event_skeleton.a drivers/librte_event_sw.a drivers/librte_event_octeontx.a drivers/librte_baseband_acc100.a drivers/librte_baseband_fpga_5gnr_fec.a drivers/librte_baseband_fpga_lte_fec.a drivers/librte_baseband_null.a drivers/librte_baseband_turbo_sw.a -Wl,--no-whole-archive -Wl,--no-as-needed -pthread -lm -ldl -lnuma -lfdt -m32 -lpcap -Wl,--export-dynamic /usr/lib/i386-linux-gnu/libpcap.so /usr/lib/i386-linux-gnu/libcrypto.so /usr/lib/gcc/x86_64-linux-gnu/10/../../../i386-linux-gnu/librt.so -Wl,--end-group
/usr/bin/ld: drivers/librte_net_enetfec.a(net_enetfec_enet_uio.c.o):(.bss+0x0): multiple definition of `count'; examples/dpdk-flow_classify.p/flow_classify_flow_classify.c.o:(.data+0x0): first defined here
collect2: error: ld returned 1 exit status
[2314/2450] Compiling C object examples/dpdk-ip_pipeline.p/ip_pipeline_link.c.o
[2315/2450] Compiling C object examples/dpdk-ip_fragmentation.p/ip_fragmentation_main.c.o
[2316/2450] Compiling C object examples/dpdk-ip_pipeline.p/ip_pipeline_cryptodev.c.o
[2317/2450] Compiling C object examples/dpdk-ip_pipeline.p/ip_pipeline_mempool.c.o
[2318/2450] Compiling C object examples/dpdk-ioat.p/ioat_ioatfwd.c.o
[2319/2450] Compiling C object examples/dpdk-ip_pipeline.p/ip_pipeline_parser.c.o
[2320/2450] Compiling C object examples/dpdk-ip_pipeline.p/ip_pipeline_cli.c.o
[2321/2450] Compiling C object app/test/dpdk-test.p/test_ring_perf.c.o
[2322/2450] Compiling C object app/test/dpdk-test.p/test_ring.c.o
ninja: build stopped




*Build Failed #4:
OS: UB2004-64
Target: x86_64-native-linuxapp-clang
FAILED: drivers/libtmp_rte_net_enetfec.a.p/net_enetfec_enet_rxtx.c.o 
clang -Idrivers/libtmp_rte_net_enetfec.a.p -Idrivers -I../drivers -Idrivers/net/enetfec -I../drivers/net/enetfec -Ilib/ethdev -I../lib/ethdev -I. -I.. -Iconfig -I../config -Ilib/eal/include -I../lib/eal/include -Ilib/eal/linux/include -I../lib/eal/linux/include -Ilib/eal/x86/include -I../lib/eal/x86/include -Ilib/eal/common -I../lib/eal/common -Ilib/eal -I../lib/eal -Ilib/kvargs -I../lib/kvargs -Ilib/metrics -I../lib/metrics -Ilib/telemetry -I../lib/telemetry -Ilib/net -I../lib/net -Ilib/mbuf -I../lib/mbuf -Ilib/mempool -I../lib/mempool -Ilib/ring -I../lib/ring -Ilib/meter -I../lib/meter -Idrivers/bus/pci -I../drivers/bus/pci -I../drivers/bus/pci/linux -Ilib/pci -I../lib/pci -Idrivers/bus/vdev -I../drivers/bus/vdev -Idrivers/common/dpaax -I../drivers/common/dpaax -I../drivers/common/dpaax/caamflib -Xclang -fcolor-diagnostics -pipe -D_FILE_OFFSET_BITS=64 -Wall -Winvalid-pch -Werror -O3 -include rte_config.h -Wextra -Wcast-qual -Wdeprecated -Wformat -Wformat-nonliteral -Wformat-security -Wmissing-declarations -Wmissing-prototypes -Wnested-externs -Wold-style-definition -Wpointer-arith -Wsign-compare -Wstrict-prototypes -Wundef -Wwrite-strings -Wno-address-of-packed-member -Wno-missing-field-initializers -D_GNU_SOURCE -fPIC -march=native -DALLOW_EXPERIMENTAL_API -DALLOW_INTERNAL_API -Wno-pointer-arith -DRTE_LOG_DEFAULT_LOGTYPE=pmd.net.enetfec -MD -MQ drivers/libtmp_rte_net_enetfec.a.p/net_enetfec_enet_rxtx.c.o -MF drivers/libtmp_rte_net_enetfec.a.p/net_enetfec_enet_rxtx.c.o.d -o drivers/libtmp_rte_net_enetfec.a.p/net_enetfec_enet_rxtx.c.o -c ../drivers/net/enetfec/enet_rxtx.c
../drivers/net/enetfec/enet_rxtx.c:15:22: error: unused variable 'lb_quit' [-Werror,-Wunused-variable]
static volatile bool lb_quit;
                     ^
1 error generated.
[1310/3070] Compiling C object drivers/libtmp_rte_net_enetc.a.p/net_enetc_enetc_ethdev.c.o
[1311/3070] Compiling C object drivers/libtmp_rte_net_enic.a.p/net_enic_base_vnic_intr.c.o
[1312/3070] Compiling C object drivers/libtmp_rte_net_ena.a.p/net_ena_base_ena_com.c.o
[1313/3070] Generating rte_net_e1000.pmd.c with a custom command
[1314/3070] Generating symbol file drivers/librte_net_dpaa2.so.22.0.p/librte_net_dpaa2.so.22.0.symbols
[1315/3070] Compiling C object drivers/libtmp_rte_net_enetfec.a.p/net_enetfec_enet_uio.c.o
[1316/3070] Compiling C object drivers/libtmp_rte_net_enetfec.a.p/net_enetfec_enet_ethdev.c.o
[1317/3070] Compiling C object drivers/libtmp_rte_net_ena.a.p/net_ena_ena_ethdev.c.o
[1318/3070] Compiling C object drivers/libtmp_rte_net_enic.a.p/net_enic_base_vnic_dev.c.o
ninja: build stopped




*Build Failed #5:
OS: UB2004-64
Target: x86_64-native-linuxapp-gcc
FAILED: examples/dpdk-flow_classify 
gcc  -o examples/dpdk-flow_classify examples/dpdk-flow_classify.p/flow_classify_flow_classify.c.o -Wl,--as-needed -Wl,--no-undefined -Wl,-O1 -Wl,--whole-archive -Wl,--start-group lib/librte_node.a lib/librte_graph.a lib/librte_bpf.a lib/librte_flow_classify.a lib/librte_pipeline.a lib/librte_table.a lib/librte_port.a lib/librte_fib.a lib/librte_ipsec.a lib/librte_vhost.a lib/librte_stack.a lib/librte_security.a lib/librte_sched.a lib/librte_reorder.a lib/librte_rib.a lib/librte_regexdev.a lib/librte_rawdev.a lib/librte_pdump.a lib/librte_power.a lib/librte_member.a lib/librte_lpm.a lib/librte_latencystats.a lib/librte_kni.a lib/librte_jobstats.a lib/librte_ip_frag.a lib/librte_gso.a lib/librte_gro.a lib/librte_eventdev.a lib/librte_efd.a lib/librte_distributor.a lib/librte_cryptodev.a lib/librte_compressdev.a lib/librte_cfgfile.a lib/librte_bitratestats.a lib/librte_bbdev.a lib/librte_acl.a lib/librte_timer.a lib/librte_hash.a lib/librte_metrics.a lib/librte_cmdline.a lib/librte_pci.a lib/librte_ethdev.a lib/librte_meter.a lib/librte_net.a lib/librte_mbuf.a lib/librte_mempool.a lib/librte_rcu.a lib/librte_ring.a lib/librte_eal.a lib/librte_telemetry.a lib/librte_kvargs.a drivers/librte_common_cpt.a drivers/librte_common_dpaax.a drivers/librte_common_iavf.a drivers/librte_common_octeontx.a drivers/librte_common_octeontx2.a drivers/librte_bus_auxiliary.a drivers/librte_bus_dpaa.a drivers/librte_bus_fslmc.a drivers/librte_bus_ifpga.a drivers/librte_bus_pci.a drivers/librte_bus_vdev.a drivers/librte_bus_vmbus.a drivers/librte_common_cnxk.a drivers/librte_common_qat.a drivers/librte_common_sfc_efx.a drivers/librte_mempool_bucket.a drivers/librte_mempool_cnxk.a drivers/librte_mempool_dpaa.a drivers/librte_mempool_dpaa2.a drivers/librte_mempool_octeontx.a drivers/librte_mempool_octeontx2.a drivers/librte_mempool_ring.a drivers/librte_mempool_stack.a drivers/librte_net_af_packet.a drivers/librte_net_ark.a drivers/librte_net_atlantic.a drivers/librte_net_avp.a drivers/librte_net_axgbe.a drivers/librte_net_bnx2x.a drivers/librte_net_bnxt.a drivers/librte_net_bond.a drivers/librte_net_cnxk.a drivers/librte_net_cxgbe.a drivers/librte_net_dpaa.a drivers/librte_net_dpaa2.a drivers/librte_net_e1000.a drivers/librte_net_ena.a drivers/librte_net_enetc.a drivers/librte_net_enetfec.a drivers/librte_net_enic.a drivers/librte_net_failsafe.a drivers/librte_net_fm10k.a drivers/librte_net_hinic.a drivers/librte_net_hns3.a drivers/librte_net_i40e.a drivers/librte_net_iavf.a drivers/librte_net_ice.a drivers/librte_net_igc.a drivers/librte_net_ionic.a drivers/librte_net_ipn3ke.a drivers/librte_net_ixgbe.a drivers/librte_net_kni.a drivers/librte_net_liquidio.a drivers/librte_net_memif.a drivers/librte_net_netvsc.a drivers/librte_net_nfp.a drivers/librte_net_ngbe.a drivers/librte_net_null.a drivers/librte_net_octeontx.a drivers/librte_net_octeontx2.a drivers/librte_net_octeontx_ep.a drivers/librte_net_pcap.a drivers/librte_net_pfe.a drivers/librte_net_qede.a drivers/librte_net_ring.a drivers/librte_net_sfc.a drivers/librte_net_softnic.a drivers/librte_net_tap.a drivers/librte_net_thunderx.a drivers/librte_net_txgbe.a drivers/librte_net_vdev_netvsc.a drivers/librte_net_vhost.a drivers/librte_net_virtio.a drivers/librte_net_vmxnet3.a drivers/librte_raw_cnxk_bphy.a drivers/librte_raw_dpaa2_cmdif.a drivers/librte_raw_dpaa2_qdma.a drivers/librte_raw_ifpga.a drivers/librte_raw_ioat.a drivers/librte_raw_ntb.a drivers/librte_raw_octeontx2_dma.a drivers/librte_raw_octeontx2_ep.a drivers/librte_raw_skeleton.a drivers/librte_crypto_aesni_gcm.a drivers/librte_crypto_aesni_mb.a drivers/librte_crypto_bcmfs.a drivers/librte_crypto_caam_jr.a drivers/librte_crypto_ccp.a drivers/librte_crypto_cnxk.a drivers/librte_crypto_dpaa_sec.a drivers/librte_crypto_dpaa2_sec.a drivers/librte_crypto_kasumi.a drivers/librte_crypto_nitrox.a drivers/librte_crypto_null.a drivers/librte_crypto_octeontx.a drivers/librte_crypto_octeontx2.a drivers/librte_crypto_openssl.a drivers/librte_crypto_scheduler.a drivers/librte_crypto_snow3g.a drivers/librte_crypto_virtio.a drivers/librte_crypto_zuc.a drivers/librte_compress_octeontx.a drivers/librte_compress_zlib.a drivers/librte_regex_octeontx2.a drivers/librte_vdpa_ifc.a drivers/librte_event_cnxk.a drivers/librte_event_dlb2.a drivers/librte_event_dpaa.a drivers/librte_event_dpaa2.a drivers/librte_event_dsw.a drivers/librte_event_octeontx2.a drivers/librte_event_opdl.a drivers/librte_event_skeleton.a drivers/librte_event_sw.a drivers/librte_event_octeontx.a drivers/librte_baseband_acc100.a drivers/librte_baseband_fpga_5gnr_fec.a drivers/librte_baseband_fpga_lte_fec.a drivers/librte_baseband_null.a drivers/librte_baseband_turbo_sw.a -Wl,--no-whole-archive -Wl,--no-as-needed -pthread -lm -ldl -lnuma -lfdt -lpcap -Wl,--export-dynamic /usr/lib/x86_64-linux-gnu/libpcap.so /usr/lib/x86_64-linux-gnu/libelf.so /usr/lib/x86_64-linux-gnu/libcrypto.so /usr/lib/x86_64-linux-gnu/libz.so -latomic /usr/lib/gcc/x86_64-linux-gnu/10/../../../x86_64-linux-gnu/librt.so -lIPSec_MB -lIPSec_MB -lIPSec_MB -lIPSec_MB -lIPSec_MB -Wl,--end-group
/usr/bin/ld: drivers/librte_net_enetfec.a(net_enetfec_enet_uio.c.o):(.bss+0x0): multiple definition of `count'; examples/dpdk-flow_classify.p/flow_classify_flow_classify.c.o:(.data+0x0): first defined here
collect2: error: ld returned 1 exit status
[3027/3070] Linking target examples/dpdk-fips_validation
[3028/3070] Linking target examples/dpdk-helloworld
[3029/3070] Linking target examples/dpdk-ioat
[3030/3070] Linking target examples/dpdk-ip_reassembly
[3031/3070] Linking target examples/dpdk-ip_fragmentation
[3032/3070] Linking target examples/dpdk-ip_pipeline
[3033/3070] Linking target examples/dpdk-ipv4_multicast
[3034/3070] Linking target examples/dpdk-ipsec-secgw
[3035/3070] Linking target examples/dpdk-l2fwd
ninja: build stopped




*Build Failed #6:
OS: UB2104-64
Target: x86_64-native-linuxapp-gcc
FAILED: examples/dpdk-flow_classify 
gcc  -o examples/dpdk-flow_classify examples/dpdk-flow_classify.p/flow_classify_flow_classify.c.o -Wl,--as-needed -Wl,--no-undefined -Wl,-O1 -Wl,--whole-archive -Wl,--start-group lib/librte_node.a lib/librte_graph.a lib/librte_bpf.a lib/librte_flow_classify.a lib/librte_pipeline.a lib/librte_table.a lib/librte_port.a lib/librte_fib.a lib/librte_ipsec.a lib/librte_vhost.a lib/librte_stack.a lib/librte_security.a lib/librte_sched.a lib/librte_reorder.a lib/librte_rib.a lib/librte_regexdev.a lib/librte_rawdev.a lib/librte_pdump.a lib/librte_power.a lib/librte_member.a lib/librte_lpm.a lib/librte_latencystats.a lib/librte_kni.a lib/librte_jobstats.a lib/librte_ip_frag.a lib/librte_gso.a lib/librte_gro.a lib/librte_eventdev.a lib/librte_efd.a lib/librte_distributor.a lib/librte_cryptodev.a lib/librte_compressdev.a lib/librte_cfgfile.a lib/librte_bitratestats.a lib/librte_bbdev.a lib/librte_acl.a lib/librte_timer.a lib/librte_hash.a lib/librte_metrics.a lib/librte_cmdline.a lib/librte_pci.a lib/librte_ethdev.a lib/librte_meter.a lib/librte_net.a lib/librte_mbuf.a lib/librte_mempool.a lib/librte_rcu.a lib/librte_ring.a lib/librte_eal.a lib/librte_telemetry.a lib/librte_kvargs.a drivers/librte_common_cpt.a drivers/librte_common_dpaax.a drivers/librte_common_iavf.a drivers/librte_common_octeontx.a drivers/librte_common_octeontx2.a drivers/librte_bus_auxiliary.a drivers/librte_bus_dpaa.a drivers/librte_bus_fslmc.a drivers/librte_bus_ifpga.a drivers/librte_bus_pci.a drivers/librte_bus_vdev.a drivers/librte_bus_vmbus.a drivers/librte_common_cnxk.a drivers/librte_common_qat.a drivers/librte_common_sfc_efx.a drivers/librte_mempool_bucket.a drivers/librte_mempool_cnxk.a drivers/librte_mempool_dpaa.a drivers/librte_mempool_dpaa2.a drivers/librte_mempool_octeontx.a drivers/librte_mempool_octeontx2.a drivers/librte_mempool_ring.a drivers/librte_mempool_stack.a drivers/librte_net_af_packet.a drivers/librte_net_ark.a drivers/librte_net_atlantic.a drivers/librte_net_avp.a drivers/librte_net_axgbe.a drivers/librte_net_bnx2x.a drivers/librte_net_bnxt.a drivers/librte_net_bond.a drivers/librte_net_cnxk.a drivers/librte_net_cxgbe.a drivers/librte_net_dpaa.a drivers/librte_net_dpaa2.a drivers/librte_net_e1000.a drivers/librte_net_ena.a drivers/librte_net_enetc.a drivers/librte_net_enetfec.a drivers/librte_net_enic.a drivers/librte_net_failsafe.a drivers/librte_net_fm10k.a drivers/librte_net_hinic.a drivers/librte_net_hns3.a drivers/librte_net_i40e.a drivers/librte_net_iavf.a drivers/librte_net_ice.a drivers/librte_net_igc.a drivers/librte_net_ionic.a drivers/librte_net_ipn3ke.a drivers/librte_net_ixgbe.a drivers/librte_net_kni.a drivers/librte_net_liquidio.a drivers/librte_net_memif.a drivers/librte_net_netvsc.a drivers/librte_net_nfp.a drivers/librte_net_ngbe.a drivers/librte_net_null.a drivers/librte_net_octeontx.a drivers/librte_net_octeontx2.a drivers/librte_net_octeontx_ep.a drivers/librte_net_pcap.a drivers/librte_net_pfe.a drivers/librte_net_qede.a drivers/librte_net_ring.a drivers/librte_net_sfc.a drivers/librte_net_softnic.a drivers/librte_net_tap.a drivers/librte_net_thunderx.a drivers/librte_net_txgbe.a drivers/librte_net_vdev_netvsc.a drivers/librte_net_vhost.a drivers/librte_net_virtio.a drivers/librte_net_vmxnet3.a drivers/librte_raw_cnxk_bphy.a drivers/librte_raw_dpaa2_cmdif.a drivers/librte_raw_dpaa2_qdma.a drivers/librte_raw_ifpga.a drivers/librte_raw_ioat.a drivers/librte_raw_ntb.a drivers/librte_raw_octeontx2_dma.a drivers/librte_raw_octeontx2_ep.a drivers/librte_raw_skeleton.a drivers/librte_crypto_aesni_gcm.a drivers/librte_crypto_aesni_mb.a drivers/librte_crypto_bcmfs.a drivers/librte_crypto_caam_jr.a drivers/librte_crypto_ccp.a drivers/librte_crypto_cnxk.a drivers/librte_crypto_dpaa_sec.a drivers/librte_crypto_dpaa2_sec.a drivers/librte_crypto_kasumi.a drivers/librte_crypto_nitrox.a drivers/librte_crypto_null.a drivers/librte_crypto_octeontx.a drivers/librte_crypto_octeontx2.a drivers/librte_crypto_openssl.a drivers/librte_crypto_scheduler.a drivers/librte_crypto_snow3g.a drivers/librte_crypto_virtio.a drivers/librte_crypto_zuc.a drivers/librte_compress_isal.a drivers/librte_compress_octeontx.a drivers/librte_compress_zlib.a drivers/librte_regex_octeontx2.a drivers/librte_vdpa_ifc.a drivers/librte_event_cnxk.a drivers/librte_event_dlb2.a drivers/librte_event_dpaa.a drivers/librte_event_dpaa2.a drivers/librte_event_dsw.a drivers/librte_event_octeontx2.a drivers/librte_event_opdl.a drivers/librte_event_skeleton.a drivers/librte_event_sw.a drivers/librte_event_octeontx.a drivers/librte_baseband_acc100.a drivers/librte_baseband_fpga_5gnr_fec.a drivers/librte_baseband_fpga_lte_fec.a drivers/librte_baseband_null.a drivers/librte_baseband_turbo_sw.a -Wl,--no-whole-archive -Wl,--no-as-needed -pthread -lm -ldl -lnuma -lfdt -lpcap -Wl,--export-dynamic /usr/lib/x86_64-linux-gnu/libpcap.so /usr/lib/x86_64-linux-gnu/libelf.so /usr/lib/x86_64-linux-gnu/libcrypto.so /usr/lib/x86_64-linux-gnu/libz.so -latomic /usr/lib/gcc/x86_64-linux-gnu/10/../../../x86_64-linux-gnu/librt.so -lIPSec_MB -lIPSec_MB -lIPSec_MB -lIPSec_MB -lIPSec_MB /usr/lib/x86_64-linux-gnu/libisal.so -Wl,--end-group
/usr/bin/ld: drivers/librte_net_enetfec.a(net_enetfec_enet_uio.c.o):(.bss+0x0): multiple definition of `count'; examples/dpdk-flow_classify.p/flow_classify_flow_classify.c.o:(.data+0x0): first defined here
collect2: error: ld returned 1 exit status
[3042/3084] Linking target examples/dpdk-vmdq_dcb
[3043/3084] Linking target examples/dpdk-eventdev_pipeline
[3044/3084] Linking target examples/dpdk-ioat
[3045/3084] Linking target examples/dpdk-ip_fragmentation
[3046/3084] Linking target examples/dpdk-ip_pipeline
[3047/3084] Linking target examples/dpdk-ip_reassembly
[3048/3084] Linking target examples/dpdk-l2fwd
[3049/3084] Linking target examples/dpdk-ipv4_multicast
[3050/3084] Linking target examples/dpdk-ipsec-secgw
ninja: build stopped




*Build Failed #7:
OS: FC34-64
Target: x86_64-native-linuxapp-gcc
FAILED: examples/dpdk-flow_classify 
gcc  -o examples/dpdk-flow_classify examples/dpdk-flow_classify.p/flow_classify_flow_classify.c.o -Wl,--as-needed -Wl,--no-undefined -Wl,-O1 -Wl,--whole-archive -Wl,--start-group lib/librte_node.a lib/librte_graph.a lib/librte_bpf.a lib/librte_flow_classify.a lib/librte_pipeline.a lib/librte_table.a lib/librte_port.a lib/librte_fib.a lib/librte_ipsec.a lib/librte_vhost.a lib/librte_stack.a lib/librte_security.a lib/librte_sched.a lib/librte_reorder.a lib/librte_rib.a lib/librte_regexdev.a lib/librte_rawdev.a lib/librte_pdump.a lib/librte_power.a lib/librte_member.a lib/librte_lpm.a lib/librte_latencystats.a lib/librte_kni.a lib/librte_jobstats.a lib/librte_ip_frag.a lib/librte_gso.a lib/librte_gro.a lib/librte_eventdev.a lib/librte_efd.a lib/librte_distributor.a lib/librte_cryptodev.a lib/librte_compressdev.a lib/librte_cfgfile.a lib/librte_bitratestats.a lib/librte_bbdev.a lib/librte_acl.a lib/librte_timer.a lib/librte_hash.a lib/librte_metrics.a lib/librte_cmdline.a lib/librte_pci.a lib/librte_ethdev.a lib/librte_meter.a lib/librte_net.a lib/librte_mbuf.a lib/librte_mempool.a lib/librte_rcu.a lib/librte_ring.a lib/librte_eal.a lib/librte_telemetry.a lib/librte_kvargs.a drivers/librte_common_cpt.a drivers/librte_common_dpaax.a drivers/librte_common_iavf.a drivers/librte_common_octeontx.a drivers/librte_common_octeontx2.a drivers/librte_bus_auxiliary.a drivers/librte_bus_dpaa.a drivers/librte_bus_fslmc.a drivers/librte_bus_ifpga.a drivers/librte_bus_pci.a drivers/librte_bus_vdev.a drivers/librte_bus_vmbus.a drivers/librte_common_cnxk.a drivers/librte_common_qat.a drivers/librte_common_sfc_efx.a drivers/librte_mempool_bucket.a drivers/librte_mempool_cnxk.a drivers/librte_mempool_dpaa.a drivers/librte_mempool_dpaa2.a drivers/librte_mempool_octeontx.a drivers/librte_mempool_octeontx2.a drivers/librte_mempool_ring.a drivers/librte_mempool_stack.a drivers/librte_net_af_packet.a drivers/librte_net_ark.a drivers/librte_net_atlantic.a drivers/librte_net_avp.a drivers/librte_net_axgbe.a drivers/librte_net_bnx2x.a drivers/librte_net_bnxt.a drivers/librte_net_bond.a drivers/librte_net_cnxk.a drivers/librte_net_cxgbe.a drivers/librte_net_dpaa.a drivers/librte_net_dpaa2.a drivers/librte_net_e1000.a drivers/librte_net_ena.a drivers/librte_net_enetc.a drivers/librte_net_enetfec.a drivers/librte_net_enic.a drivers/librte_net_failsafe.a drivers/librte_net_fm10k.a drivers/librte_net_hinic.a drivers/librte_net_hns3.a drivers/librte_net_i40e.a drivers/librte_net_iavf.a drivers/librte_net_ice.a drivers/librte_net_igc.a drivers/librte_net_ionic.a drivers/librte_net_ipn3ke.a drivers/librte_net_ixgbe.a drivers/librte_net_kni.a drivers/librte_net_liquidio.a drivers/librte_net_memif.a drivers/librte_net_netvsc.a drivers/librte_net_nfp.a drivers/librte_net_ngbe.a drivers/librte_net_null.a drivers/librte_net_octeontx.a drivers/librte_net_octeontx2.a drivers/librte_net_octeontx_ep.a drivers/librte_net_pcap.a drivers/librte_net_pfe.a drivers/librte_net_qede.a drivers/librte_net_ring.a drivers/librte_net_softnic.a drivers/librte_net_tap.a drivers/librte_net_thunderx.a drivers/librte_net_txgbe.a drivers/librte_net_vdev_netvsc.a drivers/librte_net_vhost.a drivers/librte_net_virtio.a drivers/librte_net_vmxnet3.a drivers/librte_raw_cnxk_bphy.a drivers/librte_raw_dpaa2_cmdif.a drivers/librte_raw_dpaa2_qdma.a drivers/librte_raw_ifpga.a drivers/librte_raw_ioat.a drivers/librte_raw_ntb.a drivers/librte_raw_octeontx2_dma.a drivers/librte_raw_octeontx2_ep.a drivers/librte_raw_skeleton.a drivers/librte_crypto_aesni_gcm.a drivers/librte_crypto_aesni_mb.a drivers/librte_crypto_bcmfs.a drivers/librte_crypto_caam_jr.a drivers/librte_crypto_ccp.a drivers/librte_crypto_cnxk.a drivers/librte_crypto_dpaa_sec.a drivers/librte_crypto_dpaa2_sec.a drivers/librte_crypto_kasumi.a drivers/librte_crypto_nitrox.a drivers/librte_crypto_null.a drivers/librte_crypto_octeontx.a drivers/librte_crypto_octeontx2.a drivers/librte_crypto_openssl.a drivers/librte_crypto_scheduler.a drivers/librte_crypto_snow3g.a drivers/librte_crypto_virtio.a drivers/librte_crypto_zuc.a drivers/librte_compress_isal.a drivers/librte_compress_octeontx.a drivers/librte_compress_zlib.a drivers/librte_regex_octeontx2.a drivers/librte_vdpa_ifc.a drivers/librte_event_cnxk.a drivers/librte_event_dlb2.a drivers/librte_event_dpaa.a drivers/librte_event_dpaa2.a drivers/librte_event_dsw.a drivers/librte_event_octeontx2.a drivers/librte_event_opdl.a drivers/librte_event_skeleton.a drivers/librte_event_sw.a drivers/librte_event_octeontx.a drivers/librte_baseband_acc100.a drivers/librte_baseband_fpga_5gnr_fec.a drivers/librte_baseband_fpga_lte_fec.a drivers/librte_baseband_null.a drivers/librte_baseband_turbo_sw.a -Wl,--no-whole-archive -Wl,--no-as-needed -pthread -lm -ldl -lnuma -lfdt -lpcap -Wl,--export-dynamic /usr/lib64/libpcap.so /usr/lib64/libcrypto.so /usr/lib64/libz.so /usr/lib/gcc/x86_64-redhat-linux/11/../../../../lib64/librt.so -lIPSec_MB -lIPSec_MB -lIPSec_MB -lIPSec_MB -lIPSec_MB /usr/lib64/libisal.so -Wl,--end-group
/usr/bin/ld: drivers/librte_net_enetfec.a(net_enetfec_enet_uio.c.o):(.bss+0x0): multiple definition of `count'; examples/dpdk-flow_classify.p/flow_classify_flow_classify.c.o:(.data+0x40): first defined here
collect2: error: ld returned 1 exit status
[3007/3049] Linking target examples/dpdk-fips_validation
[3008/3049] Linking target examples/dpdk-flow_filtering
[3009/3049] Linking target examples/dpdk-ioat
[3010/3049] Linking target examples/dpdk-ip_fragmentation
[3011/3049] Linking target examples/dpdk-ipsec-secgw
[3012/3049] Linking target examples/dpdk-ipv4_multicast
[3013/3049] Linking target examples/dpdk-ip_pipeline
[3014/3049] Linking target examples/dpdk-ip_reassembly
[3015/3049] Linking target examples/dpdk-kni
[3016/3049] Linking target examples/dpdk-l2fwd-keepalive
[3017/3049] Linking target examples/dpdk-l2fwd-crypto
ninja: build stopped




*Build Failed #8:
OS: FC34-64
Target: x86_64-native-linuxapp-clang
FAILED: drivers/libtmp_rte_net_enetfec.a.p/net_enetfec_enet_rxtx.c.o 
clang -Idrivers/libtmp_rte_net_enetfec.a.p -Idrivers -I../drivers -Idrivers/net/enetfec -I../drivers/net/enetfec -Ilib/ethdev -I../lib/ethdev -I. -I.. -Iconfig -I../config -Ilib/eal/include -I../lib/eal/include -Ilib/eal/linux/include -I../lib/eal/linux/include -Ilib/eal/x86/include -I../lib/eal/x86/include -Ilib/eal/common -I../lib/eal/common -Ilib/eal -I../lib/eal -Ilib/kvargs -I../lib/kvargs -Ilib/metrics -I../lib/metrics -Ilib/telemetry -I../lib/telemetry -Ilib/net -I../lib/net -Ilib/mbuf -I../lib/mbuf -Ilib/mempool -I../lib/mempool -Ilib/ring -I../lib/ring -Ilib/meter -I../lib/meter -Idrivers/bus/pci -I../drivers/bus/pci -I../drivers/bus/pci/linux -Ilib/pci -I../lib/pci -Idrivers/bus/vdev -I../drivers/bus/vdev -Idrivers/common/dpaax -I../drivers/common/dpaax -I../drivers/common/dpaax/caamflib -Xclang -fcolor-diagnostics -pipe -D_FILE_OFFSET_BITS=64 -Wall -Winvalid-pch -Werror -O3 -include rte_config.h -Wextra -Wcast-qual -Wdeprecated -Wformat -Wformat-nonliteral -Wformat-security -Wmissing-declarations -Wmissing-prototypes -Wnested-externs -Wold-style-definition -Wpointer-arith -Wsign-compare -Wstrict-prototypes -Wundef -Wwrite-strings -Wno-address-of-packed-member -Wno-missing-field-initializers -D_GNU_SOURCE -fPIC -march=native -DALLOW_EXPERIMENTAL_API -DALLOW_INTERNAL_API -Wno-pointer-arith -DRTE_LOG_DEFAULT_LOGTYPE=pmd.net.enetfec -MD -MQ drivers/libtmp_rte_net_enetfec.a.p/net_enetfec_enet_rxtx.c.o -MF drivers/libtmp_rte_net_enetfec.a.p/net_enetfec_enet_rxtx.c.o.d -o drivers/libtmp_rte_net_enetfec.a.p/net_enetfec_enet_rxtx.c.o -c ../drivers/net/enetfec/enet_rxtx.c
../drivers/net/enetfec/enet_rxtx.c:15:22: error: unused variable 'lb_quit' [-Werror,-Wunused-variable]
static volatile bool lb_quit;
                     ^
1 error generated.
[1320/3049] Compiling C object drivers/libtmp_rte_net_enetc.a.p/net_enetc_enetc_ethdev.c.o
[1321/3049] Compiling C object drivers/libtmp_rte_net_ena.a.p/net_ena_base_ena_com.c.o
[1322/3049] Compiling C object drivers/libtmp_rte_net_enetfec.a.p/net_enetfec_enet_ethdev.c.o
[1323/3049] Generating rte_net_e1000.sym_chk with a meson_exe.py custom command
[1324/3049] Compiling C object drivers/libtmp_rte_net_enic.a.p/net_enic_base_vnic_cq.c.o
[1325/3049] Compiling C object drivers/libtmp_rte_net_ena.a.p/net_ena_ena_ethdev.c.o
[1326/3049] Compiling C object drivers/libtmp_rte_net_enic.a.p/net_enic_base_vnic_dev.c.o
[1327/3049] Compiling C object drivers/libtmp_rte_net_enic.a.p/net_enic_base_vnic_rq.c.o
[1328/3049] Compiling C object drivers/libtmp_rte_net_enic.a.p/net_enic_base_vnic_wq.c.o
ninja: build stopped




*Build Failed #9:
OS: RHEL83-64
Target: x86_64-native-linuxapp-clang
FAILED: drivers/a715181@@tmp_rte_net_enetfec@sta/net_enetfec_enet_rxtx.c.o 
clang -Idrivers/a715181@@tmp_rte_net_enetfec@sta -Idrivers -I../drivers -Idrivers/net/enetfec -I../drivers/net/enetfec -Ilib/ethdev -I../lib/ethdev -I. -I../ -Iconfig -I../config -Ilib/eal/include -I../lib/eal/include -Ilib/eal/linux/include -I../lib/eal/linux/include -Ilib/eal/x86/include -I../lib/eal/x86/include -Ilib/eal/common -I../lib/eal/common -Ilib/eal -I../lib/eal -Ilib/kvargs -I../lib/kvargs -Ilib/telemetry/../metrics -I../lib/telemetry/../metrics -Ilib/telemetry -I../lib/telemetry -Ilib/net -I../lib/net -Ilib/mbuf -I../lib/mbuf -Ilib/mempool -I../lib/mempool -Ilib/ring -I../lib/ring -Ilib/meter -I../lib/meter -Idrivers/bus/pci -I../drivers/bus/pci -I../drivers/bus/pci/linux -Ilib/pci -I../lib/pci -Idrivers/bus/vdev -I../drivers/bus/vdev -Idrivers/common/dpaax -I../drivers/common/dpaax -I../drivers/common/dpaax/caamflib -Xclang -fcolor-diagnostics -pipe -D_FILE_OFFSET_BITS=64 -Wall -Winvalid-pch -Werror -O3 -include rte_config.h -Wextra -Wcast-qual -Wdeprecated -Wformat -Wformat-nonliteral -Wformat-security -Wmissing-declarations -Wmissing-prototypes -Wnested-externs -Wold-style-definition -Wpointer-arith -Wsign-compare -Wstrict-prototypes -Wundef -Wwrite-strings -Wno-address-of-packed-member -Wno-missing-field-initializers -D_GNU_SOURCE -fPIC -march=native -DALLOW_EXPERIMENTAL_API -DALLOW_INTERNAL_API -Wno-pointer-arith -DRTE_LOG_DEFAULT_LOGTYPE=pmd.net.enetfec -MD -MQ 'drivers/a715181@@tmp_rte_net_enetfec@sta/net_enetfec_enet_rxtx.c.o' -MF 'drivers/a715181@@tmp_rte_net_enetfec@sta/net_enetfec_enet_rxtx.c.o.d' -o 'drivers/a715181@@tmp_rte_net_enetfec@sta/net_enetfec_enet_rxtx.c.o' -c ../drivers/net/enetfec/enet_rxtx.c
../drivers/net/enetfec/enet_rxtx.c:15:22: error: unused variable 'lb_quit' [-Werror,-Wunused-variable]
static volatile bool lb_quit;
                     ^
1 error generated.
[1238/2832] Compiling C object 'drivers/a715181@@rte_net_enetc@sha/meson-generated_.._rte_net_enetc.pmd.c.o'.
[1239/2832] Linking target drivers/librte_net_e1000.so.22.0.
[1240/2832] Compiling C object 'drivers/a715181@@tmp_rte_net_enetfec@sta/net_enetfec_enet_ethdev.c.o'.
[1241/2832] Compiling C object 'drivers/a715181@@tmp_rte_net_ena@sta/net_ena_ena_ethdev.c.o'.
[1242/2832] Compiling C object 'drivers/a715181@@tmp_rte_net_enic@sta/net_enic_base_vnic_rq.c.o'.
[1243/2832] Compiling C object 'drivers/a715181@@tmp_rte_net_enic@sta/net_enic_base_vnic_wq.c.o'.
[1244/2832] Compiling C object 'drivers/a715181@@tmp_rte_net_enic@sta/net_enic_base_vnic_cq.c.o'.
[1245/2832] Compiling C object 'drivers/a715181@@tmp_rte_net_enic@sta/net_enic_base_vnic_dev.c.o'.
[1246/2832] Compiling C object 'drivers/a715181@@tmp_rte_net_enic@sta/net_enic_enic_ethdev.c.o'.
ninja: build stopped


DPDK STV team

^ permalink raw reply	[flat|nested] only message in thread

only message in thread, other threads:[~2021-09-03  0:40 UTC | newest]

Thread overview: (only message) (download: mbox.gz / follow: Atom feed)
-- links below jump to the message on this page --
2021-09-03  0:39 [dpdk-test-report] |FAILURE| pw(97841) sid(18636) job(PER_PATCH_BUILD7541)[v2, 5/5] net/enetfec: add features sys_stv

This is a public inbox, see mirroring instructions
for how to clone and mirror all data and code used for this inbox;
as well as URLs for NNTP newsgroup(s).