automatic DPDK test reports
 help / color / mirror / Atom feed
* [dpdk-test-report] |FAILURE| pw(86987) [v3, 6/6] power: clean up includes
@ 2021-01-20 16:01 sys_stv
  0 siblings, 0 replies; only message in thread
From: sys_stv @ 2021-01-20 16:01 UTC (permalink / raw)
  To: test-report

[-- Attachment #1: Type: text/plain, Size: 27720 bytes --]


Test-Label: Intel-compilation
Test-Status: FAILURE
http://dpdk.org/patch/86987

_Compilation issues_

Submitter: David Hunt <david.hunt@intel.com>
Date: 2021-01-20 13:55:56
Reply_mail: 20210120135556.33763-7-david.hunt@intel.com

DPDK git baseline: Repo:dpdk, CommitID: 4080917cbcb8fb41bf6b3618039a72cee0b7525e


Meson Build Summary: 22 Builds Done, 5 Successful, 17 Failures, 0 Blocked

+------------------+------------+--------------+------------+------------+-----------+----------+
| os               | gcc-static | clang-static | icc-static | gcc-shared | gcc-debug | document |
+------------------+------------+--------------+------------+------------+-----------+----------+
| UB2004-64        | FAIL       | FAIL         | FAIL       |            |           | FAIL     |
| RHEL83-64        | FAIL       |              |            |            |           |          |
| FC33-64          | FAIL       | FAIL         |            |            |           |          |
| CentOsStream8-64 | FAIL       |              |            |            |           |          |
| UB2010-64        | FAIL       |              |            |            |           |          |
| WIN10-64         |            | pass         |            |            |           |          |
| UB2004-32        | FAIL       |              |            |            |           |          |
| CENTOS83-64      | FAIL       | FAIL         | FAIL       | FAIL       | FAIL      |          |
| FreeBSD1201-64   | pass       | pass         |            | pass       | pass      |          |
| SUSE15-64        | FAIL       | FAIL         |            |            |           |          |
+------------------+------------+--------------+------------+------------+-----------+----------+
Test environment and configuration as below:


OS: UB2004-64
	Kernel Version: 5.6.0-050600-generic
	CPU info: Intel(R) Xeon(R) Platinum 8180 CPU @ 2.50GHz
	GCC Version: gcc (Ubuntu 10-20200416-0ubuntu1) 10.0.1 20200416 (experimental) [master revision 3c3f12e2a76:dcee354ce56:44b326839d864fc10c459916abcc97f35a9ac3de]
	Clang Version: 10.0.0-4ubuntu1
	x86_64-native-linuxapp-clang
	x86_64-native-linuxapp-gcc
	x86_64-native-linuxapp-icc
	x86_64-native-linuxapp-doc

OS: RHEL83-64
	Kernel Version: 4.18.0-240.el8.x86_64
	CPU info: Intel(R) Xeon(R) CPU E5-2699 v4 @ 2.20GHz
	GCC Version: gcc (GCC) 8.3.1 20191121 (Red Hat 8.3.1-5)
	Clang Version: 10.0.1 (Red Hat 10.0.1-1.module+el8.3.0+7459+90c24896)
	x86_64-native-linuxapp-gcc

OS: FC33-64
	Kernel Version: 5.8.16-300.fc33.x86_64
	CPU info: Intel(R) Xeon(R) CPU E5-2699 v4 @ 2.20GHz
	GCC Version: gcc (GCC) 10.2.1 20201005 (Red Hat 10.2.1-5)
	Clang Version: 11.0.0 (Fedora 11.0.0-1.fc33)
	x86_64-native-linuxapp-gcc
	x86_64-native-linuxapp-clang

OS: CentOsStream8-64
	Kernel Version: 4.18.0-257.el8.x86_64
	CPU info: Intel(R) Xeon(R) CPU E5-2699 v4 @ 2.20GHz
	GCC Version: gcc (GCC) 8.4.1 20200928 (Red Hat 8.4.1-1)
	Clang Version: 11.0.0 (Red Hat 11.0.0-0.2.rc2.module_el8.4.0+533+50191577)
	x86_64-native-linuxapp-gcc

OS: UB2010-64
	Kernel Version: 5.8.0-25-generic
	CPU info: Intel(R) Xeon(R) CPU E5-2699 v4 @ 2.20GHz
	GCC Version: gcc (Ubuntu 10.2.0-13ubuntu1) 10.2.0
	Clang Version: 11.0.0-2
	x86_64-native-linuxapp-gcc

OS: WIN10-64
	Kernel Version: N/A
	CPU info: N/A
	GCC Version: N/A
	Clang Version: Clang 8.0.0
	x86_64-windows-clang

OS: UB2004-32
	Kernel Version: 5.6.0-050600-generic
	CPU info: Intel(R) Xeon(R) Platinum 8180 CPU @ 2.50GHz
	GCC Version: gcc (Ubuntu 9.3.0-10ubuntu2) 9.3.0
	Clang Version: 10.0.0-4ubuntu1
	i686-native-linuxapp-gcc

OS: CENTOS83-64
	Kernel Version: 4.18.0-240.1.1.el8_3.x86_64
	CPU info: Intel(R) Xeon(R) Platinum 8180 CPU @ 2.50GHz
	GCC Version: gcc (GCC) 8.3.1 20191121 (Red Hat 8.3.1-5)
	Clang Version: 10.0.1 (Red Hat 10.0.1-1.module_el8.3.0+467+cb298d5b)
	x86_64-native-linuxapp-gcc
	x86_64-native-linuxapp-clang
	x86_64-native-linuxapp-icc
	x86_64-native-linuxapp-gcc+shared
	x86_64-native-linuxapp-gcc+debug

OS: FreeBSD1201-64
	Kernel Version: 12.1-RELEASE
	CPU info: Intel(R) Xeon(R) CPU E5-2699 v3 @ 2.30GHz (2294.74-MHz K8-class CPU)
	GCC Version: gcc (FreeBSD Ports Collection) 9.2.0
	Clang Version: 8.0.1 (tags/RELEASE_801/final 366581) (based on LLVM 8.0.1)
	x86_64-native-bsdapp-gcc
	x86_64-native-bsdapp-clang
	x86_64-native-bsdapp-gcc+shared
	x86_64-native-bsdapp-gcc+debug

OS: SUSE15-64
	Kernel Version: 5.3.18-lp152.57-default
	CPU info: Intel(R) Xeon(R) CPU E5-2699 v4 @ 2.20GHz
	GCC Version: gcc (SUSE Linux) 7.5.0
	Clang Version: 9.0.1
	x86_64-native-linuxapp-clang
	x86_64-native-linuxapp-gcc



*Build Failed #1:
OS: CENTOS83-64
Target: x86_64-native-linuxapp-gcc
FAILED: lib/power.sym_chk 
/usr/local/bin/meson --internal exe --capture lib/power.sym_chk -- /root/CENTOS83-64_K4.18.0_GCC8.3.1/x86_64-native-linuxapp-gcc/1552e3615b724f8391b91a39c67f2e97/dpdk/buildtools/check-symbols.sh /root/CENTOS83-64_K4.18.0_GCC8.3.1/x86_64-native-linuxapp-gcc/1552e3615b724f8391b91a39c67f2e97/dpdk/lib/librte_power/version.map lib/librte_power.a
rte_power_guest_channel_send_msg is flagged as experimental
but is not listed in version map
Please add rte_power_guest_channel_send_msg to the version map
[402/2812] Linking static target lib/librte_reorder.a
[403/2812] Compiling C object lib/librte_security.a.p/librte_security_rte_security.c.o
[404/2812] Generating stack.sym_chk with a meson_exe.py custom command
[405/2812] Generating symbol file lib/librte_rawdev.so.21.1.p/librte_rawdev.so.21.1.symbols
[406/2812] Generating regexdev.sym_chk with a meson_exe.py custom command
[407/2812] Compiling C object lib/librte_vhost.a.p/librte_vhost_iotlb.c.o
[408/2812] Compiling C object lib/librte_vhost.a.p/librte_vhost_vdpa.c.o
[409/2812] Generating rib.sym_chk with a meson_exe.py custom command
[410/2812] Compiling C object lib/librte_vhost.a.p/librte_vhost_socket.c.o
[411/2812] Compiling C object lib/librte_vhost.a.p/librte_vhost_vhost.c.o
[412/2812] Compiling C object lib/librte_sched.a.p/librte_sched_rte_sched.c.o
ninja: build stopped




*Build Failed #2:
OS: CENTOS83-64
Target: x86_64-native-linuxapp-clang
FAILED: lib/power.sym_chk 
/usr/local/bin/meson --internal exe --capture lib/power.sym_chk -- /root/CENTOS83-64_K4.18.0_Clang7.0.1/x86_64-native-linuxapp-clang/1552e3615b724f8391b91a39c67f2e97/dpdk/buildtools/check-symbols.sh /root/CENTOS83-64_K4.18.0_Clang7.0.1/x86_64-native-linuxapp-clang/1552e3615b724f8391b91a39c67f2e97/dpdk/lib/librte_power/version.map lib/librte_power.a
rte_power_guest_channel_send_msg is flagged as experimental
but is not listed in version map
Please add rte_power_guest_channel_send_msg to the version map
[390/2815] Compiling C object lib/librte_stack.a.p/librte_stack_rte_stack_std.c.o
[391/2815] Compiling C object lib/librte_stack.a.p/librte_stack_rte_stack.c.o
[392/2815] Linking target lib/librte_rawdev.so.21.1
[393/2815] Compiling C object lib/librte_reorder.a.p/librte_reorder_rte_reorder.c.o
[394/2815] Generating regexdev.sym_chk with a meson_exe.py custom command
[395/2815] Compiling C object lib/librte_pdump.a.p/librte_pdump_rte_pdump.c.o
[396/2815] Generating rib.sym_chk with a meson_exe.py custom command
[397/2815] Compiling C object lib/librte_security.a.p/librte_security_rte_security.c.o
[398/2815] Compiling C object lib/librte_sched.a.p/librte_sched_rte_sched.c.o
ninja: build stopped




*Build Failed #3:
OS: CENTOS83-64
Target: x86_64-native-linuxapp-icc
FAILED: lib/power.sym_chk 
/usr/local/bin/meson --internal exe --capture lib/power.sym_chk -- /root/CENTOS83-64_K4.18.0_ICC19.1.1/x86_64-native-linuxapp-icc/1552e3615b724f8391b91a39c67f2e97/dpdk/buildtools/check-symbols.sh /root/CENTOS83-64_K4.18.0_ICC19.1.1/x86_64-native-linuxapp-icc/1552e3615b724f8391b91a39c67f2e97/dpdk/lib/librte_power/version.map lib/librte_power.a
rte_power_guest_channel_send_msg is flagged as experimental
but is not listed in version map
Please add rte_power_guest_channel_send_msg to the version map
[375/2815] Generating symbol file lib/librte_lpm.so.21.1.p/librte_lpm.so.21.1.symbols
[376/2815] Generating pdump.sym_chk with a meson_exe.py custom command
[377/2815] Compiling C object lib/librte_sched.a.p/librte_sched_rte_approx.c.o
[378/2815] Linking target lib/librte_rawdev.so.21.1
[379/2815] Compiling C object lib/librte_stack.a.p/librte_stack_rte_stack.c.o
[380/2815] Generating regexdev.sym_chk with a meson_exe.py custom command
[381/2815] Generating rib.sym_chk with a meson_exe.py custom command
[382/2815] Compiling C object lib/librte_security.a.p/librte_security_rte_security.c.o
[383/2815] Compiling C object lib/librte_reorder.a.p/librte_reorder_rte_reorder.c.o
[384/2815] Compiling C object lib/librte_sched.a.p/librte_sched_rte_sched.c.o
[385/2815] Generating ethdev.sym_chk with a meson_exe.py custom command
ninja: build stopped




*Build Failed #4:
OS: CENTOS83-64
Target: x86_64-native-linuxapp-gcc+shared
FAILED: lib/power.sym_chk 
/usr/local/bin/meson --internal exe --capture lib/power.sym_chk -- /root/CENTOS83-64_K4.18.0_GCC8.3.1/x86_64-native-linuxapp-gcc+shared/1552e3615b724f8391b91a39c67f2e97/dpdk/buildtools/check-symbols.sh /root/CENTOS83-64_K4.18.0_GCC8.3.1/x86_64-native-linuxapp-gcc+shared/1552e3615b724f8391b91a39c67f2e97/dpdk/lib/librte_power/version.map lib/librte_power.a
rte_power_guest_channel_send_msg is flagged as experimental
but is not listed in version map
Please add rte_power_guest_channel_send_msg to the version map
[406/2655] Generating rte_stack_mingw with a custom command
[407/2655] Compiling C object lib/librte_stack.a.p/librte_stack_rte_stack_lf.c.o
[408/2655] Generating regexdev.sym_chk with a meson_exe.py custom command
[409/2655] Compiling C object lib/librte_security.a.p/librte_security_rte_security.c.o
[410/2655] Generating symbol file lib/librte_pdump.so.21.1.p/librte_pdump.so.21.1.symbols
[411/2655] Generating reorder.sym_chk with a meson_exe.py custom command
[412/2655] Generating rib.sym_chk with a meson_exe.py custom command
[413/2655] Generating symbol file lib/librte_rawdev.so.21.1.p/librte_rawdev.so.21.1.symbols
[414/2655] Compiling C object lib/librte_sched.a.p/librte_sched_rte_sched.c.o
ninja: build stopped




*Build Failed #5:
OS: CENTOS83-64
Target: x86_64-native-linuxapp-gcc+debug
FAILED: lib/power.sym_chk 
/usr/local/bin/meson --internal exe --capture lib/power.sym_chk -- /root/CENTOS83-64_K4.18.0_GCC8.3.1/x86_64-native-linuxapp-gcc+debug/1552e3615b724f8391b91a39c67f2e97/dpdk/buildtools/check-symbols.sh /root/CENTOS83-64_K4.18.0_GCC8.3.1/x86_64-native-linuxapp-gcc+debug/1552e3615b724f8391b91a39c67f2e97/dpdk/lib/librte_power/version.map lib/librte_power.a
rte_power_guest_channel_send_msg is flagged as experimental
but is not listed in version map
Please add rte_power_guest_channel_send_msg to the version map
[392/2815] Compiling C object lib/librte_stack.a.p/librte_stack_rte_stack_std.c.o
[393/2815] Generating rawdev.sym_chk with a meson_exe.py custom command
[394/2815] Compiling C object lib/librte_stack.a.p/librte_stack_rte_stack.c.o
[395/2815] Generating pdump.sym_chk with a meson_exe.py custom command
[396/2815] Generating reorder.sym_chk with a meson_exe.py custom command
[397/2815] Generating regexdev.sym_chk with a meson_exe.py custom command
[398/2815] Compiling C object lib/librte_security.a.p/librte_security_rte_security.c.o
[399/2815] Generating rib.sym_chk with a meson_exe.py custom command
[400/2815] Compiling C object lib/librte_sched.a.p/librte_sched_rte_sched.c.o
ninja: build stopped




*Build Failed #6:
OS: FC33-64
Target: x86_64-native-linuxapp-gcc
FAILED: lib/power.sym_chk 
/usr/local/bin/meson --internal exe --capture lib/power.sym_chk -- /root/FC33-64_K5.8.16_GCC10.2.1/x86_64-native-linuxapp-gcc/1552e3615b724f8391b91a39c67f2e97/dpdk/buildtools/check-symbols.sh /root/FC33-64_K5.8.16_GCC10.2.1/x86_64-native-linuxapp-gcc/1552e3615b724f8391b91a39c67f2e97/dpdk/lib/librte_power/version.map lib/librte_power.a
rte_power_guest_channel_send_msg is flagged as experimental
but is not listed in version map
Please add rte_power_guest_channel_send_msg to the version map
[397/2824] Generating pdump.sym_chk with a meson_exe.py custom command
[398/2824] Compiling C object lib/librte_rib.a.p/librte_rib_rte_rib6.c.o
[399/2824] Generating reorder.sym_chk with a meson_exe.py custom command
[400/2824] Generating stack.sym_chk with a meson_exe.py custom command
[401/2824] Generating symbol file lib/librte_lpm.so.21.1.p/librte_lpm.so.21.1.symbols
[402/2824] Generating symbol file lib/librte_rawdev.so.21.1.p/librte_rawdev.so.21.1.symbols
[403/2824] Generating regexdev.sym_chk with a meson_exe.py custom command
[404/2824] Compiling C object lib/librte_security.a.p/librte_security_rte_security.c.o
[405/2824] Compiling C object lib/librte_vhost.a.p/librte_vhost_iotlb.c.o
[406/2824] Compiling C object lib/librte_vhost.a.p/librte_vhost_socket.c.o
[407/2824] Compiling C object lib/librte_sched.a.p/librte_sched_rte_sched.c.o
ninja: build stopped




*Build Failed #7:
OS: FC33-64
Target: x86_64-native-linuxapp-clang
FAILED: lib/power.sym_chk 
/usr/local/bin/meson --internal exe --capture lib/power.sym_chk -- /root/FC33-64_K5.8.16_Clang11.0.0/x86_64-native-linuxapp-clang/1552e3615b724f8391b91a39c67f2e97/dpdk/buildtools/check-symbols.sh /root/FC33-64_K5.8.16_Clang11.0.0/x86_64-native-linuxapp-clang/1552e3615b724f8391b91a39c67f2e97/dpdk/lib/librte_power/version.map lib/librte_power.a
rte_power_guest_channel_send_msg is flagged as experimental
but is not listed in version map
Please add rte_power_guest_channel_send_msg to the version map
[383/2824] Linking static target lib/librte_regexdev.a
[384/2824] Compiling C object lib/librte_stack.a.p/librte_stack_rte_stack.c.o
[385/2824] Generating rawdev.sym_chk with a meson_exe.py custom command
[386/2824] Compiling C object lib/librte_stack.a.p/librte_stack_rte_stack_std.c.o
[387/2824] Compiling C object lib/librte_reorder.a.p/librte_reorder_rte_reorder.c.o
[388/2824] Compiling C object lib/librte_rib.a.p/librte_rib_rte_rib6.c.o
[389/2824] Compiling C object lib/librte_pdump.a.p/librte_pdump_rte_pdump.c.o
[390/2824] Compiling C object lib/librte_security.a.p/librte_security_rte_security.c.o
[391/2824] Compiling C object lib/librte_sched.a.p/librte_sched_rte_sched.c.o
ninja: build stopped




*Build Failed #8:
OS: RHEL83-64
Target: x86_64-native-linuxapp-gcc
FAILED: lib/power.sym_chk 
/usr/local/bin/meson --internal exe --capture lib/power.sym_chk -- /root/RHEL83-64_K4.18.0_GCC8.3.1/x86_64-native-linuxapp-gcc/1552e3615b724f8391b91a39c67f2e97/dpdk/buildtools/check-symbols.sh /root/RHEL83-64_K4.18.0_GCC8.3.1/x86_64-native-linuxapp-gcc/1552e3615b724f8391b91a39c67f2e97/dpdk/lib/librte_power/version.map lib/librte_power.a
rte_power_guest_channel_send_msg is flagged as experimental
but is not listed in version map
Please add rte_power_guest_channel_send_msg to the version map
[401/2815] Compiling C object lib/librte_vhost.a.p/librte_vhost_fd_man.c.o
[402/2815] Compiling C object lib/librte_security.a.p/librte_security_rte_security.c.o
[403/2815] Generating regexdev.sym_chk with a custom command (wrapped by meson to capture output)
[404/2815] Generating rib.sym_chk with a custom command (wrapped by meson to capture output)
[405/2815] Generating reorder.sym_chk with a custom command (wrapped by meson to capture output)
[406/2815] Generating stack.sym_chk with a custom command (wrapped by meson to capture output)
[407/2815] Generating symbol file lib/librte_rawdev.so.21.1.p/librte_rawdev.so.21.1.symbols
[408/2815] Compiling C object lib/librte_vhost.a.p/librte_vhost_iotlb.c.o
[409/2815] Compiling C object lib/librte_sched.a.p/librte_sched_rte_sched.c.o
ninja: build stopped




*Build Failed #9:
OS: SUSE15-64
Target: x86_64-native-linuxapp-clang
FAILED: lib/power.sym_chk 
/usr/bin/meson --internal exe --capture lib/power.sym_chk -- /root/SUSE15-64_K5.3.18_Clang9.0.1/x86_64-native-linuxapp-clang/1552e3615b724f8391b91a39c67f2e97/dpdk/buildtools/check-symbols.sh /root/SUSE15-64_K5.3.18_Clang9.0.1/x86_64-native-linuxapp-clang/1552e3615b724f8391b91a39c67f2e97/dpdk/lib/librte_power/version.map lib/librte_power.a
rte_power_guest_channel_send_msg is flagged as experimental
but is not listed in version map
Please add rte_power_guest_channel_send_msg to the version map
[399/2718] Linking target lib/librte_rawdev.so.21.1
[400/2718] Generating pdump.sym_chk with a custom command (wrapped by meson to capture output)
[401/2718] Generating regexdev.sym_chk with a custom command (wrapped by meson to capture output)
[402/2718] Compiling C object lib/librte_vhost.a.p/librte_vhost_fd_man.c.o
[403/2718] Compiling C object lib/librte_security.a.p/librte_security_rte_security.c.o
[404/2718] Generating reorder.sym_chk with a custom command (wrapped by meson to capture output)
[405/2718] Generating rib.sym_chk with a custom command (wrapped by meson to capture output)
[406/2718] Generating stack.sym_chk with a custom command (wrapped by meson to capture output)
[407/2718] Compiling C object lib/librte_sched.a.p/librte_sched_rte_sched.c.o
ninja: build stopped




*Build Failed #10:
OS: SUSE15-64
Target: x86_64-native-linuxapp-gcc
FAILED: lib/power.sym_chk 
/usr/bin/meson --internal exe --capture lib/power.sym_chk -- /root/SUSE15-64_K5.3.18_GCC7.5.1/x86_64-native-linuxapp-gcc/1552e3615b724f8391b91a39c67f2e97/dpdk/buildtools/check-symbols.sh /root/SUSE15-64_K5.3.18_GCC7.5.1/x86_64-native-linuxapp-gcc/1552e3615b724f8391b91a39c67f2e97/dpdk/lib/librte_power/version.map lib/librte_power.a
rte_power_guest_channel_send_msg is flagged as experimental
but is not listed in version map
Please add rte_power_guest_channel_send_msg to the version map
[391/2716] Linking target lib/librte_pdump.so.21.1
[392/2716] Generating reorder.sym_chk with a custom command (wrapped by meson to capture output)
[393/2716] Generating regexdev.sym_chk with a custom command (wrapped by meson to capture output)
[394/2716] Generating symbol file lib/librte_rawdev.so.21.1.p/librte_rawdev.so.21.1.symbols
[395/2716] Compiling C object lib/librte_security.a.p/librte_security_rte_security.c.o
[396/2716] Generating rib.sym_chk with a custom command (wrapped by meson to capture output)
[397/2716] Compiling C object lib/librte_sched.a.p/librte_sched_rte_sched.c.o
ninja: build stopped




*Build Failed #11:
OS: CentOsStream8-64
Target: x86_64-native-linuxapp-gcc
FAILED: lib/power.sym_chk 
/usr/local/bin/meson --internal exe --capture lib/power.sym_chk -- /root/CentOsStream8-64_K4.18.0_GCC8.4.1/x86_64-native-linuxapp-gcc/1552e3615b724f8391b91a39c67f2e97/dpdk/buildtools/check-symbols.sh /root/CentOsStream8-64_K4.18.0_GCC8.4.1/x86_64-native-linuxapp-gcc/1552e3615b724f8391b91a39c67f2e97/dpdk/lib/librte_power/version.map lib/librte_power.a
rte_power_guest_channel_send_msg is flagged as experimental
but is not listed in version map
Please add rte_power_guest_channel_send_msg to the version map
[401/2815] Generating reorder.sym_chk with a custom command (wrapped by meson to capture output)
[402/2815] Compiling C object lib/librte_security.a.p/librte_security_rte_security.c.o
[403/2815] Generating regexdev.sym_chk with a custom command (wrapped by meson to capture output)
[404/2815] Generating rib.sym_chk with a custom command (wrapped by meson to capture output)
[405/2815] Generating stack.sym_chk with a custom command (wrapped by meson to capture output)
[406/2815] Generating symbol file lib/librte_rawdev.so.21.1.p/librte_rawdev.so.21.1.symbols
[407/2815] Compiling C object lib/librte_vhost.a.p/librte_vhost_vdpa.c.o
[408/2815] Compiling C object lib/librte_vhost.a.p/librte_vhost_iotlb.c.o
[409/2815] Compiling C object lib/librte_vhost.a.p/librte_vhost_socket.c.o
[410/2815] Compiling C object lib/librte_vhost.a.p/librte_vhost_vhost.c.o
[411/2815] Compiling C object lib/librte_sched.a.p/librte_sched_rte_sched.c.o
ninja: build stopped




*Build Failed #12:
OS: UB2004-32
Target: i686-native-linuxapp-gcc
FAILED: lib/power.sym_chk 
/usr/local/bin/meson --internal exe --capture lib/power.sym_chk -- /root/UB2004-32_K4.15.0_GCC9.3.0/i686-native-linuxapp-gcc/1552e3615b724f8391b91a39c67f2e97/dpdk/buildtools/check-symbols.sh /root/UB2004-32_K4.15.0_GCC9.3.0/i686-native-linuxapp-gcc/1552e3615b724f8391b91a39c67f2e97/dpdk/lib/librte_power/version.map lib/librte_power.a
rte_power_guest_channel_send_msg is flagged as experimental
but is not listed in version map
Please add rte_power_guest_channel_send_msg to the version map
[379/2370] Compiling C object lib/librte_sched.a.p/librte_sched_rte_approx.c.o
[380/2370] Compiling C object lib/librte_stack.a.p/librte_stack_rte_stack.c.o
[381/2370] Generating regexdev.sym_chk with a meson_exe.py custom command
[382/2370] Generating reorder.sym_chk with a meson_exe.py custom command
[383/2370] Generating pdump.sym_chk with a meson_exe.py custom command
[384/2370] Generating symbol file lib/librte_rawdev.so.21.1.p/librte_rawdev.so.21.1.symbols
[385/2370] Generating rib.sym_chk with a meson_exe.py custom command
[386/2370] Compiling C object lib/librte_security.a.p/librte_security_rte_security.c.o
[387/2370] Compiling C object lib/librte_sched.a.p/librte_sched_rte_sched.c.o
ninja: build stopped




*Build Failed #13:
OS: UB2004-64
Target: x86_64-native-linuxapp-clang
FAILED: lib/power.sym_chk 
/usr/local/bin/meson --internal exe --capture lib/power.sym_chk -- /root/UB2004-64_K5.4.0_Clang10.0.0/x86_64-native-linuxapp-clang/1552e3615b724f8391b91a39c67f2e97/dpdk/buildtools/check-symbols.sh /root/UB2004-64_K5.4.0_Clang10.0.0/x86_64-native-linuxapp-clang/1552e3615b724f8391b91a39c67f2e97/dpdk/lib/librte_power/version.map lib/librte_power.a
rte_power_guest_channel_send_msg is flagged as experimental
but is not listed in version map
Please add rte_power_guest_channel_send_msg to the version map
[395/2811] Compiling C object lib/librte_stack.a.p/librte_stack_rte_stack_std.c.o
[396/2811] Generating pdump.sym_chk with a meson_exe.py custom command
[397/2811] Generating symbol file lib/librte_rawdev.so.21.1.p/librte_rawdev.so.21.1.symbols
[398/2811] Compiling C object lib/librte_security.a.p/librte_security_rte_security.c.o
[399/2811] Generating reorder.sym_chk with a meson_exe.py custom command
[400/2811] Generating regexdev.sym_chk with a meson_exe.py custom command
[401/2811] Generating rib.sym_chk with a meson_exe.py custom command
[402/2811] Compiling C object lib/librte_sched.a.p/librte_sched_rte_sched.c.o
[403/2811] Compiling C object drivers/libtmp_rte_crypto_caam_jr.a.p/crypto_caam_jr_caam_jr.c.o
ninja: build stopped




*Build Failed #14:
OS: UB2004-64
Target: x86_64-native-linuxapp-gcc
FAILED: lib/power.sym_chk 
/usr/local/bin/meson --internal exe --capture lib/power.sym_chk -- /root/UB2004-64_K5.4.0_GCC9.3.0/x86_64-native-linuxapp-gcc/1552e3615b724f8391b91a39c67f2e97/dpdk/buildtools/check-symbols.sh /root/UB2004-64_K5.4.0_GCC9.3.0/x86_64-native-linuxapp-gcc/1552e3615b724f8391b91a39c67f2e97/dpdk/lib/librte_power/version.map lib/librte_power.a
rte_power_guest_channel_send_msg is flagged as experimental
but is not listed in version map
Please add rte_power_guest_channel_send_msg to the version map
[383/2811] Compiling C object lib/librte_sched.a.p/librte_sched_rte_approx.c.o
[384/2811] Generating rte_sched_def with a custom command
[385/2811] Generating rawdev.sym_chk with a meson_exe.py custom command
[386/2811] Compiling C object lib/librte_rib.a.p/librte_rib_rte_rib6.c.o
[387/2811] Generating pdump.sym_chk with a meson_exe.py custom command
[388/2811] Generating regexdev.sym_chk with a meson_exe.py custom command
[389/2811] Generating reorder.sym_chk with a meson_exe.py custom command
[390/2811] Compiling C object lib/librte_sched.a.p/librte_sched_rte_sched.c.o
[391/2811] Compiling C object drivers/libtmp_rte_crypto_caam_jr.a.p/crypto_caam_jr_caam_jr.c.o
ninja: build stopped




*Build Failed #15:
OS: UB2004-64
Target: x86_64-native-linuxapp-icc
FAILED: lib/power.sym_chk 
/usr/local/bin/meson --internal exe --capture lib/power.sym_chk -- /root/UB2004-64_K5.4.0_ICC19.1.0/x86_64-native-linuxapp-icc/1552e3615b724f8391b91a39c67f2e97/dpdk/buildtools/check-symbols.sh /root/UB2004-64_K5.4.0_ICC19.1.0/x86_64-native-linuxapp-icc/1552e3615b724f8391b91a39c67f2e97/dpdk/lib/librte_power/version.map lib/librte_power.a
rte_power_guest_channel_send_msg is flagged as experimental
but is not listed in version map
Please add rte_power_guest_channel_send_msg to the version map
[363/2765] Compiling C object lib/librte_rib.a.p/librte_rib_rte_rib.c.o
[364/2765] Generating rawdev.sym_chk with a meson_exe.py custom command
[365/2765] Generating symbol file lib/librte_lpm.so.21.1.p/librte_lpm.so.21.1.symbols
[366/2765] Compiling C object lib/librte_rib.a.p/librte_rib_rte_rib6.c.o
[367/2765] Compiling C object lib/librte_pdump.a.p/librte_pdump_rte_pdump.c.o
[368/2765] Compiling C object lib/librte_ethdev.a.p/librte_ethdev_rte_flow.c.o
[369/2765] Generating regexdev.sym_chk with a meson_exe.py custom command
[370/2765] Compiling C object lib/librte_reorder.a.p/librte_reorder_rte_reorder.c.o
[371/2765] Compiling C object lib/librte_sched.a.p/librte_sched_rte_sched.c.o
ninja: build stopped




*Build Failed #16:
OS: UB2004-64
Target: x86_64-native-linuxapp-doc
FAILED: lib/power.sym_chk 
/usr/local/bin/meson --internal exe --capture lib/power.sym_chk -- /root/UB2004-64_K5.4.0_GCC9.3.0/x86_64-native-linuxapp-doc/1552e3615b724f8391b91a39c67f2e97/dpdk/buildtools/check-symbols.sh /root/UB2004-64_K5.4.0_GCC9.3.0/x86_64-native-linuxapp-doc/1552e3615b724f8391b91a39c67f2e97/dpdk/lib/librte_power/version.map lib/librte_power.a
rte_power_guest_channel_send_msg is flagged as experimental
but is not listed in version map
Please add rte_power_guest_channel_send_msg to the version map
[392/2621] Compiling C object lib/librte_reorder.a.p/librte_reorder_rte_reorder.c.o
[393/2621] Generating pdump.sym_chk with a meson_exe.py custom command
[394/2621] Compiling C object lib/librte_stack.a.p/librte_stack_rte_stack_lf.c.o
[395/2621] Generating regexdev.sym_chk with a meson_exe.py custom command
[396/2621] Compiling C object lib/librte_security.a.p/librte_security_rte_security.c.o
[397/2621] Generating symbol file lib/librte_rawdev.so.21.1.p/librte_rawdev.so.21.1.symbols
[398/2621] Generating rib.sym_chk with a meson_exe.py custom command
[399/2621] Compiling C object lib/librte_sched.a.p/librte_sched_rte_sched.c.o
[400/2621] Compiling C object drivers/libtmp_rte_crypto_caam_jr.a.p/crypto_caam_jr_caam_jr.c.o
ninja: build stopped




*Build Failed #17:
OS: UB2010-64
Target: x86_64-native-linuxapp-gcc
FAILED: lib/power.sym_chk 
/usr/local/bin/meson --internal exe --capture lib/power.sym_chk -- /root/UB2010-64_K5.8.0_GCC10.2.0/x86_64-native-linuxapp-gcc/1552e3615b724f8391b91a39c67f2e97/dpdk/buildtools/check-symbols.sh /root/UB2010-64_K5.8.0_GCC10.2.0/x86_64-native-linuxapp-gcc/1552e3615b724f8391b91a39c67f2e97/dpdk/lib/librte_power/version.map lib/librte_power.a
rte_power_guest_channel_send_msg is flagged as experimental
but is not listed in version map
Please add rte_power_guest_channel_send_msg to the version map
[397/2814] Linking static target lib/librte_reorder.a.
[398/2814] Generating rte_stack_mingw with a custom command.
[399/2814] Generating rte_stack_def with a custom command.
[400/2814] Compiling C object 'lib/76b5a35@@rte_stack@sta/librte_stack_rte_stack_lf.c.o'.
[401/2814] Compiling C object 'lib/76b5a35@@rte_rib@sta/librte_rib_rte_rib6.c.o'.
[402/2814] Compiling C object 'lib/76b5a35@@rte_vhost@sta/librte_vhost_fd_man.c.o'.
[403/2814] Generating symbol file 'lib/76b5a35@@rte_rawdev@sha/librte_rawdev.so.21.1.symbols'.
[404/2814] Compiling C object 'lib/76b5a35@@rte_security@sta/librte_security_rte_security.c.o'.
[405/2814] Compiling C object 'lib/76b5a35@@rte_sched@sta/librte_sched_rte_sched.c.o'.
ninja: build stopped


DPDK STV team

^ permalink raw reply	[flat|nested] only message in thread

only message in thread, other threads:[~2021-01-20 16:01 UTC | newest]

Thread overview: (only message) (download: mbox.gz / follow: Atom feed)
-- links below jump to the message on this page --
2021-01-20 16:01 [dpdk-test-report] |FAILURE| pw(86987) [v3, 6/6] power: clean up includes sys_stv

automatic DPDK test reports

This inbox may be cloned and mirrored by anyone:

	git clone --mirror https://inbox.dpdk.org/test-report/0 test-report/git/0.git

	# If you have public-inbox 1.1+ installed, you may
	# initialize and index your mirror using the following commands:
	public-inbox-init -V2 test-report test-report/ https://inbox.dpdk.org/test-report \
		test-report@dpdk.org
	public-inbox-index test-report

Example config snippet for mirrors.
Newsgroup available over NNTP:
	nntp://inbox.dpdk.org/inbox.dpdk.test-report


AGPL code for this site: git clone https://public-inbox.org/public-inbox.git