automatic DPDK test reports
 help / color / mirror / Atom feed
* [dpdk-test-report] |FAILURE| pw(86270) [v8, 2/2] examples/vhost: refactor vhost data path
@ 2021-01-12  6:22 sys_stv
  0 siblings, 0 replies; only message in thread
From: sys_stv @ 2021-01-12  6:22 UTC (permalink / raw)
  To: test-report

[-- Attachment #1: Type: text/plain, Size: 17436 bytes --]


Test-Label: Intel-compilation
Test-Status: FAILURE
http://dpdk.org/patch/86270

_Compilation issues_

Submitter: Cheng Jiang <Cheng1.jiang@intel.com>
Date: 2021-01-11 05:52:52
Reply_mail: 20210111055252.35672-3-Cheng1.jiang@intel.com

DPDK git baseline: Repo:dpdk-next-virtio, CommitID: 44001b830b285daaae4f343cfa97e96c04f403b8


Meson Build Summary: 22 Builds Done, 20 Successful, 2 Failures, 0 Blocked

+------------------+------------+--------------+------------+------------+-----------+----------+
| os               | gcc-static | clang-static | icc-static | gcc-shared | gcc-debug | document |
+------------------+------------+--------------+------------+------------+-----------+----------+
| UB2004-64        | pass       | pass         | FAIL       |            |           | pass     |
| RHEL83-64        | pass       |              |            |            |           |          |
| FC33-64          | pass       | pass         |            |            |           |          |
| CentOsStream8-64 | pass       |              |            |            |           |          |
| UB2010-64        | pass       |              |            |            |           |          |
| WIN10-64         |            | pass         |            |            |           |          |
| UB2004-32        | pass       |              |            |            |           |          |
| CENTOS83-64      | pass       | pass         | FAIL       | pass       | pass      |          |
| FreeBSD1201-64   | pass       | pass         |            | pass       | pass      |          |
| SUSE15-64        | pass       | pass         |            |            |           |          |
+------------------+------------+--------------+------------+------------+-----------+----------+
Test environment and configuration as below:


OS: UB2004-64
	Kernel Version: 5.6.0-050600-generic
	CPU info: Intel(R) Xeon(R) Platinum 8180 CPU @ 2.50GHz
	GCC Version: gcc (Ubuntu 10-20200416-0ubuntu1) 10.0.1 20200416 (experimental) [master revision 3c3f12e2a76:dcee354ce56:44b326839d864fc10c459916abcc97f35a9ac3de]
	Clang Version: 10.0.0-4ubuntu1
	x86_64-native-linuxapp-clang
	x86_64-native-linuxapp-gcc
	x86_64-native-linuxapp-icc
	x86_64-native-linuxapp-doc

OS: RHEL83-64
	Kernel Version: 4.18.0-240.el8.x86_64
	CPU info: Intel(R) Xeon(R) CPU E5-2699 v4 @ 2.20GHz
	GCC Version: gcc (GCC) 8.3.1 20191121 (Red Hat 8.3.1-5)
	Clang Version: 10.0.1 (Red Hat 10.0.1-1.module+el8.3.0+7459+90c24896)
	x86_64-native-linuxapp-gcc

OS: FC33-64
	Kernel Version: 5.8.16-300.fc33.x86_64
	CPU info: Intel(R) Xeon(R) CPU E5-2699 v4 @ 2.20GHz
	GCC Version: gcc (GCC) 10.2.1 20201005 (Red Hat 10.2.1-5)
	Clang Version: 11.0.0 (Fedora 11.0.0-1.fc33)
	x86_64-native-linuxapp-gcc
	x86_64-native-linuxapp-clang

OS: CentOsStream8-64
	Kernel Version: 4.18.0-257.el8.x86_64
	CPU info: Intel(R) Xeon(R) CPU E5-2699 v4 @ 2.20GHz
	GCC Version: gcc (GCC) 8.4.1 20200928 (Red Hat 8.4.1-1)
	Clang Version: 11.0.0 (Red Hat 11.0.0-0.2.rc2.module_el8.4.0+533+50191577)
	x86_64-native-linuxapp-gcc

OS: UB2010-64
	Kernel Version: 5.8.0-25-generic
	CPU info: Intel(R) Xeon(R) CPU E5-2699 v4 @ 2.20GHz
	GCC Version: gcc (Ubuntu 10.2.0-13ubuntu1) 10.2.0
	Clang Version: 11.0.0-2
	x86_64-native-linuxapp-gcc

OS: WIN10-64
	Kernel Version: N/A
	CPU info: N/A
	GCC Version: N/A
	Clang Version: Clang 8.0.0
	x86_64-windows-clang

OS: UB2004-32
	Kernel Version: 5.6.0-050600-generic
	CPU info: Intel(R) Xeon(R) Platinum 8180 CPU @ 2.50GHz
	GCC Version: gcc (Ubuntu 9.3.0-10ubuntu2) 9.3.0
	Clang Version: 10.0.0-4ubuntu1
	i686-native-linuxapp-gcc

OS: CENTOS83-64
	Kernel Version: 4.18.0-240.1.1.el8_3.x86_64
	CPU info: Intel(R) Xeon(R) Platinum 8180 CPU @ 2.50GHz
	GCC Version: gcc (GCC) 8.3.1 20191121 (Red Hat 8.3.1-5)
	Clang Version: 10.0.1 (Red Hat 10.0.1-1.module_el8.3.0+467+cb298d5b)
	x86_64-native-linuxapp-gcc
	x86_64-native-linuxapp-clang
	x86_64-native-linuxapp-icc
	x86_64-native-linuxapp-gcc+shared
	x86_64-native-linuxapp-gcc+debug

OS: FreeBSD1201-64
	Kernel Version: 12.1-RELEASE
	CPU info: Intel(R) Xeon(R) CPU E5-2699 v3 @ 2.30GHz (2294.74-MHz K8-class CPU)
	GCC Version: gcc (FreeBSD Ports Collection) 9.2.0
	Clang Version: 8.0.1 (tags/RELEASE_801/final 366581) (based on LLVM 8.0.1)
	x86_64-native-bsdapp-gcc
	x86_64-native-bsdapp-clang
	x86_64-native-bsdapp-gcc+shared
	x86_64-native-bsdapp-gcc+debug

OS: SUSE15-64
	Kernel Version: 5.3.18-lp152.57-default
	CPU info: Intel(R) Xeon(R) CPU E5-2699 v4 @ 2.20GHz
	GCC Version: gcc (SUSE Linux) 7.5.0
	Clang Version: 9.0.1
	x86_64-native-linuxapp-clang
	x86_64-native-linuxapp-gcc



*Build Failed #1:
OS: CENTOS83-64
Target: x86_64-native-linuxapp-icc
FAILED: examples/dpdk-vhost.p/vhost_main.c.o 
icc -Iexamples/dpdk-vhost.p -Iexamples -I../examples -Iexamples/vhost -I../examples/vhost -I. -I.. -Iconfig -I../config -Ilib/librte_eal/include -I../lib/librte_eal/include -Ilib/librte_eal/linux/include -I../lib/librte_eal/linux/include -Ilib/librte_eal/x86/include -I../lib/librte_eal/x86/include -Ilib/librte_eal/common -I../lib/librte_eal/common -Ilib/librte_eal -I../lib/librte_eal -Ilib/librte_kvargs -I../lib/librte_kvargs -Ilib/librte_metrics -I../lib/librte_metrics -Ilib/librte_telemetry -I../lib/librte_telemetry -Ilib/librte_mempool -I../lib/librte_mempool -Ilib/librte_ring -I../lib/librte_ring -Ilib/librte_net -I../lib/librte_net -Ilib/librte_mbuf -I../lib/librte_mbuf -Ilib/librte_ethdev -I../lib/librte_ethdev -Ilib/librte_meter -I../lib/librte_meter -Ilib/librte_cmdline -I../lib/librte_cmdline -Ilib/librte_vhost -I../lib/librte_vhost -Ilib/librte_cryptodev -I../lib/librte_cryptodev -Ilib/librte_hash -I../lib/librte_hash -Ilib/librte_rcu -I../lib/librte_rcu -Ilib/librte_pci -I../lib/librte_pci -Idrivers/raw/ioat -I../drivers/raw/ioat -Ilib/librte_rawdev -I../lib/librte_rawdev -Idrivers/bus/pci -I../drivers/bus/pci -I../drivers/bus/pci/linux -Idrivers/bus/vdev -I../drivers/bus/vdev -pipe -D_FILE_OFFSET_BITS=64 -Wall -w3 -diag-disable:remark -Werror -O3 -include rte_config.h -Wextra -Wcast-qual -Wdeprecated -Wformat -Wformat-security -Wmissing-declarations -Wmissing-prototypes -Wold-style-definition -Wpointer-arith -Wsign-compare -Wstrict-prototypes -Wundef -Wwrite-strings -Wno-missing-field-initializers -diag-disable=181 -diag-disable=188 -diag-disable=2203 -diag-disable=2279 -diag-disable=2557 -diag-disable=3179 -diag-disable=3656 -D_GNU_SOURCE -march=native -DALLOW_EXPERIMENTAL_API -MD -MQ examples/dpdk-vhost.p/vhost_main.c.o -MF examples/dpdk-vhost.p/vhost_main.c.o.d -o examples/dpdk-vhost.p/vhost_main.c.o -c ../examples/vhost/main.c
../examples/vhost/main.c(836): error #2330: argument of type "atomic_int_least16_t={_Atomic(short)} *" is incompatible with parameter of type "volatile void *" (dropping qualifiers)
  		atomic_fetch_sub(&vdev->nr_async_pkts, complete_count);
  		^

../examples/vhost/main.c(854): error #2330: argument of type "atomic_int_least64_t={_Atomic(long)} *" is incompatible with parameter of type "volatile void *" (dropping qualifiers)
  		atomic_fetch_add(&dst_vdev->stats.rx_total_atomic, 1);
  		^

../examples/vhost/main.c(855): error #2330: argument of type "atomic_int_least64_t={_Atomic(long)} *" is incompatible with parameter of type "volatile void *" (dropping qualifiers)
  		atomic_fetch_add(&dst_vdev->stats.rx_atomic, ret);
  		^

../examples/vhost/main.c(879): error #2330: argument of type "atomic_int_least16_t={_Atomic(short)} *" is incompatible with parameter of type "volatile void *" (dropping qualifiers)
  		atomic_fetch_add(&vdev->nr_async_pkts, ret - cpu_cpl_nr);
  		^

../examples/vhost/main.c(893): error #2330: argument of type "atomic_int_least64_t={_Atomic(long)} *" is incompatible with parameter of type "volatile void *" (dropping qualifiers)
  		atomic_fetch_add(&vdev->stats.rx_total_atomic, nr_xmit);
  		^

../examples/vhost/main.c(894): error #2330: argument of type "atomic_int_least64_t={_Atomic(long)} *" is incompatible with parameter of type "volatile void *" (dropping qualifiers)
  		atomic_fetch_add(&vdev->stats.rx_atomic, ret);
  		^

../examples/vhost/main.c(1208): error #2330: argument of type "atomic_int_least16_t={_Atomic(short)} *" is incompatible with parameter of type "volatile void *" (dropping qualifiers)
  		atomic_fetch_add(&vdev->nr_async_pkts,
  		^

../examples/vhost/main.c(1223): error #2330: argument of type "atomic_int_least64_t={_Atomic(long)} *" is incompatible with parameter of type "volatile void *" (dropping qualifiers)
  		atomic_fetch_add(&vdev->stats.rx_total_atomic, rx_count);
  		^

../examples/vhost/main.c(1224): error #2330: argument of type "atomic_int_least64_t={_Atomic(long)} *" is incompatible with parameter of type "volatile void *" (dropping qualifiers)
  		atomic_fetch_add(&vdev->stats.rx_atomic, enqueue_count);
  		^

../examples/vhost/main.c(1504): error #2330: argument of type "atomic_int_least64_t={_Atomic(long)} *" is incompatible with parameter of type "const volatile void *" (dropping qualifiers)
  			rx_total   = atomic_load(&vdev->stats.rx_total_atomic);
  			             ^

../examples/vhost/main.c(1505): error #2330: argument of type "atomic_int_least64_t={_Atomic(long)} *" is incompatible with parameter of type "const volatile void *" (dropping qualifiers)
  			rx         = atomic_load(&vdev->stats.rx_atomic);
  			             ^

compilation aborted for ../examples/vhost/main.c (code 2)
[2715/2803] Compiling C object examples/dpdk-timer.p/timer_main.c.o
[2716/2803] Compiling C object examples/dpdk-vhost_blk.p/vhost_blk_vhost_blk.c.o
[2717/2803] Compiling C object examples/dpdk-efd_server.p/server_node_efd_server_init.c.o
[2718/2803] Compiling C object examples/dpdk-vhost.p/vhost_virtio_net.c.o
[2719/2803] Compiling C object examples/dpdk-vmdq.p/vmdq_main.c.o
[2720/2803] Compiling C object examples/dpdk-vmdq_dcb.p/vmdq_dcb_main.c.o
[2721/2803] Compiling C object app/test/dpdk-test.p/test_ring.c.o
[2722/2803] Compiling C object app/test/dpdk-test.p/test_ring_perf.c.o
[2723/2803] Compiling C object app/test/dpdk-test.p/test_memcpy_perf.c.o
[2724/2803] Compiling C object drivers/libtmp_rte_event_octeontx2.a.p/event_octeontx2_otx2_worker.c.o
[2725/2803] Compiling C object drivers/libtmp_rte_event_octeontx2.a.p/event_octeontx2_otx2_worker_dual.c.o
ninja: build stopped




*Build Failed #2:
OS: UB2004-64
Target: x86_64-native-linuxapp-icc
FAILED: examples/dpdk-vhost.p/vhost_main.c.o 
icc -Iexamples/dpdk-vhost.p -Iexamples -I../examples -Iexamples/vhost -I../examples/vhost -I. -I.. -Iconfig -I../config -Ilib/librte_eal/include -I../lib/librte_eal/include -Ilib/librte_eal/linux/include -I../lib/librte_eal/linux/include -Ilib/librte_eal/x86/include -I../lib/librte_eal/x86/include -Ilib/librte_eal/common -I../lib/librte_eal/common -Ilib/librte_eal -I../lib/librte_eal -Ilib/librte_kvargs -I../lib/librte_kvargs -Ilib/librte_metrics -I../lib/librte_metrics -Ilib/librte_telemetry -I../lib/librte_telemetry -Ilib/librte_mempool -I../lib/librte_mempool -Ilib/librte_ring -I../lib/librte_ring -Ilib/librte_net -I../lib/librte_net -Ilib/librte_mbuf -I../lib/librte_mbuf -Ilib/librte_ethdev -I../lib/librte_ethdev -Ilib/librte_meter -I../lib/librte_meter -Ilib/librte_cmdline -I../lib/librte_cmdline -Ilib/librte_vhost -I../lib/librte_vhost -Ilib/librte_cryptodev -I../lib/librte_cryptodev -Ilib/librte_hash -I../lib/librte_hash -Ilib/librte_rcu -I../lib/librte_rcu -Ilib/librte_pci -I../lib/librte_pci -Idrivers/raw/ioat -I../drivers/raw/ioat -Ilib/librte_rawdev -I../lib/librte_rawdev -Idrivers/bus/pci -I../drivers/bus/pci -I../drivers/bus/pci/linux -Idrivers/bus/vdev -I../drivers/bus/vdev -pipe -D_FILE_OFFSET_BITS=64 -Wall -w3 -diag-disable:remark -Werror -O3 -include rte_config.h -Wextra -Wcast-qual -Wdeprecated -Wformat -Wformat-security -Wmissing-declarations -Wmissing-prototypes -Wold-style-definition -Wpointer-arith -Wsign-compare -Wstrict-prototypes -Wundef -Wwrite-strings -Wno-missing-field-initializers -diag-disable=181 -diag-disable=188 -diag-disable=2203 -diag-disable=2279 -diag-disable=2557 -diag-disable=3179 -diag-disable=3656 -D_GNU_SOURCE -march=native -DALLOW_EXPERIMENTAL_API -MD -MQ examples/dpdk-vhost.p/vhost_main.c.o -MF examples/dpdk-vhost.p/vhost_main.c.o.d -o examples/dpdk-vhost.p/vhost_main.c.o -c ../examples/vhost/main.c
../examples/vhost/main.c(836): error #2330: argument of type "atomic_int_least16_t={_Atomic(short)} *" is incompatible with parameter of type "volatile void *" (dropping qualifiers)
  		atomic_fetch_sub(&vdev->nr_async_pkts, complete_count);
  		^

../examples/vhost/main.c(854): error #2330: argument of type "atomic_int_least64_t={_Atomic(long)} *" is incompatible with parameter of type "volatile void *" (dropping qualifiers)
  		atomic_fetch_add(&dst_vdev->stats.rx_total_atomic, 1);
  		^

../examples/vhost/main.c(855): error #2330: argument of type "atomic_int_least64_t={_Atomic(long)} *" is incompatible with parameter of type "volatile void *" (dropping qualifiers)
  		atomic_fetch_add(&dst_vdev->stats.rx_atomic, ret);
  		^

../examples/vhost/main.c(879): error #2330: argument of type "atomic_int_least16_t={_Atomic(short)} *" is incompatible with parameter of type "volatile void *" (dropping qualifiers)
  		atomic_fetch_add(&vdev->nr_async_pkts, ret - cpu_cpl_nr);
  		^

../examples/vhost/main.c(893): error #2330: argument of type "atomic_int_least64_t={_Atomic(long)} *" is incompatible with parameter of type "volatile void *" (dropping qualifiers)
  		atomic_fetch_add(&vdev->stats.rx_total_atomic, nr_xmit);
  		^

../examples/vhost/main.c(894): error #2330: argument of type "atomic_int_least64_t={_Atomic(long)} *" is incompatible with parameter of type "volatile void *" (dropping qualifiers)
  		atomic_fetch_add(&vdev->stats.rx_atomic, ret);
  		^

../examples/vhost/main.c(1208): error #2330: argument of type "atomic_int_least16_t={_Atomic(short)} *" is incompatible with parameter of type "volatile void *" (dropping qualifiers)
  		atomic_fetch_add(&vdev->nr_async_pkts,
  		^

../examples/vhost/main.c(1223): error #2330: argument of type "atomic_int_least64_t={_Atomic(long)} *" is incompatible with parameter of type "volatile void *" (dropping qualifiers)
  		atomic_fetch_add(&vdev->stats.rx_total_atomic, rx_count);
  		^

../examples/vhost/main.c(1224): error #2330: argument of type "atomic_int_least64_t={_Atomic(long)} *" is incompatible with parameter of type "volatile void *" (dropping qualifiers)
  		atomic_fetch_add(&vdev->stats.rx_atomic, enqueue_count);
  		^

../examples/vhost/main.c(1504): error #2330: argument of type "atomic_int_least64_t={_Atomic(long)} *" is incompatible with parameter of type "const volatile void *" (dropping qualifiers)
  			rx_total   = atomic_load(&vdev->stats.rx_total_atomic);
  			             ^

../examples/vhost/main.c(1505): error #2330: argument of type "atomic_int_least64_t={_Atomic(long)} *" is incompatible with parameter of type "const volatile void *" (dropping qualifiers)
  			rx         = atomic_load(&vdev->stats.rx_atomic);
  			             ^

compilation aborted for ../examples/vhost/main.c (code 2)
[2671/2753] Compiling C object examples/dpdk-vhost.p/vhost_virtio_net.c.o
[2672/2753] Compiling C object examples/dpdk-efd_server.p/server_node_efd_server_main.c.o
[2673/2753] Compiling C object examples/dpdk-vhost.p/vhost_ioat.c.o
In file included from ../drivers/raw/ioat/rte_ioat_rawdev.h(169),
                 from ../examples/vhost/ioat.c(8):
../drivers/raw/ioat/rte_ioat_rawdev_fns.h(254): warning #300: const variable "null_hdl" requires an initializer
  	static const uintptr_t null_hdl;
  	                               ^

In file included from ../drivers/raw/ioat/rte_ioat_rawdev.h(169),
                 from ../examples/vhost/ioat.c(8):
../drivers/raw/ioat/rte_ioat_rawdev_fns.h(450): warning #300: const variable "null_hdl" requires an initializer
  	static const struct rte_idxd_user_hdl null_hdl;
  	                                              ^

[2674/2753] Compiling C object examples/dpdk-vmdq_dcb.p/vmdq_dcb_main.c.o
[2675/2753] Generating rte_kni with a custom command
make: Entering directory '/usr/src/linux-headers-5.6.0-050600-generic'
  CC [M]  /root/UB2004-64_K5.4.0_ICC19.1.0/x86_64-native-linuxapp-icc/e0dba9adb683410782869170cbde3e34/dpdk/x86_64-native-linuxapp-icc/kernel/linux/kni/kni_net.o
  CC [M]  /root/UB2004-64_K5.4.0_ICC19.1.0/x86_64-native-linuxapp-icc/e0dba9adb683410782869170cbde3e34/dpdk/x86_64-native-linuxapp-icc/kernel/linux/kni/kni_misc.o
  LD [M]  /root/UB2004-64_K5.4.0_ICC19.1.0/x86_64-native-linuxapp-icc/e0dba9adb683410782869170cbde3e34/dpdk/x86_64-native-linuxapp-icc/kernel/linux/kni/rte_kni.o
  MODPOST 1 modules
  CC [M]  /root/UB2004-64_K5.4.0_ICC19.1.0/x86_64-native-linuxapp-icc/e0dba9adb683410782869170cbde3e34/dpdk/x86_64-native-linuxapp-icc/kernel/linux/kni/rte_kni.mod.o
  LD [M]  /root/UB2004-64_K5.4.0_ICC19.1.0/x86_64-native-linuxapp-icc/e0dba9adb683410782869170cbde3e34/dpdk/x86_64-native-linuxapp-icc/kernel/linux/kni/rte_kni.ko
make: Leaving directory '/usr/src/linux-headers-5.6.0-050600-generic'
[2676/2753] Compiling C object app/test/dpdk-test.p/test_ring_perf.c.o
[2677/2753] Compiling C object app/test/dpdk-test.p/test_memcpy_perf.c.o
[2678/2753] Compiling C object drivers/libtmp_rte_event_octeontx2.a.p/event_octeontx2_otx2_worker.c.o
[2679/2753] Compiling C object drivers/libtmp_rte_event_octeontx2.a.p/event_octeontx2_otx2_worker_dual.c.o
ninja: build stopped


DPDK STV team

^ permalink raw reply	[flat|nested] only message in thread

only message in thread, other threads:[~2021-01-12  6:22 UTC | newest]

Thread overview: (only message) (download: mbox.gz / follow: Atom feed)
-- links below jump to the message on this page --
2021-01-12  6:22 [dpdk-test-report] |FAILURE| pw(86270) [v8, 2/2] examples/vhost: refactor vhost data path sys_stv

automatic DPDK test reports

This inbox may be cloned and mirrored by anyone:

	git clone --mirror https://inbox.dpdk.org/test-report/0 test-report/git/0.git

	# If you have public-inbox 1.1+ installed, you may
	# initialize and index your mirror using the following commands:
	public-inbox-init -V2 test-report test-report/ https://inbox.dpdk.org/test-report \
		test-report@dpdk.org
	public-inbox-index test-report

Example config snippet for mirrors.
Newsgroup available over NNTP:
	nntp://inbox.dpdk.org/inbox.dpdk.test-report


AGPL code for this site: git clone https://public-inbox.org/public-inbox.git