automatic DPDK test reports
 help / color / mirror / Atom feed
* [dpdk-test-report] |FAILURE| pw(88037) [7/7] eventdev: fix ABI breakage due to event vector
@ 2021-02-20 22:44 sys_stv
  0 siblings, 0 replies; only message in thread
From: sys_stv @ 2021-02-20 22:44 UTC (permalink / raw)
  To: test-report

[-- Attachment #1: Type: text/plain, Size: 24463 bytes --]


Test-Label: Intel-compilation
Test-Status: FAILURE
http://dpdk.org/patch/88037

_Compilation issues_

Submitter: Pavan Nikhilesh Bhagavatula <pbhagavatula@marvell.com>
Date: 2021-02-20 22:09:56
Reply_mail: 20210220220957.4583-8-pbhagavatula@marvell.com

DPDK git baseline: Repo:dpdk-next-eventdev, CommitID: b982f0ef3f58e8381fa473c2636ea4725b505f5a


Meson Build Summary: 22 Builds Done, 15 Successful, 7 Failures, 0 Blocked

+------------------+------------+--------------+------------+------------+-----------+----------+
| os               | gcc-static | clang-static | icc-static | gcc-shared | gcc-debug | document |
+------------------+------------+--------------+------------+------------+-----------+----------+
| UB2004-64        | pass       | FAIL         | pass       |            |           | FAIL     |
| RHEL83-64        | pass       |              |            |            |           |          |
| FC33-64          | pass       | FAIL         |            |            |           |          |
| CentOsStream8-64 | pass       |              |            |            |           |          |
| UB2010-64        | pass       |              |            |            |           |          |
| WIN10-64         |            | pass         |            |            |           |          |
| UB2004-32        | FAIL       |              |            |            |           |          |
| CENTOS83-64      | pass       | FAIL         | pass       | pass       | pass      |          |
| FreeBSD1201-64   | pass       | FAIL         |            | pass       | pass      |          |
| SUSE15-64        | pass       | FAIL         |            |            |           |          |
+------------------+------------+--------------+------------+------------+-----------+----------+
Test environment and configuration as below:


OS: UB2004-64
	Kernel Version: 5.6.0-050600-generic
	GCC Version: gcc (Ubuntu 10-20200416-0ubuntu1) 10.0.1 20200416 (experimental) [master revision 3c3f12e2a76:dcee354ce56:44b326839d864fc10c459916abcc97f35a9ac3de]
	Clang Version: 10.0.0-4ubuntu1
	x86_64-native-linuxapp-clang
	x86_64-native-linuxapp-gcc
	x86_64-native-linuxapp-icc
	x86_64-native-linuxapp-doc

OS: RHEL83-64
	Kernel Version: 4.18.0-240.el8.x86_64
	GCC Version: gcc (GCC) 8.3.1 20191121 (Red Hat 8.3.1-5)
	Clang Version: 10.0.1 (Red Hat 10.0.1-1.module+el8.3.0+7459+90c24896)
	x86_64-native-linuxapp-gcc

OS: FC33-64
	Kernel Version: 5.8.16-300.fc33.x86_64
	GCC Version: gcc (GCC) 10.2.1 20201005 (Red Hat 10.2.1-5)
	Clang Version: 11.0.0 (Fedora 11.0.0-1.fc33)
	x86_64-native-linuxapp-gcc
	x86_64-native-linuxapp-clang

OS: CentOsStream8-64
	Kernel Version: 4.18.0-257.el8.x86_64
	GCC Version: gcc (GCC) 8.4.1 20200928 (Red Hat 8.4.1-1)
	Clang Version: 11.0.0 (Red Hat 11.0.0-0.2.rc2.module_el8.4.0+533+50191577)
	x86_64-native-linuxapp-gcc

OS: UB2010-64
	Kernel Version: 5.8.0-25-generic
	GCC Version: gcc (Ubuntu 10.2.0-13ubuntu1) 10.2.0
	Clang Version: 11.0.0-2
	x86_64-native-linuxapp-gcc

OS: WIN10-64
	Kernel Version: N/A
	GCC Version: N/A
	Clang Version: Clang 8.0.0
	x86_64-windows-clang

OS: UB2004-32
	Kernel Version: 5.6.0-050600-generic
	GCC Version: gcc (Ubuntu 9.3.0-10ubuntu2) 9.3.0
	Clang Version: 10.0.0-4ubuntu1
	i686-native-linuxapp-gcc

OS: CENTOS83-64
	Kernel Version: 4.18.0-240.1.1.el8_3.x86_64
	GCC Version: gcc (GCC) 8.3.1 20191121 (Red Hat 8.3.1-5)
	Clang Version: 10.0.1 (Red Hat 10.0.1-1.module_el8.3.0+467+cb298d5b)
	x86_64-native-linuxapp-gcc
	x86_64-native-linuxapp-clang
	x86_64-native-linuxapp-icc
	x86_64-native-linuxapp-gcc+shared
	x86_64-native-linuxapp-gcc+debug

OS: FreeBSD1201-64
	Kernel Version: 12.1-RELEASE
	GCC Version: gcc (FreeBSD Ports Collection) 9.2.0
	Clang Version: 8.0.1 (tags/RELEASE_801/final 366581) (based on LLVM 8.0.1)
	x86_64-native-bsdapp-gcc
	x86_64-native-bsdapp-clang
	x86_64-native-bsdapp-gcc+shared
	x86_64-native-bsdapp-gcc+debug

OS: SUSE15-64
	Kernel Version: 5.3.18-lp152.57-default
	GCC Version: gcc (SUSE Linux) 7.5.0
	Clang Version: 9.0.1
	x86_64-native-linuxapp-clang
	x86_64-native-linuxapp-gcc



*Build Failed #1:
OS: CENTOS83-64
Target: x86_64-native-linuxapp-clang
FAILED: lib/librte_eventdev.a.p/librte_eventdev_rte_event_eth_tx_adapter.c.o 
clang -Ilib/librte_eventdev.a.p -Ilib -I../lib -Ilib/librte_eventdev -I../lib/librte_eventdev -I. -I.. -Iconfig -I../config -Ilib/librte_eal/include -I../lib/librte_eal/include -Ilib/librte_eal/linux/include -I../lib/librte_eal/linux/include -Ilib/librte_eal/x86/include -I../lib/librte_eal/x86/include -Ilib/librte_eal/common -I../lib/librte_eal/common -Ilib/librte_eal -I../lib/librte_eal -Ilib/librte_kvargs -I../lib/librte_kvargs -Ilib/librte_metrics -I../lib/librte_metrics -Ilib/librte_telemetry -I../lib/librte_telemetry -Ilib/librte_ring -I../lib/librte_ring -Ilib/librte_ethdev -I../lib/librte_ethdev -Ilib/librte_net -I../lib/librte_net -Ilib/librte_mbuf -I../lib/librte_mbuf -Ilib/librte_mempool -I../lib/librte_mempool -Ilib/librte_meter -I../lib/librte_meter -Ilib/librte_hash -I../lib/librte_hash -Ilib/librte_rcu -I../lib/librte_rcu -Ilib/librte_timer -I../lib/librte_timer -Ilib/librte_cryptodev -I../lib/librte_cryptodev -Xclang -fcolor-diagnostics -pipe -D_FILE_OFFSET_BITS=64 -Wall -Winvalid-pch -Werror -O3 -include rte_config.h -Wextra -Wcast-qual -Wdeprecated -Wformat -Wformat-nonliteral -Wformat-security -Wmissing-declarations -Wmissing-prototypes -Wnested-externs -Wold-style-definition -Wpointer-arith -Wsign-compare -Wstrict-prototypes -Wundef -Wwrite-strings -Wno-address-of-packed-member -Wno-missing-field-initializers -D_GNU_SOURCE -fPIC -march=native -DALLOW_EXPERIMENTAL_API -DALLOW_INTERNAL_API -DLINUX -MD -MQ lib/librte_eventdev.a.p/librte_eventdev_rte_event_eth_tx_adapter.c.o -MF lib/librte_eventdev.a.p/librte_eventdev_rte_event_eth_tx_adapter.c.o.d -o lib/librte_eventdev.a.p/librte_eventdev_rte_event_eth_tx_adapter.c.o -c ../lib/librte_eventdev/rte_event_eth_tx_adapter.c
../lib/librte_eventdev/rte_event_eth_tx_adapter.c:533:4: error: variable 'nb_tx' is uninitialized when used here [-Werror,-Wuninitialized]
                        nb_tx += rte_eth_tx_buffer(port, queue, tqi->tx_buf,
                        ^~~~~
../lib/librte_eventdev/rte_event_eth_tx_adapter.c:518:29: note: initialize the variable 'nb_tx' to silence this warning
        uint16_t port, queue, nb_tx;
                                   ^
                                    = 0
1 error generated.
[295/2829] Compiling C object lib/librte_gso.a.p/librte_gso_gso_common.c.o
[296/2829] Compiling C object lib/librte_gso.a.p/librte_gso_gso_tunnel_tcp4.c.o
[297/2829] Compiling C object lib/librte_gso.a.p/librte_gso_gso_tunnel_udp4.c.o
[298/2829] Compiling C object lib/librte_ip_frag.a.p/librte_ip_frag_rte_ipv6_reassembly.c.o
[299/2829] Compiling C object lib/librte_ip_frag.a.p/librte_ip_frag_rte_ipv6_fragmentation.c.o
[300/2829] Compiling C object lib/librte_gso.a.p/librte_gso_rte_gso.c.o
[301/2829] Compiling C object lib/librte_ip_frag.a.p/librte_ip_frag_rte_ip_frag_common.c.o
[302/2829] Compiling C object lib/librte_ip_frag.a.p/librte_ip_frag_rte_ipv4_reassembly.c.o
[303/2829] Compiling C object lib/librte_ip_frag.a.p/librte_ip_frag_rte_ipv4_fragmentation.c.o
ninja: build stopped




*Build Failed #2:
OS: FC33-64
Target: x86_64-native-linuxapp-clang
FAILED: lib/librte_eventdev.a.p/librte_eventdev_rte_event_eth_tx_adapter.c.o 
clang -Ilib/librte_eventdev.a.p -Ilib -I../lib -Ilib/librte_eventdev -I../lib/librte_eventdev -I. -I.. -Iconfig -I../config -Ilib/librte_eal/include -I../lib/librte_eal/include -Ilib/librte_eal/linux/include -I../lib/librte_eal/linux/include -Ilib/librte_eal/x86/include -I../lib/librte_eal/x86/include -Ilib/librte_eal/common -I../lib/librte_eal/common -Ilib/librte_eal -I../lib/librte_eal -Ilib/librte_kvargs -I../lib/librte_kvargs -Ilib/librte_metrics -I../lib/librte_metrics -Ilib/librte_telemetry -I../lib/librte_telemetry -Ilib/librte_ring -I../lib/librte_ring -Ilib/librte_ethdev -I../lib/librte_ethdev -Ilib/librte_net -I../lib/librte_net -Ilib/librte_mbuf -I../lib/librte_mbuf -Ilib/librte_mempool -I../lib/librte_mempool -Ilib/librte_meter -I../lib/librte_meter -Ilib/librte_hash -I../lib/librte_hash -Ilib/librte_rcu -I../lib/librte_rcu -Ilib/librte_timer -I../lib/librte_timer -Ilib/librte_cryptodev -I../lib/librte_cryptodev -Xclang -fcolor-diagnostics -pipe -D_FILE_OFFSET_BITS=64 -Wall -Winvalid-pch -Werror -O3 -include rte_config.h -Wextra -Wcast-qual -Wdeprecated -Wformat -Wformat-nonliteral -Wformat-security -Wmissing-declarations -Wmissing-prototypes -Wnested-externs -Wold-style-definition -Wpointer-arith -Wsign-compare -Wstrict-prototypes -Wundef -Wwrite-strings -Wno-address-of-packed-member -Wno-missing-field-initializers -D_GNU_SOURCE -fPIC -march=native -DALLOW_EXPERIMENTAL_API -DALLOW_INTERNAL_API -DLINUX -MD -MQ lib/librte_eventdev.a.p/librte_eventdev_rte_event_eth_tx_adapter.c.o -MF lib/librte_eventdev.a.p/librte_eventdev_rte_event_eth_tx_adapter.c.o.d -o lib/librte_eventdev.a.p/librte_eventdev_rte_event_eth_tx_adapter.c.o -c ../lib/librte_eventdev/rte_event_eth_tx_adapter.c
../lib/librte_eventdev/rte_event_eth_tx_adapter.c:533:4: error: variable 'nb_tx' is uninitialized when used here [-Werror,-Wuninitialized]
                        nb_tx += rte_eth_tx_buffer(port, queue, tqi->tx_buf,
                        ^~~~~
../lib/librte_eventdev/rte_event_eth_tx_adapter.c:518:29: note: initialize the variable 'nb_tx' to silence this warning
        uint16_t port, queue, nb_tx;
                                   ^
                                    = 0
1 error generated.
[278/2838] Generating cryptodev.sym_chk with a meson_exe.py custom command
[279/2838] Compiling C object lib/librte_gro.a.p/librte_gro_gro_tcp4.c.o
[280/2838] Compiling C object lib/librte_gro.a.p/librte_gro_gro_vxlan_tcp4.c.o
[281/2838] Compiling C object lib/librte_gso.a.p/librte_gso_gso_udp4.c.o
[282/2838] Compiling C object lib/librte_gro.a.p/librte_gro_rte_gro.c.o
[283/2838] Compiling C object lib/librte_gso.a.p/librte_gso_gso_tcp4.c.o
[284/2838] Compiling C object lib/librte_eventdev.a.p/librte_eventdev_rte_event_eth_rx_adapter.c.o
[285/2838] Compiling C object lib/librte_gro.a.p/librte_gro_gro_udp4.c.o
[286/2838] Compiling C object lib/librte_gso.a.p/librte_gso_gso_common.c.o
ninja: build stopped




*Build Failed #3:
OS: FreeBSD1201-64
Target: x86_64-native-bsdapp-clang
FAILED: lib/librte_eventdev.a.p/librte_eventdev_rte_event_eth_tx_adapter.c.o 
clang -Ilib/librte_eventdev.a.p -Ilib -I../lib -Ilib/librte_eventdev -I../lib/librte_eventdev -I. -I.. -Iconfig -I../config -Ilib/librte_eal/include -I../lib/librte_eal/include -Ilib/librte_eal/freebsd/include -I../lib/librte_eal/freebsd/include -Ilib/librte_eal/x86/include -I../lib/librte_eal/x86/include -Ilib/librte_eal/common -I../lib/librte_eal/common -Ilib/librte_eal -I../lib/librte_eal -Ilib/librte_kvargs -I../lib/librte_kvargs -Ilib/librte_metrics -I../lib/librte_metrics -Ilib/librte_telemetry -I../lib/librte_telemetry -Ilib/librte_ring -I../lib/librte_ring -Ilib/librte_ethdev -I../lib/librte_ethdev -Ilib/librte_net -I../lib/librte_net -Ilib/librte_mbuf -I../lib/librte_mbuf -Ilib/librte_mempool -I../lib/librte_mempool -Ilib/librte_meter -I../lib/librte_meter -Ilib/librte_hash -I../lib/librte_hash -Ilib/librte_rcu -I../lib/librte_rcu -Ilib/librte_timer -I../lib/librte_timer -Ilib/librte_cryptodev -I../lib/librte_cryptodev -Xclang -fcolor-diagnostics -pipe -D_FILE_OFFSET_BITS=64 -Wall -Winvalid-pch -Werror -O3 -include rte_config.h -Wextra -Wcast-qual -Wdeprecated -Wformat -Wformat-nonliteral -Wformat-security -Wmissing-declarations -Wmissing-prototypes -Wnested-externs -Wold-style-definition -Wpointer-arith -Wsign-compare -Wstrict-prototypes -Wundef -Wwrite-strings -Wno-address-of-packed-member -Wno-missing-field-initializers -D_GNU_SOURCE -D__BSD_VISIBLE -fPIC -march=native -mno-avx512f -DALLOW_EXPERIMENTAL_API -DALLOW_INTERNAL_API -DBSD -MD -MQ lib/librte_eventdev.a.p/librte_eventdev_rte_event_eth_tx_adapter.c.o -MF lib/librte_eventdev.a.p/librte_eventdev_rte_event_eth_tx_adapter.c.o.d -o lib/librte_eventdev.a.p/librte_eventdev_rte_event_eth_tx_adapter.c.o -c ../lib/librte_eventdev/rte_event_eth_tx_adapter.c
../lib/librte_eventdev/rte_event_eth_tx_adapter.c:533:4: error: variable 'nb_tx' is uninitialized when used here [-Werror,-Wuninitialized]
                        nb_tx += rte_eth_tx_buffer(port, queue, tqi->tx_buf,
                        ^~~~~
../lib/librte_eventdev/rte_event_eth_tx_adapter.c:518:29: note: initialize the variable 'nb_tx' to silence this warning
        uint16_t port, queue, nb_tx;
                                   ^
                                    = 0
1 error generated.
[263/2049] Compiling C object lib/librte_eventdev.a.p/librte_eventdev_rte_event_timer_adapter.c.o
[264/2049] Linking target lib/librte_efd.so.21.1
[265/2049] Compiling C object lib/librte_eventdev.a.p/librte_eventdev_rte_event_crypto_adapter.c.o
[266/2049] Compiling C object lib/librte_gro.a.p/librte_gro_rte_gro.c.o
[267/2049] Compiling C object lib/librte_eventdev.a.p/librte_eventdev_rte_event_eth_rx_adapter.c.o
ninja: build stopped




*Build Failed #4:
OS: SUSE15-64
Target: x86_64-native-linuxapp-clang
FAILED: lib/librte_eventdev.a.p/librte_eventdev_rte_event_eth_tx_adapter.c.o 
clang -Ilib/librte_eventdev.a.p -Ilib -I../lib -Ilib/librte_eventdev -I../lib/librte_eventdev -I. -I.. -Iconfig -I../config -Ilib/librte_eal/include -I../lib/librte_eal/include -Ilib/librte_eal/linux/include -I../lib/librte_eal/linux/include -Ilib/librte_eal/x86/include -I../lib/librte_eal/x86/include -Ilib/librte_eal/common -I../lib/librte_eal/common -Ilib/librte_eal -I../lib/librte_eal -Ilib/librte_kvargs -I../lib/librte_kvargs -Ilib/librte_metrics -I../lib/librte_metrics -Ilib/librte_telemetry -I../lib/librte_telemetry -Ilib/librte_ring -I../lib/librte_ring -Ilib/librte_ethdev -I../lib/librte_ethdev -Ilib/librte_net -I../lib/librte_net -Ilib/librte_mbuf -I../lib/librte_mbuf -Ilib/librte_mempool -I../lib/librte_mempool -Ilib/librte_meter -I../lib/librte_meter -Ilib/librte_hash -I../lib/librte_hash -Ilib/librte_rcu -I../lib/librte_rcu -Ilib/librte_timer -I../lib/librte_timer -Ilib/librte_cryptodev -I../lib/librte_cryptodev -Xclang -fcolor-diagnostics -pipe -D_FILE_OFFSET_BITS=64 -Wall -Winvalid-pch -Werror -O3 -include rte_config.h -Wextra -Wcast-qual -Wdeprecated -Wformat -Wformat-nonliteral -Wformat-security -Wmissing-declarations -Wmissing-prototypes -Wnested-externs -Wold-style-definition -Wpointer-arith -Wsign-compare -Wstrict-prototypes -Wundef -Wwrite-strings -Wno-address-of-packed-member -Wno-missing-field-initializers -D_GNU_SOURCE -fPIC -march=native -DALLOW_EXPERIMENTAL_API -DALLOW_INTERNAL_API -DLINUX -MD -MQ lib/librte_eventdev.a.p/librte_eventdev_rte_event_eth_tx_adapter.c.o -MF lib/librte_eventdev.a.p/librte_eventdev_rte_event_eth_tx_adapter.c.o.d -o lib/librte_eventdev.a.p/librte_eventdev_rte_event_eth_tx_adapter.c.o -c ../lib/librte_eventdev/rte_event_eth_tx_adapter.c
../lib/librte_eventdev/rte_event_eth_tx_adapter.c:533:4: error: variable 'nb_tx' is uninitialized when used here [-Werror,-Wuninitialized]
                        nb_tx += rte_eth_tx_buffer(port, queue, tqi->tx_buf,
                        ^~~~~
../lib/librte_eventdev/rte_event_eth_tx_adapter.c:518:29: note: initialize the variable 'nb_tx' to silence this warning
        uint16_t port, queue, nb_tx;
                                   ^
                                    = 0
1 error generated.
[270/2732] Generating symbol file lib/librte_cryptodev.so.21.1.p/librte_cryptodev.so.21.1.symbols
[271/2732] Generating efd.sym_chk with a custom command (wrapped by meson to capture output)
[272/2732] Generating ethdev.sym_chk with a custom command (wrapped by meson to capture output)
[273/2732] Compiling C object lib/librte_eventdev.a.p/librte_eventdev_rte_event_timer_adapter.c.o
[274/2732] Compiling C object lib/librte_gro.a.p/librte_gro_gro_tcp4.c.o
[275/2732] Compiling C object lib/librte_gro.a.p/librte_gro_gro_vxlan_tcp4.c.o
[276/2732] Compiling C object lib/librte_gro.a.p/librte_gro_gro_udp4.c.o
[277/2732] Compiling C object lib/librte_eventdev.a.p/librte_eventdev_rte_event_crypto_adapter.c.o
[278/2732] Compiling C object lib/librte_eventdev.a.p/librte_eventdev_rte_event_eth_rx_adapter.c.o
ninja: build stopped




*Build Failed #5:
OS: UB2004-32
Target: i686-native-linuxapp-gcc
FAILED: app/dpdk-test-eventdev.p/test-eventdev_test_pipeline_common.c.o 
gcc -Iapp/dpdk-test-eventdev.p -Iapp -I../app -Ilib/librte_eventdev -I../lib/librte_eventdev -I. -I.. -Iconfig -I../config -Ilib/librte_eal/include -I../lib/librte_eal/include -Ilib/librte_eal/linux/include -I../lib/librte_eal/linux/include -Ilib/librte_eal/x86/include -I../lib/librte_eal/x86/include -Ilib/librte_eal/common -I../lib/librte_eal/common -Ilib/librte_eal -I../lib/librte_eal -Ilib/librte_kvargs -I../lib/librte_kvargs -Ilib/librte_metrics -I../lib/librte_metrics -Ilib/librte_telemetry -I../lib/librte_telemetry -Ilib/librte_ring -I../lib/librte_ring -Ilib/librte_ethdev -I../lib/librte_ethdev -Ilib/librte_net -I../lib/librte_net -Ilib/librte_mbuf -I../lib/librte_mbuf -Ilib/librte_mempool -I../lib/librte_mempool -Ilib/librte_meter -I../lib/librte_meter -Ilib/librte_hash -I../lib/librte_hash -Ilib/librte_rcu -I../lib/librte_rcu -Ilib/librte_timer -I../lib/librte_timer -Ilib/librte_cryptodev -I../lib/librte_cryptodev -fdiagnostics-color=always -pipe -D_FILE_OFFSET_BITS=64 -Wall -Winvalid-pch -Werror -O3 -include rte_config.h -Wextra -Wcast-qual -Wdeprecated -Wformat -Wformat-nonliteral -Wformat-security -Wmissing-declarations -Wmissing-prototypes -Wnested-externs -Wold-style-definition -Wpointer-arith -Wsign-compare -Wstrict-prototypes -Wundef -Wwrite-strings -Wno-address-of-packed-member -Wno-packed-not-aligned -Wno-missing-field-initializers -Wno-pointer-to-int-cast -D_GNU_SOURCE -m32 -march=native -DALLOW_EXPERIMENTAL_API -MD -MQ app/dpdk-test-eventdev.p/test-eventdev_test_pipeline_common.c.o -MF app/dpdk-test-eventdev.p/test-eventdev_test_pipeline_common.c.o.d -o app/dpdk-test-eventdev.p/test-eventdev_test_pipeline_common.c.o -c ../app/test-eventdev/test_pipeline_common.c
In file included from ../app/test-eventdev/test_pipeline_common.h:26,
                 from ../app/test-eventdev/test_pipeline_common.c:6:
../app/test-eventdev/test_pipeline_common.c: In function ‘pipeline_opt_dump’:
../app/test-eventdev/evt_common.h:27:9: error: format ‘%ld’ expects argument of type ‘long int’, but argument 4 has type ‘uint64_t’ {aka ‘long long unsigned int’} [-Werror=format=]
   27 |  printf("\t%-*s : "fmt"\n", EVT_STR_FMT, str, ## val)
      |         ^~~~~~~~~~~
../app/test-eventdev/test_pipeline_common.c:43:3: note: in expansion of macro ‘evt_dump’
   43 |   evt_dump("vector_tmo_ns", "%ld", opt->vector_tmo_nsec);
      |   ^~~~~~~~
../app/test-eventdev/test_pipeline_common.c:43:32: note: format string is defined here
   43 |   evt_dump("vector_tmo_ns", "%ld", opt->vector_tmo_nsec);
      |                              ~~^
      |                                |
      |                                long int
      |                              %lld
cc1: all warnings being treated as errors
[2006/2371] Compiling C object app/dpdk-test-flow-perf.p/test-flow-perf_flow_gen.c.o
[2007/2371] Compiling C object app/dpdk-test-flow-perf.p/test-flow-perf_items_gen.c.o
[2008/2371] Compiling C object app/dpdk-test-eventdev.p/test-eventdev_test_pipeline_atq.c.o
[2009/2371] Compiling C object app/dpdk-test-eventdev.p/test-eventdev_test_pipeline_queue.c.o
[2010/2371] Compiling C object app/dpdk-test-fib.p/test-fib_main.c.o
[2011/2371] Compiling C object app/dpdk-test-flow-perf.p/test-flow-perf_actions_gen.c.o
[2012/2371] Linking target app/dpdk-test-crypto-perf
[2013/2371] Compiling C object app/dpdk-test-flow-perf.p/test-flow-perf_main.c.o
[2014/2371] Compiling C object app/dpdk-test-bbdev.p/test-bbdev_test_bbdev_perf.c.o
ninja: build stopped




*Build Failed #6:
OS: UB2004-64
Target: x86_64-native-linuxapp-clang
FAILED: lib/librte_eventdev.a.p/librte_eventdev_rte_event_eth_tx_adapter.c.o 
clang -Ilib/librte_eventdev.a.p -Ilib -I../lib -Ilib/librte_eventdev -I../lib/librte_eventdev -I. -I.. -Iconfig -I../config -Ilib/librte_eal/include -I../lib/librte_eal/include -Ilib/librte_eal/linux/include -I../lib/librte_eal/linux/include -Ilib/librte_eal/x86/include -I../lib/librte_eal/x86/include -Ilib/librte_eal/common -I../lib/librte_eal/common -Ilib/librte_eal -I../lib/librte_eal -Ilib/librte_kvargs -I../lib/librte_kvargs -Ilib/librte_metrics -I../lib/librte_metrics -Ilib/librte_telemetry -I../lib/librte_telemetry -Ilib/librte_ring -I../lib/librte_ring -Ilib/librte_ethdev -I../lib/librte_ethdev -Ilib/librte_net -I../lib/librte_net -Ilib/librte_mbuf -I../lib/librte_mbuf -Ilib/librte_mempool -I../lib/librte_mempool -Ilib/librte_meter -I../lib/librte_meter -Ilib/librte_hash -I../lib/librte_hash -Ilib/librte_rcu -I../lib/librte_rcu -Ilib/librte_timer -I../lib/librte_timer -Ilib/librte_cryptodev -I../lib/librte_cryptodev -Xclang -fcolor-diagnostics -pipe -D_FILE_OFFSET_BITS=64 -Wall -Winvalid-pch -Werror -O3 -include rte_config.h -Wextra -Wcast-qual -Wdeprecated -Wformat -Wformat-nonliteral -Wformat-security -Wmissing-declarations -Wmissing-prototypes -Wnested-externs -Wold-style-definition -Wpointer-arith -Wsign-compare -Wstrict-prototypes -Wundef -Wwrite-strings -Wno-address-of-packed-member -Wno-missing-field-initializers -D_GNU_SOURCE -fPIC -march=native -DALLOW_EXPERIMENTAL_API -DALLOW_INTERNAL_API -DLINUX -MD -MQ lib/librte_eventdev.a.p/librte_eventdev_rte_event_eth_tx_adapter.c.o -MF lib/librte_eventdev.a.p/librte_eventdev_rte_event_eth_tx_adapter.c.o.d -o lib/librte_eventdev.a.p/librte_eventdev_rte_event_eth_tx_adapter.c.o -c ../lib/librte_eventdev/rte_event_eth_tx_adapter.c
../lib/librte_eventdev/rte_event_eth_tx_adapter.c:533:4: error: variable 'nb_tx' is uninitialized when used here [-Werror,-Wuninitialized]
                        nb_tx += rte_eth_tx_buffer(port, queue, tqi->tx_buf,
                        ^~~~~
../lib/librte_eventdev/rte_event_eth_tx_adapter.c:518:29: note: initialize the variable 'nb_tx' to silence this warning
        uint16_t port, queue, nb_tx;
                                   ^
                                    = 0
1 error generated.
[273/2825] Generating efd.sym_chk with a meson_exe.py custom command
[274/2825] Linking target lib/librte_cryptodev.so.21.1
[275/2825] Linking target lib/librte_bitratestats.so.21.1
[276/2825] Compiling C object lib/librte_eventdev.a.p/librte_eventdev_rte_event_timer_adapter.c.o
[277/2825] Compiling C object lib/librte_gro.a.p/librte_gro_gro_tcp4.c.o
[278/2825] Compiling C object lib/librte_gro.a.p/librte_gro_gro_vxlan_tcp4.c.o
[279/2825] Compiling C object lib/librte_eventdev.a.p/librte_eventdev_rte_event_crypto_adapter.c.o
[280/2825] Compiling C object lib/librte_gro.a.p/librte_gro_gro_udp4.c.o
[281/2825] Compiling C object lib/librte_eventdev.a.p/librte_eventdev_rte_event_eth_rx_adapter.c.o
ninja: build stopped




*Build Failed #7:
OS: UB2004-64
Target: x86_64-native-linuxapp-doc
FAILED: doc/api/html 
/root/UB2004-64_K5.4.0_GCC9.3.0/x86_64-native-linuxapp-doc/67739de5e0b942cc98c191d9e4925aee/dpdk/doc/api/generate_doxygen.sh doc/api/doxy-api.conf doc/api/html /root/UB2004-64_K5.4.0_GCC9.3.0/x86_64-native-linuxapp-doc/67739de5e0b942cc98c191d9e4925aee/dpdk/doc/api/doxy-html-custom.sh
/root/UB2004-64_K5.4.0_GCC9.3.0/x86_64-native-linuxapp-doc/67739de5e0b942cc98c191d9e4925aee/dpdk/lib/librte_eventdev/rte_event_eth_rx_adapter.h:444: error: The following parameter of rte_event_eth_rx_adapter_queue_event_vector_config(uint8_t id, uint16_t eth_dev_id, int32_t rx_queue_id, struct rte_event_eth_rx_adapter_event_vector_config *config) is not documented:
  parameter 'config' (warning treated as error, aborting now)
[2609/2635] Compiling C object app/test/dpdk-test.p/test_ring_perf.c.o
[2610/2635] Compiling C object app/test/dpdk-test.p/test_ring.c.o
[2611/2635] Generating html_guides with a custom command
Install the sphinx ReadTheDocs theme for improved html documentation layout: https://sphinx-rtd-theme.readthedocs.io/
[2612/2635] Compiling C object drivers/libtmp_rte_event_octeontx2.a.p/event_octeontx2_otx2_worker.c.o
[2613/2635] Compiling C object drivers/libtmp_rte_event_octeontx2.a.p/event_octeontx2_otx2_worker_dual.c.o
ninja: build stopped


DPDK STV team

^ permalink raw reply	[flat|nested] only message in thread

only message in thread, other threads:[~2021-02-20 22:45 UTC | newest]

Thread overview: (only message) (download: mbox.gz / follow: Atom feed)
-- links below jump to the message on this page --
2021-02-20 22:44 [dpdk-test-report] |FAILURE| pw(88037) [7/7] eventdev: fix ABI breakage due to event vector sys_stv

automatic DPDK test reports

This inbox may be cloned and mirrored by anyone:

	git clone --mirror https://inbox.dpdk.org/test-report/0 test-report/git/0.git

	# If you have public-inbox 1.1+ installed, you may
	# initialize and index your mirror using the following commands:
	public-inbox-init -V2 test-report test-report/ https://inbox.dpdk.org/test-report \
		test-report@dpdk.org
	public-inbox-index test-report

Example config snippet for mirrors.
Newsgroup available over NNTP:
	nntp://inbox.dpdk.org/inbox.dpdk.test-report


AGPL code for this site: git clone https://public-inbox.org/public-inbox.git