automatic DPDK test reports
 help / color / mirror / Atom feed
* [dpdk-test-report] |FAILURE| pw(88045) [7/7] eal/windows: do not expose POSIX symbols
@ 2021-02-20 23:41 sys_stv
  0 siblings, 0 replies; only message in thread
From: sys_stv @ 2021-02-20 23:41 UTC (permalink / raw)
  To: test-report

[-- Attachment #1: Type: text/plain, Size: 55531 bytes --]


Test-Label: Intel-compilation
Test-Status: FAILURE
http://dpdk.org/patch/88045

_Compilation issues_

Submitter: Dmitry Kozlyuk <dmitry.kozliuk@gmail.com>
Date: 2021-02-20 23:29:10
Reply_mail: 20210220232910.772-8-dmitry.kozliuk@gmail.com

DPDK git baseline: Repo:dpdk, CommitID: 442155f70c6bbdf59aa1f7b4d8039b5140f62927


Meson Build Summary: 22 Builds Done, 1 Successful, 21 Failures, 0 Blocked

+------------------+------------+--------------+------------+------------+-----------+----------+
| os               | gcc-static | clang-static | icc-static | gcc-shared | gcc-debug | document |
+------------------+------------+--------------+------------+------------+-----------+----------+
| UB2004-64        | FAIL       | FAIL         | FAIL       |            |           | FAIL     |
| RHEL83-64        | FAIL       |              |            |            |           |          |
| FC33-64          | FAIL       | FAIL         |            |            |           |          |
| CentOsStream8-64 | FAIL       |              |            |            |           |          |
| UB2010-64        | FAIL       |              |            |            |           |          |
| WIN10-64         |            | pass         |            |            |           |          |
| UB2004-32        | FAIL       |              |            |            |           |          |
| CENTOS83-64      | FAIL       | FAIL         | FAIL       | FAIL       | FAIL      |          |
| FreeBSD1201-64   | FAIL       | FAIL         |            | FAIL       | FAIL      |          |
| SUSE15-64        | FAIL       | FAIL         |            |            |           |          |
+------------------+------------+--------------+------------+------------+-----------+----------+
Test environment and configuration as below:


OS: UB2004-64
	Kernel Version: 5.6.0-050600-generic
	GCC Version: gcc (Ubuntu 10-20200416-0ubuntu1) 10.0.1 20200416 (experimental) [master revision 3c3f12e2a76:dcee354ce56:44b326839d864fc10c459916abcc97f35a9ac3de]
	Clang Version: 10.0.0-4ubuntu1
	x86_64-native-linuxapp-clang
	x86_64-native-linuxapp-gcc
	x86_64-native-linuxapp-icc
	x86_64-native-linuxapp-doc

OS: RHEL83-64
	Kernel Version: 4.18.0-240.el8.x86_64
	GCC Version: gcc (GCC) 8.3.1 20191121 (Red Hat 8.3.1-5)
	Clang Version: 10.0.1 (Red Hat 10.0.1-1.module+el8.3.0+7459+90c24896)
	x86_64-native-linuxapp-gcc

OS: FC33-64
	Kernel Version: 5.8.16-300.fc33.x86_64
	GCC Version: gcc (GCC) 10.2.1 20201005 (Red Hat 10.2.1-5)
	Clang Version: 11.0.0 (Fedora 11.0.0-1.fc33)
	x86_64-native-linuxapp-gcc
	x86_64-native-linuxapp-clang

OS: CentOsStream8-64
	Kernel Version: 4.18.0-257.el8.x86_64
	GCC Version: gcc (GCC) 8.4.1 20200928 (Red Hat 8.4.1-1)
	Clang Version: 11.0.0 (Red Hat 11.0.0-0.2.rc2.module_el8.4.0+533+50191577)
	x86_64-native-linuxapp-gcc

OS: UB2010-64
	Kernel Version: 5.8.0-25-generic
	GCC Version: gcc (Ubuntu 10.2.0-13ubuntu1) 10.2.0
	Clang Version: 11.0.0-2
	x86_64-native-linuxapp-gcc

OS: WIN10-64
	Kernel Version: N/A
	GCC Version: N/A
	Clang Version: Clang 8.0.0
	x86_64-windows-clang

OS: UB2004-32
	Kernel Version: 5.6.0-050600-generic
	GCC Version: gcc (Ubuntu 9.3.0-10ubuntu2) 9.3.0
	Clang Version: 10.0.0-4ubuntu1
	i686-native-linuxapp-gcc

OS: CENTOS83-64
	Kernel Version: 4.18.0-240.1.1.el8_3.x86_64
	GCC Version: gcc (GCC) 8.3.1 20191121 (Red Hat 8.3.1-5)
	Clang Version: 10.0.1 (Red Hat 10.0.1-1.module_el8.3.0+467+cb298d5b)
	x86_64-native-linuxapp-gcc
	x86_64-native-linuxapp-clang
	x86_64-native-linuxapp-icc
	x86_64-native-linuxapp-gcc+shared
	x86_64-native-linuxapp-gcc+debug

OS: FreeBSD1201-64
	Kernel Version: 12.1-RELEASE
	GCC Version: gcc (FreeBSD Ports Collection) 9.2.0
	Clang Version: 8.0.1 (tags/RELEASE_801/final 366581) (based on LLVM 8.0.1)
	x86_64-native-bsdapp-gcc
	x86_64-native-bsdapp-clang
	x86_64-native-bsdapp-gcc+shared
	x86_64-native-bsdapp-gcc+debug

OS: SUSE15-64
	Kernel Version: 5.3.18-lp152.57-default
	GCC Version: gcc (SUSE Linux) 7.5.0
	Clang Version: 9.0.1
	x86_64-native-linuxapp-clang
	x86_64-native-linuxapp-gcc



*Build Failed #1:
OS: CENTOS83-64
Target: x86_64-native-linuxapp-gcc
FAILED: lib/librte_eal.a.p/librte_eal_unix_rte_thread.c.o 
gcc -Ilib/librte_eal.a.p -Ilib -I../lib -I. -I.. -Iconfig -I../config -Ilib/librte_eal/include -I../lib/librte_eal/include -Ilib/librte_eal/linux/include -I../lib/librte_eal/linux/include -Ilib/librte_eal/x86/include -I../lib/librte_eal/x86/include -Ilib/librte_eal/common -I../lib/librte_eal/common -Ilib/librte_eal -I../lib/librte_eal -Ilib/librte_kvargs -I../lib/librte_kvargs -Ilib/librte_metrics -I../lib/librte_metrics -Ilib/librte_telemetry -I../lib/librte_telemetry -fdiagnostics-color=always -pipe -D_FILE_OFFSET_BITS=64 -Wall -Winvalid-pch -Werror -O3 -include rte_config.h -Wextra -Wcast-qual -Wdeprecated -Wformat -Wformat-nonliteral -Wformat-security -Wmissing-declarations -Wmissing-prototypes -Wnested-externs -Wold-style-definition -Wpointer-arith -Wsign-compare -Wstrict-prototypes -Wundef -Wwrite-strings -Wno-packed-not-aligned -Wno-missing-field-initializers -D_GNU_SOURCE -fPIC -march=native -DALLOW_EXPERIMENTAL_API -DALLOW_INTERNAL_API -Wno-format-truncation '-DABI_VERSION="21.2"' -DRTE_LIBEAL_USE_GETENTROPY -MD -MQ lib/librte_eal.a.p/librte_eal_unix_rte_thread.c.o -MF lib/librte_eal.a.p/librte_eal_unix_rte_thread.c.o.d -o lib/librte_eal.a.p/librte_eal_unix_rte_thread.c.o -c ../lib/librte_eal/unix/rte_thread.c
../lib/librte_eal/unix/rte_thread.c: In function ‘rte_thread_sleep’:
../lib/librte_eal/unix/rte_thread.c:91:2: error: implicit declaration of function ‘sleep’ [-Werror=implicit-function-declaration]
  sleep(sec);
  ^~~~~
../lib/librte_eal/unix/rte_thread.c:91:2: error: nested extern declaration of ‘sleep’ [-Werror=nested-externs]
cc1: all warnings being treated as errors
[50/2826] Compiling C object lib/librte_eal.a.p/librte_eal_common_eal_common_dynmem.c.o
[51/2826] Compiling C object lib/librte_eal.a.p/librte_eal_unix_eal_unix_timer.c.o
[52/2826] Compiling C object lib/librte_eal.a.p/librte_eal_common_rte_random.c.o
[53/2826] Compiling C object lib/librte_eal.a.p/librte_eal_common_rte_malloc.c.o
[54/2826] Compiling C object lib/librte_eal.a.p/librte_eal_common_eal_common_options.c.o
[55/2826] Generating symbol file lib/librte_kvargs.so.21.2.p/librte_kvargs.so.21.2.symbols
[56/2826] Compiling C object lib/librte_eal.a.p/librte_eal_common_malloc_heap.c.o
[57/2826] Generating telemetry.sym_chk with a meson_exe.py custom command
[58/2826] Compiling C object lib/librte_eal.a.p/librte_eal_common_rte_service.c.o
[59/2826] Compiling C object lib/librte_eal.a.p/librte_eal_linux_eal.c.o
[60/2826] Compiling C object drivers/libtmp_rte_event_sw.a.p/event_sw_sw_evdev_selftest.c.o
ninja: build stopped




*Build Failed #2:
OS: CENTOS83-64
Target: x86_64-native-linuxapp-clang
FAILED: lib/librte_eal.a.p/librte_eal_unix_rte_thread.c.o 
clang -Ilib/librte_eal.a.p -Ilib -I../lib -I. -I.. -Iconfig -I../config -Ilib/librte_eal/include -I../lib/librte_eal/include -Ilib/librte_eal/linux/include -I../lib/librte_eal/linux/include -Ilib/librte_eal/x86/include -I../lib/librte_eal/x86/include -Ilib/librte_eal/common -I../lib/librte_eal/common -Ilib/librte_eal -I../lib/librte_eal -Ilib/librte_kvargs -I../lib/librte_kvargs -Ilib/librte_metrics -I../lib/librte_metrics -Ilib/librte_telemetry -I../lib/librte_telemetry -Xclang -fcolor-diagnostics -pipe -D_FILE_OFFSET_BITS=64 -Wall -Winvalid-pch -Werror -O3 -include rte_config.h -Wextra -Wcast-qual -Wdeprecated -Wformat -Wformat-nonliteral -Wformat-security -Wmissing-declarations -Wmissing-prototypes -Wnested-externs -Wold-style-definition -Wpointer-arith -Wsign-compare -Wstrict-prototypes -Wundef -Wwrite-strings -Wno-address-of-packed-member -Wno-missing-field-initializers -D_GNU_SOURCE -fPIC -march=native -DALLOW_EXPERIMENTAL_API -DALLOW_INTERNAL_API '-DABI_VERSION="21.2"' -DRTE_LIBEAL_USE_GETENTROPY -MD -MQ lib/librte_eal.a.p/librte_eal_unix_rte_thread.c.o -MF lib/librte_eal.a.p/librte_eal_unix_rte_thread.c.o.d -o lib/librte_eal.a.p/librte_eal_unix_rte_thread.c.o -c ../lib/librte_eal/unix/rte_thread.c
../lib/librte_eal/unix/rte_thread.c:91:2: error: implicit declaration of function 'sleep' is invalid in C99 [-Werror,-Wimplicit-function-declaration]
        sleep(sec);
        ^
1 error generated.
[61/2829] Compiling C object lib/librte_eal.a.p/librte_eal_linux_eal_cpuflags.c.o
[62/2829] Compiling C object lib/librte_eal.a.p/librte_eal_linux_eal_debug.c.o
[63/2829] Compiling C object lib/librte_eal.a.p/librte_eal_linux_eal_alarm.c.o
[64/2829] Compiling C object lib/librte_eal.a.p/librte_eal_linux_eal_lcore.c.o
[65/2829] Compiling C object lib/librte_eal.a.p/librte_eal_linux_eal_log.c.o
[66/2829] Compiling C object lib/librte_eal.a.p/librte_eal_linux_eal.c.o
[67/2829] Compiling C object lib/librte_eal.a.p/librte_eal_linux_eal_dev.c.o
[68/2829] Compiling C object lib/librte_eal.a.p/librte_eal_linux_eal_hugepage_info.c.o
[69/2829] Compiling C object lib/librte_eal.a.p/librte_eal_linux_eal_interrupts.c.o
ninja: build stopped




*Build Failed #3:
OS: CENTOS83-64
Target: x86_64-native-linuxapp-icc
FAILED: lib/librte_eal.a.p/librte_eal_unix_rte_thread.c.o 
icc -Ilib/librte_eal.a.p -Ilib -I../lib -I. -I.. -Iconfig -I../config -Ilib/librte_eal/include -I../lib/librte_eal/include -Ilib/librte_eal/linux/include -I../lib/librte_eal/linux/include -Ilib/librte_eal/x86/include -I../lib/librte_eal/x86/include -Ilib/librte_eal/common -I../lib/librte_eal/common -Ilib/librte_eal -I../lib/librte_eal -Ilib/librte_kvargs -I../lib/librte_kvargs -Ilib/librte_metrics -I../lib/librte_metrics -Ilib/librte_telemetry -I../lib/librte_telemetry -pipe -D_FILE_OFFSET_BITS=64 -Wall -w3 -diag-disable:remark -Werror -O3 -include rte_config.h -Wextra -Wcast-qual -Wdeprecated -Wformat -Wformat-security -Wmissing-declarations -Wmissing-prototypes -Wold-style-definition -Wpointer-arith -Wsign-compare -Wstrict-prototypes -Wundef -Wwrite-strings -Wno-missing-field-initializers -diag-disable=181 -diag-disable=188 -diag-disable=2203 -diag-disable=2279 -diag-disable=2557 -diag-disable=3179 -diag-disable=3656 -D_GNU_SOURCE -fPIC -march=native -DALLOW_EXPERIMENTAL_API -DALLOW_INTERNAL_API '-DABI_VERSION="21.2"' -DRTE_LIBEAL_USE_GETENTROPY -MD -MQ lib/librte_eal.a.p/librte_eal_unix_rte_thread.c.o -MF lib/librte_eal.a.p/librte_eal_unix_rte_thread.c.o.d -o lib/librte_eal.a.p/librte_eal_unix_rte_thread.c.o -c ../lib/librte_eal/unix/rte_thread.c
../lib/librte_eal/unix/rte_thread.c(91): error #266: function "sleep" declared implicitly
  	sleep(sec);
  	^

compilation aborted for ../lib/librte_eal/unix/rte_thread.c (code 2)
[56/2829] Compiling C object lib/librte_eal.a.p/librte_eal_unix_eal_unix_memory.c.o
[57/2829] Compiling C object lib/librte_eal.a.p/librte_eal_unix_eal_unix_timer.c.o
[58/2829] Compiling C object lib/librte_eal.a.p/librte_eal_common_eal_common_dynmem.c.o
[59/2829] Compiling C object lib/librte_eal.a.p/librte_eal_common_rte_service.c.o
[60/2829] Compiling C object lib/librte_eal.a.p/librte_eal_linux_eal_debug.c.o
[61/2829] Compiling C object lib/librte_eal.a.p/librte_eal_linux_eal_cpuflags.c.o
[62/2829] Compiling C object lib/librte_eal.a.p/librte_eal_linux_eal_alarm.c.o
[63/2829] Compiling C object lib/librte_eal.a.p/librte_eal_linux_eal_dev.c.o
[64/2829] Compiling C object lib/librte_eal.a.p/librte_eal_linux_eal_hugepage_info.c.o
[65/2829] Compiling C object lib/librte_mbuf.a.p/librte_mbuf_rte_mbuf.c.o
[66/2829] Compiling C object lib/librte_eal.a.p/librte_eal_linux_eal.c.o
ninja: build stopped




*Build Failed #4:
OS: CENTOS83-64
Target: x86_64-native-linuxapp-gcc+shared
FAILED: lib/librte_eal.a.p/librte_eal_unix_rte_thread.c.o 
gcc -Ilib/librte_eal.a.p -Ilib -I../lib -I. -I.. -Iconfig -I../config -Ilib/librte_eal/include -I../lib/librte_eal/include -Ilib/librte_eal/linux/include -I../lib/librte_eal/linux/include -Ilib/librte_eal/x86/include -I../lib/librte_eal/x86/include -Ilib/librte_eal/common -I../lib/librte_eal/common -Ilib/librte_eal -I../lib/librte_eal -Ilib/librte_kvargs -I../lib/librte_kvargs -Ilib/librte_metrics -I../lib/librte_metrics -Ilib/librte_telemetry -I../lib/librte_telemetry -fdiagnostics-color=always -pipe -D_FILE_OFFSET_BITS=64 -Wall -Winvalid-pch -Werror -O3 -include rte_config.h -Wextra -Wcast-qual -Wdeprecated -Wformat -Wformat-nonliteral -Wformat-security -Wmissing-declarations -Wmissing-prototypes -Wnested-externs -Wold-style-definition -Wpointer-arith -Wsign-compare -Wstrict-prototypes -Wundef -Wwrite-strings -Wno-packed-not-aligned -Wno-missing-field-initializers -D_GNU_SOURCE -fPIC -march=native -DALLOW_EXPERIMENTAL_API -DALLOW_INTERNAL_API -Wno-format-truncation '-DABI_VERSION="21.2"' -DRTE_LIBEAL_USE_GETENTROPY -MD -MQ lib/librte_eal.a.p/librte_eal_unix_rte_thread.c.o -MF lib/librte_eal.a.p/librte_eal_unix_rte_thread.c.o.d -o lib/librte_eal.a.p/librte_eal_unix_rte_thread.c.o -c ../lib/librte_eal/unix/rte_thread.c
../lib/librte_eal/unix/rte_thread.c: In function ‘rte_thread_sleep’:
../lib/librte_eal/unix/rte_thread.c:91:2: error: implicit declaration of function ‘sleep’ [-Werror=implicit-function-declaration]
  sleep(sec);
  ^~~~~
../lib/librte_eal/unix/rte_thread.c:91:2: error: nested extern declaration of ‘sleep’ [-Werror=nested-externs]
cc1: all warnings being treated as errors
[56/2669] Compiling C object lib/librte_eal.a.p/librte_eal_linux_eal_debug.c.o
[57/2669] Compiling C object lib/librte_eal.a.p/librte_eal_linux_eal_cpuflags.c.o
[58/2669] Linking target lib/librte_telemetry.so.21.2
[59/2669] Compiling C object lib/librte_eal.a.p/librte_eal_linux_eal_alarm.c.o
[60/2669] Compiling C object lib/librte_eal.a.p/librte_eal_common_rte_service.c.o
[61/2669] Compiling C object lib/librte_eal.a.p/librte_eal_common_rte_malloc.c.o
[62/2669] Compiling C object lib/librte_eal.a.p/librte_eal_common_malloc_heap.c.o
[63/2669] Compiling C object lib/librte_eal.a.p/librte_eal_linux_eal_dev.c.o
[64/2669] Compiling C object lib/librte_eal.a.p/librte_eal_linux_eal.c.o
ninja: build stopped




*Build Failed #5:
OS: CENTOS83-64
Target: x86_64-native-linuxapp-gcc+debug
FAILED: lib/librte_eal.a.p/librte_eal_unix_rte_thread.c.o 
gcc -Ilib/librte_eal.a.p -Ilib -I../lib -I. -I.. -Iconfig -I../config -Ilib/librte_eal/include -I../lib/librte_eal/include -Ilib/librte_eal/linux/include -I../lib/librte_eal/linux/include -Ilib/librte_eal/x86/include -I../lib/librte_eal/x86/include -Ilib/librte_eal/common -I../lib/librte_eal/common -Ilib/librte_eal -I../lib/librte_eal -Ilib/librte_kvargs -I../lib/librte_kvargs -Ilib/librte_metrics -I../lib/librte_metrics -Ilib/librte_telemetry -I../lib/librte_telemetry -fdiagnostics-color=always -pipe -D_FILE_OFFSET_BITS=64 -Wall -Winvalid-pch -Werror -O2 -g -include rte_config.h -Wextra -Wcast-qual -Wdeprecated -Wformat -Wformat-nonliteral -Wformat-security -Wmissing-declarations -Wmissing-prototypes -Wnested-externs -Wold-style-definition -Wpointer-arith -Wsign-compare -Wstrict-prototypes -Wundef -Wwrite-strings -Wno-packed-not-aligned -Wno-missing-field-initializers -D_GNU_SOURCE -fPIC -march=native -DALLOW_EXPERIMENTAL_API -DALLOW_INTERNAL_API -Wno-format-truncation '-DABI_VERSION="21.2"' -DRTE_LIBEAL_USE_GETENTROPY -MD -MQ lib/librte_eal.a.p/librte_eal_unix_rte_thread.c.o -MF lib/librte_eal.a.p/librte_eal_unix_rte_thread.c.o.d -o lib/librte_eal.a.p/librte_eal_unix_rte_thread.c.o -c ../lib/librte_eal/unix/rte_thread.c
../lib/librte_eal/unix/rte_thread.c: In function ‘rte_thread_sleep’:
../lib/librte_eal/unix/rte_thread.c:91:2: error: implicit declaration of function ‘sleep’ [-Werror=implicit-function-declaration]
  sleep(sec);
  ^~~~~
../lib/librte_eal/unix/rte_thread.c:91:2: error: nested extern declaration of ‘sleep’ [-Werror=nested-externs]
cc1: all warnings being treated as errors
[54/2829] Compiling C object lib/librte_eal.a.p/librte_eal_common_malloc_mp.c.o
[55/2829] Compiling C object lib/librte_eal.a.p/librte_eal_unix_eal_unix_timer.c.o
[56/2829] Compiling C object lib/librte_eal.a.p/librte_eal_common_eal_common_options.c.o
[57/2829] Compiling C object lib/librte_eal.a.p/librte_eal_common_rte_service.c.o
[58/2829] Compiling C object lib/librte_eal.a.p/librte_eal_linux_eal_alarm.c.o
[59/2829] Compiling C object lib/librte_eal.a.p/librte_eal_common_malloc_heap.c.o
[60/2829] Compiling C object lib/librte_eal.a.p/librte_eal_common_rte_malloc.c.o
[61/2829] Compiling C object lib/librte_mbuf.a.p/librte_mbuf_rte_mbuf.c.o
[62/2829] Compiling C object lib/librte_eal.a.p/librte_eal_linux_eal.c.o
ninja: build stopped




*Build Failed #6:
OS: FC33-64
Target: x86_64-native-linuxapp-gcc
FAILED: lib/librte_eal.a.p/librte_eal_unix_rte_thread.c.o 
gcc -Ilib/librte_eal.a.p -Ilib -I../lib -I. -I.. -Iconfig -I../config -Ilib/librte_eal/include -I../lib/librte_eal/include -Ilib/librte_eal/linux/include -I../lib/librte_eal/linux/include -Ilib/librte_eal/x86/include -I../lib/librte_eal/x86/include -Ilib/librte_eal/common -I../lib/librte_eal/common -Ilib/librte_eal -I../lib/librte_eal -Ilib/librte_kvargs -I../lib/librte_kvargs -Ilib/librte_metrics -I../lib/librte_metrics -Ilib/librte_telemetry -I../lib/librte_telemetry -fdiagnostics-color=always -pipe -D_FILE_OFFSET_BITS=64 -Wall -Winvalid-pch -Werror -O3 -include rte_config.h -Wextra -Wcast-qual -Wdeprecated -Wformat -Wformat-nonliteral -Wformat-security -Wmissing-declarations -Wmissing-prototypes -Wnested-externs -Wold-style-definition -Wpointer-arith -Wsign-compare -Wstrict-prototypes -Wundef -Wwrite-strings -Wno-address-of-packed-member -Wno-packed-not-aligned -Wno-missing-field-initializers -Wno-zero-length-bounds -D_GNU_SOURCE -fPIC -march=native -DALLOW_EXPERIMENTAL_API -DALLOW_INTERNAL_API -Wno-format-truncation '-DABI_VERSION="21.2"' -DRTE_LIBEAL_USE_GETENTROPY -MD -MQ lib/librte_eal.a.p/librte_eal_unix_rte_thread.c.o -MF lib/librte_eal.a.p/librte_eal_unix_rte_thread.c.o.d -o lib/librte_eal.a.p/librte_eal_unix_rte_thread.c.o -c ../lib/librte_eal/unix/rte_thread.c
../lib/librte_eal/unix/rte_thread.c: In function ‘rte_thread_sleep’:
../lib/librte_eal/unix/rte_thread.c:91:2: error: implicit declaration of function ‘sleep’ [-Werror=implicit-function-declaration]
   91 |  sleep(sec);
      |  ^~~~~
../lib/librte_eal/unix/rte_thread.c:91:2: error: nested extern declaration of ‘sleep’ [-Werror=nested-externs]
cc1: all warnings being treated as errors
[52/2838] Compiling C object lib/librte_eal.a.p/librte_eal_linux_eal_cpuflags.c.o
[53/2838] Compiling C object lib/librte_eal.a.p/librte_eal_linux_eal_debug.c.o
[54/2838] Generating telemetry.sym_chk with a meson_exe.py custom command
[55/2838] Compiling C object lib/librte_eal.a.p/librte_eal_common_rte_service.c.o
[56/2838] Compiling C object lib/librte_eal.a.p/librte_eal_linux_eal_alarm.c.o
[57/2838] Compiling C object lib/librte_eal.a.p/librte_eal_common_rte_random.c.o
[58/2838] Compiling C object lib/librte_mbuf.a.p/librte_mbuf_rte_mbuf.c.o
[59/2838] Compiling C object lib/librte_eal.a.p/librte_eal_common_eal_common_options.c.o
[60/2838] Compiling C object lib/librte_eal.a.p/librte_eal_common_rte_malloc.c.o
[61/2838] Compiling C object lib/librte_eal.a.p/librte_eal_common_malloc_heap.c.o
[62/2838] Compiling C object lib/librte_eal.a.p/librte_eal_linux_eal.c.o
ninja: build stopped




*Build Failed #7:
OS: FC33-64
Target: x86_64-native-linuxapp-clang
FAILED: lib/librte_eal.a.p/librte_eal_unix_rte_thread.c.o 
clang -Ilib/librte_eal.a.p -Ilib -I../lib -I. -I.. -Iconfig -I../config -Ilib/librte_eal/include -I../lib/librte_eal/include -Ilib/librte_eal/linux/include -I../lib/librte_eal/linux/include -Ilib/librte_eal/x86/include -I../lib/librte_eal/x86/include -Ilib/librte_eal/common -I../lib/librte_eal/common -Ilib/librte_eal -I../lib/librte_eal -Ilib/librte_kvargs -I../lib/librte_kvargs -Ilib/librte_metrics -I../lib/librte_metrics -Ilib/librte_telemetry -I../lib/librte_telemetry -Xclang -fcolor-diagnostics -pipe -D_FILE_OFFSET_BITS=64 -Wall -Winvalid-pch -Werror -O3 -include rte_config.h -Wextra -Wcast-qual -Wdeprecated -Wformat -Wformat-nonliteral -Wformat-security -Wmissing-declarations -Wmissing-prototypes -Wnested-externs -Wold-style-definition -Wpointer-arith -Wsign-compare -Wstrict-prototypes -Wundef -Wwrite-strings -Wno-address-of-packed-member -Wno-missing-field-initializers -D_GNU_SOURCE -fPIC -march=native -DALLOW_EXPERIMENTAL_API -DALLOW_INTERNAL_API '-DABI_VERSION="21.2"' -DRTE_LIBEAL_USE_GETENTROPY -MD -MQ lib/librte_eal.a.p/librte_eal_unix_rte_thread.c.o -MF lib/librte_eal.a.p/librte_eal_unix_rte_thread.c.o.d -o lib/librte_eal.a.p/librte_eal_unix_rte_thread.c.o -c ../lib/librte_eal/unix/rte_thread.c
../lib/librte_eal/unix/rte_thread.c:91:2: error: implicit declaration of function 'sleep' is invalid in C99 [-Werror,-Wimplicit-function-declaration]
        sleep(sec);
        ^
1 error generated.
[56/2838] Compiling C object lib/librte_eal.a.p/librte_eal_unix_eal_unix_timer.c.o
[57/2838] Compiling C object lib/librte_eal.a.p/librte_eal_linux_eal_cpuflags.c.o
[58/2838] Compiling C object lib/librte_eal.a.p/librte_eal_linux_eal_debug.c.o
[59/2838] Compiling C object lib/librte_eal.a.p/librte_eal_linux_eal_alarm.c.o
[60/2838] Compiling C object lib/librte_eal.a.p/librte_eal_common_rte_random.c.o
[61/2838] Compiling C object lib/librte_eal.a.p/librte_eal_common_rte_malloc.c.o
[62/2838] Compiling C object lib/librte_eal.a.p/librte_eal_linux_eal.c.o
[63/2838] Compiling C object lib/librte_eal.a.p/librte_eal_common_eal_common_options.c.o
[64/2838] Compiling C object lib/librte_eal.a.p/librte_eal_common_malloc_heap.c.o
ninja: build stopped




*Build Failed #8:
OS: FreeBSD1201-64
Target: x86_64-native-bsdapp-gcc
FAILED: lib/librte_eal.a.p/librte_eal_unix_rte_thread.c.o 
gcc -Ilib/librte_eal.a.p -Ilib -I../lib -I. -I.. -Iconfig -I../config -Ilib/librte_eal/include -I../lib/librte_eal/include -Ilib/librte_eal/freebsd/include -I../lib/librte_eal/freebsd/include -Ilib/librte_eal/x86/include -I../lib/librte_eal/x86/include -Ilib/librte_eal/common -I../lib/librte_eal/common -Ilib/librte_eal -I../lib/librte_eal -Ilib/librte_kvargs -I../lib/librte_kvargs -Ilib/librte_metrics -I../lib/librte_metrics -Ilib/librte_telemetry -I../lib/librte_telemetry -fdiagnostics-color=always -pipe -D_FILE_OFFSET_BITS=64 -Wall -Winvalid-pch -Werror -O3 -include rte_config.h -Wextra -Wcast-qual -Wdeprecated -Wformat -Wformat-nonliteral -Wformat-security -Wmissing-declarations -Wmissing-prototypes -Wnested-externs -Wold-style-definition -Wpointer-arith -Wsign-compare -Wstrict-prototypes -Wundef -Wwrite-strings -Wno-address-of-packed-member -Wno-packed-not-aligned -Wno-missing-field-initializers -D_GNU_SOURCE -D__BSD_VISIBLE -fPIC -march=native -mno-avx512f -DALLOW_EXPERIMENTAL_API -DALLOW_INTERNAL_API -Wno-format-truncation '-DABI_VERSION="21.2"' -DRTE_LIBEAL_USE_GETENTROPY -MD -MQ lib/librte_eal.a.p/librte_eal_unix_rte_thread.c.o -MF lib/librte_eal.a.p/librte_eal_unix_rte_thread.c.o.d -o lib/librte_eal.a.p/librte_eal_unix_rte_thread.c.o -c ../lib/librte_eal/unix/rte_thread.c
../lib/librte_eal/unix/rte_thread.c: In function 'rte_thread_sleep':
../lib/librte_eal/unix/rte_thread.c:91:2: error: implicit declaration of function 'sleep' [-Werror=implicit-function-declaration]
   91 |  sleep(sec);
      |  ^~~~~
../lib/librte_eal/unix/rte_thread.c:91:2: error: nested extern declaration of 'sleep' [-Werror=nested-externs]
cc1: all warnings being treated as errors
[58/2049] Compiling C object lib/librte_eal.a.p/librte_eal_freebsd_eal_cpuflags.c.o
[59/2049] Compiling C object lib/librte_eal.a.p/librte_eal_freebsd_eal_debug.c.o
[60/2049] Compiling C object lib/librte_eal.a.p/librte_eal_freebsd_eal_alarm.c.o
[61/2049] Compiling C object lib/librte_eal.a.p/librte_eal_common_rte_malloc.c.o
[62/2049] Compiling C object lib/librte_eal.a.p/librte_eal_freebsd_eal.c.o
ninja: build stopped




*Build Failed #9:
OS: FreeBSD1201-64
Target: x86_64-native-bsdapp-clang
FAILED: lib/librte_eal.a.p/librte_eal_unix_rte_thread.c.o 
clang -Ilib/librte_eal.a.p -Ilib -I../lib -I. -I.. -Iconfig -I../config -Ilib/librte_eal/include -I../lib/librte_eal/include -Ilib/librte_eal/freebsd/include -I../lib/librte_eal/freebsd/include -Ilib/librte_eal/x86/include -I../lib/librte_eal/x86/include -Ilib/librte_eal/common -I../lib/librte_eal/common -Ilib/librte_eal -I../lib/librte_eal -Ilib/librte_kvargs -I../lib/librte_kvargs -Ilib/librte_metrics -I../lib/librte_metrics -Ilib/librte_telemetry -I../lib/librte_telemetry -Xclang -fcolor-diagnostics -pipe -D_FILE_OFFSET_BITS=64 -Wall -Winvalid-pch -Werror -O3 -include rte_config.h -Wextra -Wcast-qual -Wdeprecated -Wformat -Wformat-nonliteral -Wformat-security -Wmissing-declarations -Wmissing-prototypes -Wnested-externs -Wold-style-definition -Wpointer-arith -Wsign-compare -Wstrict-prototypes -Wundef -Wwrite-strings -Wno-address-of-packed-member -Wno-missing-field-initializers -D_GNU_SOURCE -D__BSD_VISIBLE -fPIC -march=native -mno-avx512f -DALLOW_EXPERIMENTAL_API -DALLOW_INTERNAL_API '-DABI_VERSION="21.2"' -DRTE_LIBEAL_USE_GETENTROPY -MD -MQ lib/librte_eal.a.p/librte_eal_unix_rte_thread.c.o -MF lib/librte_eal.a.p/librte_eal_unix_rte_thread.c.o.d -o lib/librte_eal.a.p/librte_eal_unix_rte_thread.c.o -c ../lib/librte_eal/unix/rte_thread.c
../lib/librte_eal/unix/rte_thread.c:91:2: error: implicit declaration of function 'sleep' is invalid in C99 [-Werror,-Wimplicit-function-declaration]
        sleep(sec);
        ^
../lib/librte_eal/unix/rte_thread.c:91:2: error: this function declaration is not a prototype [-Werror,-Wstrict-prototypes]
2 errors generated.
[61/2049] Compiling C object lib/librte_eal.a.p/librte_eal_freebsd_eal_dev.c.o
[62/2049] Compiling C object lib/librte_eal.a.p/librte_eal_freebsd_eal_debug.c.o
[63/2049] Compiling C object lib/librte_eal.a.p/librte_eal_common_malloc_heap.c.o
[64/2049] Compiling C object lib/librte_eal.a.p/librte_eal_freebsd_eal_hugepage_info.c.o
[65/2049] Compiling C object lib/librte_eal.a.p/librte_eal_freebsd_eal_interrupts.c.o
ninja: build stopped




*Build Failed #10:
OS: FreeBSD1201-64
Target: x86_64-native-bsdapp-gcc+shared
FAILED: lib/librte_eal.a.p/librte_eal_unix_rte_thread.c.o 
gcc -Ilib/librte_eal.a.p -Ilib -I../lib -I. -I.. -Iconfig -I../config -Ilib/librte_eal/include -I../lib/librte_eal/include -Ilib/librte_eal/freebsd/include -I../lib/librte_eal/freebsd/include -Ilib/librte_eal/x86/include -I../lib/librte_eal/x86/include -Ilib/librte_eal/common -I../lib/librte_eal/common -Ilib/librte_eal -I../lib/librte_eal -Ilib/librte_kvargs -I../lib/librte_kvargs -Ilib/librte_metrics -I../lib/librte_metrics -Ilib/librte_telemetry -I../lib/librte_telemetry -fdiagnostics-color=always -pipe -D_FILE_OFFSET_BITS=64 -Wall -Winvalid-pch -Werror -O3 -include rte_config.h -Wextra -Wcast-qual -Wdeprecated -Wformat -Wformat-nonliteral -Wformat-security -Wmissing-declarations -Wmissing-prototypes -Wnested-externs -Wold-style-definition -Wpointer-arith -Wsign-compare -Wstrict-prototypes -Wundef -Wwrite-strings -Wno-address-of-packed-member -Wno-packed-not-aligned -Wno-missing-field-initializers -D_GNU_SOURCE -D__BSD_VISIBLE -fPIC -march=native -mno-avx512f -DALLOW_EXPERIMENTAL_API -DALLOW_INTERNAL_API -Wno-format-truncation '-DABI_VERSION="21.2"' -DRTE_LIBEAL_USE_GETENTROPY -MD -MQ lib/librte_eal.a.p/librte_eal_unix_rte_thread.c.o -MF lib/librte_eal.a.p/librte_eal_unix_rte_thread.c.o.d -o lib/librte_eal.a.p/librte_eal_unix_rte_thread.c.o -c ../lib/librte_eal/unix/rte_thread.c
../lib/librte_eal/unix/rte_thread.c: In function 'rte_thread_sleep':
../lib/librte_eal/unix/rte_thread.c:91:2: error: implicit declaration of function 'sleep' [-Werror=implicit-function-declaration]
   91 |  sleep(sec);
      |  ^~~~~
../lib/librte_eal/unix/rte_thread.c:91:2: error: nested extern declaration of 'sleep' [-Werror=nested-externs]
cc1: all warnings being treated as errors
[55/1931] Compiling C object lib/librte_eal.a.p/librte_eal_unix_eal_unix_timer.c.o
[56/1931] Compiling C object lib/librte_eal.a.p/librte_eal_common_malloc_heap.c.o
[57/1931] Compiling C object lib/librte_eal.a.p/librte_eal_common_rte_service.c.o
[58/1931] Compiling C object lib/librte_eal.a.p/librte_eal_freebsd_eal.c.o
[59/1931] Compiling C object lib/librte_eal.a.p/librte_eal_common_rte_malloc.c.o
ninja: build stopped




*Build Failed #11:
OS: FreeBSD1201-64
Target: x86_64-native-bsdapp-gcc+debug
FAILED: lib/librte_eal.a.p/librte_eal_unix_rte_thread.c.o 
gcc -Ilib/librte_eal.a.p -Ilib -I../lib -I. -I.. -Iconfig -I../config -Ilib/librte_eal/include -I../lib/librte_eal/include -Ilib/librte_eal/freebsd/include -I../lib/librte_eal/freebsd/include -Ilib/librte_eal/x86/include -I../lib/librte_eal/x86/include -Ilib/librte_eal/common -I../lib/librte_eal/common -Ilib/librte_eal -I../lib/librte_eal -Ilib/librte_kvargs -I../lib/librte_kvargs -Ilib/librte_metrics -I../lib/librte_metrics -Ilib/librte_telemetry -I../lib/librte_telemetry -fdiagnostics-color=always -pipe -D_FILE_OFFSET_BITS=64 -Wall -Winvalid-pch -Werror -O2 -g -include rte_config.h -Wextra -Wcast-qual -Wdeprecated -Wformat -Wformat-nonliteral -Wformat-security -Wmissing-declarations -Wmissing-prototypes -Wnested-externs -Wold-style-definition -Wpointer-arith -Wsign-compare -Wstrict-prototypes -Wundef -Wwrite-strings -Wno-address-of-packed-member -Wno-packed-not-aligned -Wno-missing-field-initializers -D_GNU_SOURCE -D__BSD_VISIBLE -fPIC -march=native -mno-avx512f -DALLOW_EXPERIMENTAL_API -DALLOW_INTERNAL_API -Wno-format-truncation '-DABI_VERSION="21.2"' -DRTE_LIBEAL_USE_GETENTROPY -MD -MQ lib/librte_eal.a.p/librte_eal_unix_rte_thread.c.o -MF lib/librte_eal.a.p/librte_eal_unix_rte_thread.c.o.d -o lib/librte_eal.a.p/librte_eal_unix_rte_thread.c.o -c ../lib/librte_eal/unix/rte_thread.c
../lib/librte_eal/unix/rte_thread.c: In function 'rte_thread_sleep':
../lib/librte_eal/unix/rte_thread.c:91:2: error: implicit declaration of function 'sleep' [-Werror=implicit-function-declaration]
   91 |  sleep(sec);
      |  ^~~~~
../lib/librte_eal/unix/rte_thread.c:91:2: error: nested extern declaration of 'sleep' [-Werror=nested-externs]
cc1: all warnings being treated as errors
[54/2049] Compiling C object lib/librte_eal.a.p/librte_eal_unix_eal_unix_memory.c.o
[55/2049] Compiling C object lib/librte_eal.a.p/librte_eal_common_malloc_heap.c.o
[56/2049] Compiling C object lib/librte_eal.a.p/librte_eal_unix_eal_unix_timer.c.o
[57/2049] Compiling C object lib/librte_eal.a.p/librte_eal_common_rte_service.c.o
[58/2049] Compiling C object lib/librte_eal.a.p/librte_eal_common_rte_malloc.c.o
ninja: build stopped




*Build Failed #12:
OS: RHEL83-64
Target: x86_64-native-linuxapp-gcc
FAILED: lib/librte_eal.a.p/librte_eal_unix_rte_thread.c.o 
gcc -Ilib/librte_eal.a.p -Ilib -I../lib -I. -I.. -Iconfig -I../config -Ilib/librte_eal/include -I../lib/librte_eal/include -Ilib/librte_eal/linux/include -I../lib/librte_eal/linux/include -Ilib/librte_eal/x86/include -I../lib/librte_eal/x86/include -Ilib/librte_eal/common -I../lib/librte_eal/common -Ilib/librte_eal -I../lib/librte_eal -Ilib/librte_kvargs -I../lib/librte_kvargs -Ilib/librte_metrics -I../lib/librte_metrics -Ilib/librte_telemetry -I../lib/librte_telemetry -fdiagnostics-color=always -pipe -D_FILE_OFFSET_BITS=64 -Wall -Winvalid-pch -Werror -O3 -include rte_config.h -Wextra -Wcast-qual -Wdeprecated -Wformat -Wformat-nonliteral -Wformat-security -Wmissing-declarations -Wmissing-prototypes -Wnested-externs -Wold-style-definition -Wpointer-arith -Wsign-compare -Wstrict-prototypes -Wundef -Wwrite-strings -Wno-packed-not-aligned -Wno-missing-field-initializers -D_GNU_SOURCE -fPIC -march=native -DALLOW_EXPERIMENTAL_API -DALLOW_INTERNAL_API -Wno-format-truncation '-DABI_VERSION="21.2"' -DRTE_LIBEAL_USE_GETENTROPY -MD -MQ lib/librte_eal.a.p/librte_eal_unix_rte_thread.c.o -MF lib/librte_eal.a.p/librte_eal_unix_rte_thread.c.o.d -o lib/librte_eal.a.p/librte_eal_unix_rte_thread.c.o -c ../lib/librte_eal/unix/rte_thread.c
../lib/librte_eal/unix/rte_thread.c: In function ‘rte_thread_sleep’:
../lib/librte_eal/unix/rte_thread.c:91:2: error: implicit declaration of function ‘sleep’ [-Werror=implicit-function-declaration]
  sleep(sec);
  ^~~~~
../lib/librte_eal/unix/rte_thread.c:91:2: error: nested extern declaration of ‘sleep’ [-Werror=nested-externs]
cc1: all warnings being treated as errors
[56/2829] Compiling C object lib/librte_eal.a.p/librte_eal_linux_eal_debug.c.o
[57/2829] Generating telemetry.sym_chk with a custom command (wrapped by meson to capture output)
[58/2829] Compiling C object lib/librte_eal.a.p/librte_eal_linux_eal_cpuflags.c.o
[59/2829] Compiling C object lib/librte_eal.a.p/librte_eal_common_malloc_heap.c.o
[60/2829] Compiling C object lib/librte_eal.a.p/librte_eal_common_rte_malloc.c.o
[61/2829] Compiling C object lib/librte_eal.a.p/librte_eal_linux_eal_alarm.c.o
[62/2829] Compiling C object lib/librte_eal.a.p/librte_eal_linux_eal_dev.c.o
[63/2829] Compiling C object lib/librte_eal.a.p/librte_eal_linux_eal.c.o
[64/2829] Compiling C object drivers/libtmp_rte_event_sw.a.p/event_sw_sw_evdev_selftest.c.o
ninja: build stopped




*Build Failed #13:
OS: SUSE15-64
Target: x86_64-native-linuxapp-clang
FAILED: lib/librte_eal.a.p/librte_eal_unix_rte_thread.c.o 
clang -Ilib/librte_eal.a.p -Ilib -I../lib -I. -I.. -Iconfig -I../config -Ilib/librte_eal/include -I../lib/librte_eal/include -Ilib/librte_eal/linux/include -I../lib/librte_eal/linux/include -Ilib/librte_eal/x86/include -I../lib/librte_eal/x86/include -Ilib/librte_eal/common -I../lib/librte_eal/common -Ilib/librte_eal -I../lib/librte_eal -Ilib/librte_kvargs -I../lib/librte_kvargs -Ilib/librte_metrics -I../lib/librte_metrics -Ilib/librte_telemetry -I../lib/librte_telemetry -Xclang -fcolor-diagnostics -pipe -D_FILE_OFFSET_BITS=64 -Wall -Winvalid-pch -Werror -O3 -include rte_config.h -Wextra -Wcast-qual -Wdeprecated -Wformat -Wformat-nonliteral -Wformat-security -Wmissing-declarations -Wmissing-prototypes -Wnested-externs -Wold-style-definition -Wpointer-arith -Wsign-compare -Wstrict-prototypes -Wundef -Wwrite-strings -Wno-address-of-packed-member -Wno-missing-field-initializers -D_GNU_SOURCE -fPIC -march=native -DALLOW_EXPERIMENTAL_API -DALLOW_INTERNAL_API '-DABI_VERSION="21.2"' -DRTE_LIBEAL_USE_GETENTROPY -MD -MQ lib/librte_eal.a.p/librte_eal_unix_rte_thread.c.o -MF lib/librte_eal.a.p/librte_eal_unix_rte_thread.c.o.d -o lib/librte_eal.a.p/librte_eal_unix_rte_thread.c.o -c ../lib/librte_eal/unix/rte_thread.c
../lib/librte_eal/unix/rte_thread.c:91:2: error: implicit declaration of function 'sleep' is invalid in C99 [-Werror,-Wimplicit-function-declaration]
        sleep(sec);
        ^
1 error generated.
[55/2732] Compiling C object lib/librte_eal.a.p/librte_eal_unix_eal_unix_timer.c.o
[56/2732] Compiling C object lib/librte_eal.a.p/librte_eal_linux_eal_cpuflags.c.o
[57/2732] Compiling C object lib/librte_eal.a.p/librte_eal_unix_eal_unix_memory.c.o
[58/2732] Compiling C object lib/librte_eal.a.p/librte_eal_common_rte_random.c.o
[59/2732] Compiling C object lib/librte_eal.a.p/librte_eal_linux_eal_alarm.c.o
[60/2732] Generating symbol file lib/librte_telemetry.so.21.2.p/librte_telemetry.so.21.2.symbols
[61/2732] Compiling C object lib/librte_eal.a.p/librte_eal_linux_eal.c.o
[62/2732] Compiling C object lib/librte_eal.a.p/librte_eal_common_malloc_heap.c.o
[63/2732] Compiling C object lib/librte_eal.a.p/librte_eal_common_rte_malloc.c.o
ninja: build stopped




*Build Failed #14:
OS: SUSE15-64
Target: x86_64-native-linuxapp-gcc
FAILED: lib/librte_eal.a.p/librte_eal_unix_rte_thread.c.o 
gcc -Ilib/librte_eal.a.p -Ilib -I../lib -I. -I.. -Iconfig -I../config -Ilib/librte_eal/include -I../lib/librte_eal/include -Ilib/librte_eal/linux/include -I../lib/librte_eal/linux/include -Ilib/librte_eal/x86/include -I../lib/librte_eal/x86/include -Ilib/librte_eal/common -I../lib/librte_eal/common -Ilib/librte_eal -I../lib/librte_eal -Ilib/librte_kvargs -I../lib/librte_kvargs -Ilib/librte_metrics -I../lib/librte_metrics -Ilib/librte_telemetry -I../lib/librte_telemetry -fdiagnostics-color=always -pipe -D_FILE_OFFSET_BITS=64 -Wall -Winvalid-pch -Werror -O3 -include rte_config.h -Wextra -Wcast-qual -Wdeprecated -Wformat -Wformat-nonliteral -Wformat-security -Wmissing-declarations -Wmissing-prototypes -Wnested-externs -Wold-style-definition -Wpointer-arith -Wsign-compare -Wstrict-prototypes -Wundef -Wwrite-strings -Wno-missing-field-initializers -D_GNU_SOURCE -fPIC -march=native -DALLOW_EXPERIMENTAL_API -DALLOW_INTERNAL_API -Wno-format-truncation '-DABI_VERSION="21.2"' -DRTE_LIBEAL_USE_GETENTROPY -MD -MQ lib/librte_eal.a.p/librte_eal_unix_rte_thread.c.o -MF lib/librte_eal.a.p/librte_eal_unix_rte_thread.c.o.d -o lib/librte_eal.a.p/librte_eal_unix_rte_thread.c.o -c ../lib/librte_eal/unix/rte_thread.c
../lib/librte_eal/unix/rte_thread.c: In function ‘rte_thread_sleep’:
../lib/librte_eal/unix/rte_thread.c:91:2: error: implicit declaration of function ‘sleep’ [-Werror=implicit-function-declaration]
  sleep(sec);
  ^~~~~
../lib/librte_eal/unix/rte_thread.c:91:2: error: nested extern declaration of ‘sleep’ [-Werror=nested-externs]
cc1: all warnings being treated as errors
[55/2730] Compiling C object lib/librte_eal.a.p/librte_eal_unix_eal_unix_timer.c.o
[56/2730] Compiling C object lib/librte_eal.a.p/librte_eal_common_rte_service.c.o
[57/2730] Generating symbol file lib/librte_telemetry.so.21.2.p/librte_telemetry.so.21.2.symbols
[58/2730] Compiling C object lib/librte_eal.a.p/librte_eal_common_rte_random.c.o
[59/2730] Compiling C object lib/librte_eal.a.p/librte_eal_common_malloc_heap.c.o
[60/2730] Compiling C object lib/librte_eal.a.p/librte_eal_common_rte_malloc.c.o
[61/2730] Compiling C object lib/librte_eal.a.p/librte_eal_linux_eal.c.o
ninja: build stopped




*Build Failed #15:
OS: CentOsStream8-64
Target: x86_64-native-linuxapp-gcc
FAILED: lib/librte_eal.a.p/librte_eal_unix_rte_thread.c.o 
gcc -Ilib/librte_eal.a.p -Ilib -I../lib -I. -I.. -Iconfig -I../config -Ilib/librte_eal/include -I../lib/librte_eal/include -Ilib/librte_eal/linux/include -I../lib/librte_eal/linux/include -Ilib/librte_eal/x86/include -I../lib/librte_eal/x86/include -Ilib/librte_eal/common -I../lib/librte_eal/common -Ilib/librte_eal -I../lib/librte_eal -Ilib/librte_kvargs -I../lib/librte_kvargs -Ilib/librte_metrics -I../lib/librte_metrics -Ilib/librte_telemetry -I../lib/librte_telemetry -fdiagnostics-color=always -pipe -D_FILE_OFFSET_BITS=64 -Wall -Winvalid-pch -Werror -O3 -include rte_config.h -Wextra -Wcast-qual -Wdeprecated -Wformat -Wformat-nonliteral -Wformat-security -Wmissing-declarations -Wmissing-prototypes -Wnested-externs -Wold-style-definition -Wpointer-arith -Wsign-compare -Wstrict-prototypes -Wundef -Wwrite-strings -Wno-packed-not-aligned -Wno-missing-field-initializers -D_GNU_SOURCE -fPIC -march=native -DALLOW_EXPERIMENTAL_API -DALLOW_INTERNAL_API -Wno-format-truncation '-DABI_VERSION="21.2"' -DRTE_LIBEAL_USE_GETENTROPY -MD -MQ lib/librte_eal.a.p/librte_eal_unix_rte_thread.c.o -MF lib/librte_eal.a.p/librte_eal_unix_rte_thread.c.o.d -o lib/librte_eal.a.p/librte_eal_unix_rte_thread.c.o -c ../lib/librte_eal/unix/rte_thread.c
../lib/librte_eal/unix/rte_thread.c: In function ‘rte_thread_sleep’:
../lib/librte_eal/unix/rte_thread.c:91:2: error: implicit declaration of function ‘sleep’ [-Werror=implicit-function-declaration]
  sleep(sec);
  ^~~~~
../lib/librte_eal/unix/rte_thread.c:91:2: error: nested extern declaration of ‘sleep’ [-Werror=nested-externs]
cc1: all warnings being treated as errors
[51/2829] Compiling C object lib/librte_eal.a.p/librte_eal_common_rte_service.c.o
[52/2829] Compiling C object lib/librte_eal.a.p/librte_eal_linux_eal_cpuflags.c.o
[53/2829] Compiling C object lib/librte_mbuf.a.p/librte_mbuf_rte_mbuf.c.o
[54/2829] Compiling C object lib/librte_eal.a.p/librte_eal_common_rte_random.c.o
[55/2829] Compiling C object lib/librte_eal.a.p/librte_eal_linux_eal_alarm.c.o
[56/2829] Compiling C object lib/librte_eal.a.p/librte_eal_common_eal_common_options.c.o
[57/2829] Generating telemetry.sym_chk with a custom command (wrapped by meson to capture output)
[58/2829] Generating symbol file lib/librte_kvargs.so.21.2.p/librte_kvargs.so.21.2.symbols
[59/2829] Compiling C object lib/librte_eal.a.p/librte_eal_common_malloc_heap.c.o
[60/2829] Compiling C object lib/librte_eal.a.p/librte_eal_common_rte_malloc.c.o
[61/2829] Compiling C object lib/librte_eal.a.p/librte_eal_linux_eal.c.o
ninja: build stopped




*Build Failed #16:
OS: UB2004-32
Target: i686-native-linuxapp-gcc
FAILED: lib/librte_eal.a.p/librte_eal_unix_rte_thread.c.o 
gcc -Ilib/librte_eal.a.p -Ilib -I../lib -I. -I.. -Iconfig -I../config -Ilib/librte_eal/include -I../lib/librte_eal/include -Ilib/librte_eal/linux/include -I../lib/librte_eal/linux/include -Ilib/librte_eal/x86/include -I../lib/librte_eal/x86/include -Ilib/librte_eal/common -I../lib/librte_eal/common -Ilib/librte_eal -I../lib/librte_eal -Ilib/librte_kvargs -I../lib/librte_kvargs -Ilib/librte_metrics -I../lib/librte_metrics -Ilib/librte_telemetry -I../lib/librte_telemetry -fdiagnostics-color=always -pipe -D_FILE_OFFSET_BITS=64 -Wall -Winvalid-pch -Werror -O3 -include rte_config.h -Wextra -Wcast-qual -Wdeprecated -Wformat -Wformat-nonliteral -Wformat-security -Wmissing-declarations -Wmissing-prototypes -Wnested-externs -Wold-style-definition -Wpointer-arith -Wsign-compare -Wstrict-prototypes -Wundef -Wwrite-strings -Wno-address-of-packed-member -Wno-packed-not-aligned -Wno-missing-field-initializers -Wno-pointer-to-int-cast -D_GNU_SOURCE -m32 -fPIC -march=native -DALLOW_EXPERIMENTAL_API -DALLOW_INTERNAL_API -Wno-format-truncation '-DABI_VERSION="21.2"' -DRTE_LIBEAL_USE_GETENTROPY -MD -MQ lib/librte_eal.a.p/librte_eal_unix_rte_thread.c.o -MF lib/librte_eal.a.p/librte_eal_unix_rte_thread.c.o.d -o lib/librte_eal.a.p/librte_eal_unix_rte_thread.c.o -c ../lib/librte_eal/unix/rte_thread.c
../lib/librte_eal/unix/rte_thread.c: In function ‘rte_thread_sleep’:
../lib/librte_eal/unix/rte_thread.c:91:2: error: implicit declaration of function ‘sleep’ [-Werror=implicit-function-declaration]
   91 |  sleep(sec);
      |  ^~~~~
../lib/librte_eal/unix/rte_thread.c:91:2: error: nested extern declaration of ‘sleep’ [-Werror=nested-externs]
cc1: all warnings being treated as errors
[54/2371] Compiling C object lib/librte_eal.a.p/librte_eal_common_rte_random.c.o
[55/2371] Compiling C object lib/librte_eal.a.p/librte_eal_linux_eal_cpuflags.c.o
[56/2371] Compiling C object lib/librte_eal.a.p/librte_eal_common_eal_common_options.c.o
[57/2371] Compiling C object lib/librte_eal.a.p/librte_eal_common_rte_service.c.o
[58/2371] Generating symbol file lib/librte_telemetry.so.21.2.p/librte_telemetry.so.21.2.symbols
[59/2371] Compiling C object lib/librte_eal.a.p/librte_eal_linux_eal_alarm.c.o
[60/2371] Compiling C object lib/librte_eal.a.p/librte_eal_common_malloc_heap.c.o
[61/2371] Compiling C object lib/librte_eal.a.p/librte_eal_common_rte_malloc.c.o
[62/2371] Compiling C object lib/librte_eal.a.p/librte_eal_linux_eal.c.o
ninja: build stopped




*Build Failed #17:
OS: UB2004-64
Target: x86_64-native-linuxapp-clang
FAILED: lib/librte_eal.a.p/librte_eal_unix_rte_thread.c.o 
clang -Ilib/librte_eal.a.p -Ilib -I../lib -I. -I.. -Iconfig -I../config -Ilib/librte_eal/include -I../lib/librte_eal/include -Ilib/librte_eal/linux/include -I../lib/librte_eal/linux/include -Ilib/librte_eal/x86/include -I../lib/librte_eal/x86/include -Ilib/librte_eal/common -I../lib/librte_eal/common -Ilib/librte_eal -I../lib/librte_eal -Ilib/librte_kvargs -I../lib/librte_kvargs -Ilib/librte_metrics -I../lib/librte_metrics -Ilib/librte_telemetry -I../lib/librte_telemetry -Xclang -fcolor-diagnostics -pipe -D_FILE_OFFSET_BITS=64 -Wall -Winvalid-pch -Werror -O3 -include rte_config.h -Wextra -Wcast-qual -Wdeprecated -Wformat -Wformat-nonliteral -Wformat-security -Wmissing-declarations -Wmissing-prototypes -Wnested-externs -Wold-style-definition -Wpointer-arith -Wsign-compare -Wstrict-prototypes -Wundef -Wwrite-strings -Wno-address-of-packed-member -Wno-missing-field-initializers -D_GNU_SOURCE -fPIC -march=native -DALLOW_EXPERIMENTAL_API -DALLOW_INTERNAL_API '-DABI_VERSION="21.2"' -DRTE_LIBEAL_USE_GETENTROPY -MD -MQ lib/librte_eal.a.p/librte_eal_unix_rte_thread.c.o -MF lib/librte_eal.a.p/librte_eal_unix_rte_thread.c.o.d -o lib/librte_eal.a.p/librte_eal_unix_rte_thread.c.o -c ../lib/librte_eal/unix/rte_thread.c
../lib/librte_eal/unix/rte_thread.c:91:2: error: implicit declaration of function 'sleep' is invalid in C99 [-Werror,-Wimplicit-function-declaration]
        sleep(sec);
        ^
1 error generated.
[53/2825] Compiling C object lib/librte_eal.a.p/librte_eal_common_eal_common_dynmem.c.o
[54/2825] Compiling C object lib/librte_eal.a.p/librte_eal_common_rte_random.c.o
[55/2825] Compiling C object lib/librte_eal.a.p/librte_eal_common_eal_common_options.c.o
[56/2825] Compiling C object lib/librte_eal.a.p/librte_eal_common_rte_service.c.o
[57/2825] Compiling C object lib/librte_eal.a.p/librte_eal_linux_eal_alarm.c.o
[58/2825] Generating symbol file lib/librte_telemetry.so.21.2.p/librte_telemetry.so.21.2.symbols
[59/2825] Compiling C object lib/librte_eal.a.p/librte_eal_common_rte_malloc.c.o
[60/2825] Compiling C object lib/librte_eal.a.p/librte_eal_linux_eal.c.o
[61/2825] Compiling C object lib/librte_eal.a.p/librte_eal_common_malloc_heap.c.o
ninja: build stopped




*Build Failed #18:
OS: UB2004-64
Target: x86_64-native-linuxapp-gcc
FAILED: lib/librte_eal.a.p/librte_eal_unix_rte_thread.c.o 
gcc -Ilib/librte_eal.a.p -Ilib -I../lib -I. -I.. -Iconfig -I../config -Ilib/librte_eal/include -I../lib/librte_eal/include -Ilib/librte_eal/linux/include -I../lib/librte_eal/linux/include -Ilib/librte_eal/x86/include -I../lib/librte_eal/x86/include -Ilib/librte_eal/common -I../lib/librte_eal/common -Ilib/librte_eal -I../lib/librte_eal -Ilib/librte_kvargs -I../lib/librte_kvargs -Ilib/librte_metrics -I../lib/librte_metrics -Ilib/librte_telemetry -I../lib/librte_telemetry -fdiagnostics-color=always -pipe -D_FILE_OFFSET_BITS=64 -Wall -Winvalid-pch -Werror -O3 -include rte_config.h -Wextra -Wcast-qual -Wdeprecated -Wformat -Wformat-nonliteral -Wformat-security -Wmissing-declarations -Wmissing-prototypes -Wnested-externs -Wold-style-definition -Wpointer-arith -Wsign-compare -Wstrict-prototypes -Wundef -Wwrite-strings -Wno-address-of-packed-member -Wno-packed-not-aligned -Wno-missing-field-initializers -Wno-zero-length-bounds -D_GNU_SOURCE -fPIC -march=native -DALLOW_EXPERIMENTAL_API -DALLOW_INTERNAL_API -Wno-format-truncation '-DABI_VERSION="21.2"' -DRTE_LIBEAL_USE_GETENTROPY -MD -MQ lib/librte_eal.a.p/librte_eal_unix_rte_thread.c.o -MF lib/librte_eal.a.p/librte_eal_unix_rte_thread.c.o.d -o lib/librte_eal.a.p/librte_eal_unix_rte_thread.c.o -c ../lib/librte_eal/unix/rte_thread.c
../lib/librte_eal/unix/rte_thread.c: In function ‘rte_thread_sleep’:
../lib/librte_eal/unix/rte_thread.c:91:2: error: implicit declaration of function ‘sleep’ [-Werror=implicit-function-declaration]
   91 |  sleep(sec);
      |  ^~~~~
../lib/librte_eal/unix/rte_thread.c:91:2: error: nested extern declaration of ‘sleep’ [-Werror=nested-externs]
cc1: all warnings being treated as errors
[54/2825] Compiling C object lib/librte_eal.a.p/librte_eal_common_eal_common_options.c.o
[55/2825] Compiling C object lib/librte_eal.a.p/librte_eal_common_rte_service.c.o
[56/2825] Compiling C object lib/librte_eal.a.p/librte_eal_linux_eal_alarm.c.o
[57/2825] Compiling C object lib/librte_eal.a.p/librte_eal_common_rte_malloc.c.o
[58/2825] Generating symbol file lib/librte_telemetry.so.21.2.p/librte_telemetry.so.21.2.symbols
[59/2825] Compiling C object lib/librte_eal.a.p/librte_eal_common_rte_random.c.o
[60/2825] Compiling C object lib/librte_eal.a.p/librte_eal_common_malloc_heap.c.o
[61/2825] Compiling C object lib/librte_eal.a.p/librte_eal_linux_eal.c.o
[62/2825] Compiling C object drivers/libtmp_rte_event_sw.a.p/event_sw_sw_evdev_selftest.c.o
ninja: build stopped




*Build Failed #19:
OS: UB2004-64
Target: x86_64-native-linuxapp-icc
FAILED: lib/librte_eal.a.p/librte_eal_unix_rte_thread.c.o 
icc -Ilib/librte_eal.a.p -Ilib -I../lib -I. -I.. -Iconfig -I../config -Ilib/librte_eal/include -I../lib/librte_eal/include -Ilib/librte_eal/linux/include -I../lib/librte_eal/linux/include -Ilib/librte_eal/x86/include -I../lib/librte_eal/x86/include -Ilib/librte_eal/common -I../lib/librte_eal/common -Ilib/librte_eal -I../lib/librte_eal -Ilib/librte_kvargs -I../lib/librte_kvargs -Ilib/librte_metrics -I../lib/librte_metrics -Ilib/librte_telemetry -I../lib/librte_telemetry -pipe -D_FILE_OFFSET_BITS=64 -Wall -w3 -diag-disable:remark -Werror -O3 -include rte_config.h -Wextra -Wcast-qual -Wdeprecated -Wformat -Wformat-security -Wmissing-declarations -Wmissing-prototypes -Wold-style-definition -Wpointer-arith -Wsign-compare -Wstrict-prototypes -Wundef -Wwrite-strings -Wno-missing-field-initializers -diag-disable=181 -diag-disable=188 -diag-disable=2203 -diag-disable=2279 -diag-disable=2557 -diag-disable=3179 -diag-disable=3656 -D_GNU_SOURCE -fPIC -march=native -DALLOW_EXPERIMENTAL_API -DALLOW_INTERNAL_API '-DABI_VERSION="21.2"' -DRTE_LIBEAL_USE_GETENTROPY -MD -MQ lib/librte_eal.a.p/librte_eal_unix_rte_thread.c.o -MF lib/librte_eal.a.p/librte_eal_unix_rte_thread.c.o.d -o lib/librte_eal.a.p/librte_eal_unix_rte_thread.c.o -c ../lib/librte_eal/unix/rte_thread.c
../lib/librte_eal/unix/rte_thread.c(91): error #266: function "sleep" declared implicitly
  	sleep(sec);
  	^

compilation aborted for ../lib/librte_eal/unix/rte_thread.c (code 2)
[57/2779] Compiling C object lib/librte_eal.a.p/librte_eal_common_rte_malloc.c.o
[58/2779] Compiling C object lib/librte_eal.a.p/librte_eal_unix_eal_unix_timer.c.o
[59/2779] Compiling C object lib/librte_eal.a.p/librte_eal_common_eal_common_dynmem.c.o
[60/2779] Compiling C object lib/librte_eal.a.p/librte_eal_unix_eal_unix_memory.c.o
[61/2779] Compiling C object lib/librte_eal.a.p/librte_eal_common_rte_service.c.o
[62/2779] Compiling C object lib/librte_eal.a.p/librte_eal_linux_eal_cpuflags.c.o
[63/2779] Compiling C object lib/librte_eal.a.p/librte_eal_linux_eal_debug.c.o
[64/2779] Compiling C object lib/librte_eal.a.p/librte_eal_linux_eal_alarm.c.o
[65/2779] Compiling C object lib/librte_eal.a.p/librte_eal_linux_eal.c.o
ninja: build stopped




*Build Failed #20:
OS: UB2004-64
Target: x86_64-native-linuxapp-doc
FAILED: lib/librte_eal.a.p/librte_eal_unix_rte_thread.c.o 
gcc -Ilib/librte_eal.a.p -Ilib -I../lib -I. -I.. -Iconfig -I../config -Ilib/librte_eal/include -I../lib/librte_eal/include -Ilib/librte_eal/linux/include -I../lib/librte_eal/linux/include -Ilib/librte_eal/x86/include -I../lib/librte_eal/x86/include -Ilib/librte_eal/common -I../lib/librte_eal/common -Ilib/librte_eal -I../lib/librte_eal -Ilib/librte_kvargs -I../lib/librte_kvargs -Ilib/librte_metrics -I../lib/librte_metrics -Ilib/librte_telemetry -I../lib/librte_telemetry -fdiagnostics-color=always -pipe -D_FILE_OFFSET_BITS=64 -Wall -Winvalid-pch -Werror -O3 -include rte_config.h -Wextra -Wcast-qual -Wdeprecated -Wformat -Wformat-nonliteral -Wformat-security -Wmissing-declarations -Wmissing-prototypes -Wnested-externs -Wold-style-definition -Wpointer-arith -Wsign-compare -Wstrict-prototypes -Wundef -Wwrite-strings -Wno-address-of-packed-member -Wno-packed-not-aligned -Wno-missing-field-initializers -D_GNU_SOURCE -fPIC -march=native -DALLOW_EXPERIMENTAL_API -DALLOW_INTERNAL_API -Wno-format-truncation '-DABI_VERSION="21.2"' -DRTE_LIBEAL_USE_GETENTROPY -MD -MQ lib/librte_eal.a.p/librte_eal_unix_rte_thread.c.o -MF lib/librte_eal.a.p/librte_eal_unix_rte_thread.c.o.d -o lib/librte_eal.a.p/librte_eal_unix_rte_thread.c.o -c ../lib/librte_eal/unix/rte_thread.c
../lib/librte_eal/unix/rte_thread.c: In function ‘rte_thread_sleep’:
../lib/librte_eal/unix/rte_thread.c:91:2: error: implicit declaration of function ‘sleep’ [-Werror=implicit-function-declaration]
   91 |  sleep(sec);
      |  ^~~~~
../lib/librte_eal/unix/rte_thread.c:91:2: error: nested extern declaration of ‘sleep’ [-Werror=nested-externs]
cc1: all warnings being treated as errors
[54/2635] Compiling C object lib/librte_eal.a.p/librte_eal_common_eal_common_options.c.o
[55/2635] Generating symbol file lib/librte_telemetry.so.21.2.p/librte_telemetry.so.21.2.symbols
[56/2635] Compiling C object lib/librte_eal.a.p/librte_eal_common_rte_service.c.o
[57/2635] Compiling C object lib/librte_eal.a.p/librte_eal_common_rte_random.c.o
[58/2635] Compiling C object lib/librte_eal.a.p/librte_eal_common_rte_malloc.c.o
[59/2635] Compiling C object lib/librte_eal.a.p/librte_eal_common_malloc_heap.c.o
[60/2635] Compiling C object lib/librte_eal.a.p/librte_eal_linux_eal_alarm.c.o
[61/2635] Compiling C object lib/librte_eal.a.p/librte_eal_linux_eal.c.o
[62/2635] Compiling C object drivers/libtmp_rte_event_sw.a.p/event_sw_sw_evdev_selftest.c.o
ninja: build stopped




*Build Failed #21:
OS: UB2010-64
Target: x86_64-native-linuxapp-gcc
FAILED: lib/76b5a35@@rte_eal@sta/librte_eal_unix_rte_thread.c.o 
gcc -Ilib/76b5a35@@rte_eal@sta -Ilib -I../lib -I. -I../ -Iconfig -I../config -Ilib/librte_eal/include -I../lib/librte_eal/include -Ilib/librte_eal/linux/include -I../lib/librte_eal/linux/include -Ilib/librte_eal/x86/include -I../lib/librte_eal/x86/include -Ilib/librte_eal/common -I../lib/librte_eal/common -Ilib/librte_eal -I../lib/librte_eal -Ilib/librte_kvargs -I../lib/librte_kvargs -Ilib/librte_telemetry/../librte_metrics -I../lib/librte_telemetry/../librte_metrics -Ilib/librte_telemetry -I../lib/librte_telemetry -fdiagnostics-color=always -pipe -D_FILE_OFFSET_BITS=64 -Wall -Winvalid-pch -Werror -O3 -include rte_config.h -Wextra -Wcast-qual -Wdeprecated -Wformat -Wformat-nonliteral -Wformat-security -Wmissing-declarations -Wmissing-prototypes -Wnested-externs -Wold-style-definition -Wpointer-arith -Wsign-compare -Wstrict-prototypes -Wundef -Wwrite-strings -Wno-address-of-packed-member -Wno-packed-not-aligned -Wno-missing-field-initializers -Wno-zero-length-bounds -D_GNU_SOURCE -fPIC -march=native -DALLOW_EXPERIMENTAL_API -DALLOW_INTERNAL_API -Wno-format-truncation '-DABI_VERSION="21.2"' -DRTE_LIBEAL_USE_GETENTROPY -MD -MQ 'lib/76b5a35@@rte_eal@sta/librte_eal_unix_rte_thread.c.o' -MF 'lib/76b5a35@@rte_eal@sta/librte_eal_unix_rte_thread.c.o.d' -o 'lib/76b5a35@@rte_eal@sta/librte_eal_unix_rte_thread.c.o' -c ../lib/librte_eal/unix/rte_thread.c
../lib/librte_eal/unix/rte_thread.c: In function ‘rte_thread_sleep’:
../lib/librte_eal/unix/rte_thread.c:91:2: error: implicit declaration of function ‘sleep’ [-Werror=implicit-function-declaration]
   91 |  sleep(sec);
      |  ^~~~~
../lib/librte_eal/unix/rte_thread.c:91:2: error: nested extern declaration of ‘sleep’ [-Werror=nested-externs]
cc1: all warnings being treated as errors
[50/2828] Compiling C object 'lib/76b5a35@@rte_eal@sta/librte_eal_unix_eal_unix_timer.c.o'.
[51/2828] Generating telemetry.sym_chk with a meson_exe.py custom command.
[52/2828] Compiling C object 'lib/76b5a35@@rte_eal@sta/librte_eal_common_eal_common_dynmem.c.o'.
[53/2828] Compiling C object 'lib/76b5a35@@rte_eal@sta/librte_eal_common_rte_service.c.o'.
[54/2828] Compiling C object 'lib/76b5a35@@rte_eal@sta/librte_eal_common_eal_common_options.c.o'.
[55/2828] Compiling C object 'lib/76b5a35@@rte_eal@sta/librte_eal_common_rte_random.c.o'.
[56/2828] Compiling C object 'lib/76b5a35@@rte_eal@sta/librte_eal_common_rte_malloc.c.o'.
[57/2828] Compiling C object 'lib/76b5a35@@rte_eal@sta/librte_eal_common_malloc_heap.c.o'.
[58/2828] Compiling C object 'drivers/a715181@@tmp_rte_event_sw@sta/event_sw_sw_evdev_scheduler.c.o'.
ninja: build stopped


DPDK STV team

^ permalink raw reply	[flat|nested] only message in thread

only message in thread, other threads:[~2021-02-20 23:41 UTC | newest]

Thread overview: (only message) (download: mbox.gz / follow: Atom feed)
-- links below jump to the message on this page --
2021-02-20 23:41 [dpdk-test-report] |FAILURE| pw(88045) [7/7] eal/windows: do not expose POSIX symbols sys_stv

automatic DPDK test reports

This inbox may be cloned and mirrored by anyone:

	git clone --mirror https://inbox.dpdk.org/test-report/0 test-report/git/0.git

	# If you have public-inbox 1.1+ installed, you may
	# initialize and index your mirror using the following commands:
	public-inbox-init -V2 test-report test-report/ https://inbox.dpdk.org/test-report \
		test-report@dpdk.org
	public-inbox-index test-report

Example config snippet for mirrors.
Newsgroup available over NNTP:
	nntp://inbox.dpdk.org/inbox.dpdk.test-report


AGPL code for this site: git clone https://public-inbox.org/public-inbox.git