automatic DPDK test reports
 help / color / mirror / Atom feed
* [dpdk-test-report] |FAILURE| pw(88074) [v14, 4/4] examples/ifpga: add example for ifpga APIs
@ 2021-02-22  3:48 sys_stv
  0 siblings, 0 replies; only message in thread
From: sys_stv @ 2021-02-22  3:48 UTC (permalink / raw)
  To: test-report

[-- Attachment #1: Type: text/plain, Size: 7660 bytes --]


Test-Label: Intel-compilation
Test-Status: FAILURE
http://dpdk.org/patch/88074

_Compilation issues_

Submitter: Wei Huang <wei.huang@intel.com>
Date: 2021-02-22 03:15:47
Reply_mail: 1613963747-30047-5-git-send-email-wei.huang@intel.com

DPDK git baseline: Repo:dpdk-next-net-intel, CommitID: 442155f70c6bbdf59aa1f7b4d8039b5140f62927


Meson Build Summary: 22 Builds Done, 21 Successful, 1 Failures, 0 Blocked

+------------------+------------+--------------+------------+------------+-----------+----------+
| os               | gcc-static | clang-static | icc-static | gcc-shared | gcc-debug | document |
+------------------+------------+--------------+------------+------------+-----------+----------+
| UB2004-64        | pass       | pass         | pass       |            |           | pass     |
| RHEL83-64        | pass       |              |            |            |           |          |
| FC33-64          | pass       | pass         |            |            |           |          |
| CentOsStream8-64 | pass       |              |            |            |           |          |
| UB2010-64        | pass       |              |            |            |           |          |
| WIN10-64         |            | pass         |            |            |           |          |
| UB2004-32        | FAIL       |              |            |            |           |          |
| CENTOS83-64      | pass       | pass         | pass       | pass       | pass      |          |
| FreeBSD1201-64   | pass       | pass         |            | pass       | pass      |          |
| SUSE15-64        | pass       | pass         |            |            |           |          |
+------------------+------------+--------------+------------+------------+-----------+----------+
Test environment and configuration as below:


OS: UB2004-64
	Kernel Version: 5.6.0-050600-generic
	GCC Version: gcc (Ubuntu 10-20200416-0ubuntu1) 10.0.1 20200416 (experimental) [master revision 3c3f12e2a76:dcee354ce56:44b326839d864fc10c459916abcc97f35a9ac3de]
	Clang Version: 10.0.0-4ubuntu1
	x86_64-native-linuxapp-clang
	x86_64-native-linuxapp-gcc
	x86_64-native-linuxapp-icc
	x86_64-native-linuxapp-doc

OS: RHEL83-64
	Kernel Version: 4.18.0-240.el8.x86_64
	GCC Version: gcc (GCC) 8.3.1 20191121 (Red Hat 8.3.1-5)
	Clang Version: 10.0.1 (Red Hat 10.0.1-1.module+el8.3.0+7459+90c24896)
	x86_64-native-linuxapp-gcc

OS: FC33-64
	Kernel Version: 5.8.16-300.fc33.x86_64
	GCC Version: gcc (GCC) 10.2.1 20201005 (Red Hat 10.2.1-5)
	Clang Version: 11.0.0 (Fedora 11.0.0-1.fc33)
	x86_64-native-linuxapp-gcc
	x86_64-native-linuxapp-clang

OS: CentOsStream8-64
	Kernel Version: 4.18.0-257.el8.x86_64
	GCC Version: gcc (GCC) 8.4.1 20200928 (Red Hat 8.4.1-1)
	Clang Version: 11.0.0 (Red Hat 11.0.0-0.2.rc2.module_el8.4.0+533+50191577)
	x86_64-native-linuxapp-gcc

OS: UB2010-64
	Kernel Version: 5.8.0-25-generic
	GCC Version: gcc (Ubuntu 10.2.0-13ubuntu1) 10.2.0
	Clang Version: 11.0.0-2
	x86_64-native-linuxapp-gcc

OS: WIN10-64
	Kernel Version: N/A
	GCC Version: N/A
	Clang Version: Clang 8.0.0
	x86_64-windows-clang

OS: UB2004-32
	Kernel Version: 5.6.0-050600-generic
	GCC Version: gcc (Ubuntu 9.3.0-10ubuntu2) 9.3.0
	Clang Version: 10.0.0-4ubuntu1
	i686-native-linuxapp-gcc

OS: CENTOS83-64
	Kernel Version: 4.18.0-240.1.1.el8_3.x86_64
	GCC Version: gcc (GCC) 8.3.1 20191121 (Red Hat 8.3.1-5)
	Clang Version: 10.0.1 (Red Hat 10.0.1-1.module_el8.3.0+467+cb298d5b)
	x86_64-native-linuxapp-gcc
	x86_64-native-linuxapp-clang
	x86_64-native-linuxapp-icc
	x86_64-native-linuxapp-gcc+shared
	x86_64-native-linuxapp-gcc+debug

OS: FreeBSD1201-64
	Kernel Version: 12.1-RELEASE
	GCC Version: gcc (FreeBSD Ports Collection) 9.2.0
	Clang Version: 8.0.1 (tags/RELEASE_801/final 366581) (based on LLVM 8.0.1)
	x86_64-native-bsdapp-gcc
	x86_64-native-bsdapp-clang
	x86_64-native-bsdapp-gcc+shared
	x86_64-native-bsdapp-gcc+debug

OS: SUSE15-64
	Kernel Version: 5.3.18-lp152.57-default
	GCC Version: gcc (SUSE Linux) 7.5.0
	Clang Version: 9.0.1
	x86_64-native-linuxapp-clang
	x86_64-native-linuxapp-gcc



*Build Failed #1:
OS: UB2004-32
Target: i686-native-linuxapp-gcc
FAILED: examples/dpdk-ifpga.p/ifpga_commands.c.o 
gcc -Iexamples/dpdk-ifpga.p -Iexamples -I../examples -Iexamples/ifpga -I../examples/ifpga -I. -I.. -Iconfig -I../config -Ilib/librte_eal/include -I../lib/librte_eal/include -Ilib/librte_eal/linux/include -I../lib/librte_eal/linux/include -Ilib/librte_eal/x86/include -I../lib/librte_eal/x86/include -Ilib/librte_eal/common -I../lib/librte_eal/common -Ilib/librte_eal -I../lib/librte_eal -Ilib/librte_kvargs -I../lib/librte_kvargs -Ilib/librte_metrics -I../lib/librte_metrics -Ilib/librte_telemetry -I../lib/librte_telemetry -Ilib/librte_mempool -I../lib/librte_mempool -Ilib/librte_ring -I../lib/librte_ring -Ilib/librte_net -I../lib/librte_net -Ilib/librte_mbuf -I../lib/librte_mbuf -Ilib/librte_ethdev -I../lib/librte_ethdev -Ilib/librte_meter -I../lib/librte_meter -Ilib/librte_cmdline -I../lib/librte_cmdline -Idrivers/raw/ifpga -I../drivers/raw/ifpga -Idrivers/raw/ifpga/base -I../drivers/raw/ifpga/base -Idrivers/net/ipn3ke -I../drivers/net/ipn3ke -Idrivers/net/i40e -I../drivers/net/i40e -Ilib/librte_rawdev -I../lib/librte_rawdev -Ilib/librte_pci -I../lib/librte_pci -Idrivers/bus/pci -I../drivers/bus/pci -I../drivers/bus/pci/linux -Idrivers/bus/vdev -I../drivers/bus/vdev -Idrivers/bus/ifpga -I../drivers/bus/ifpga -Idrivers/net/i40e/base -I../drivers/net/i40e/base -Ilib/librte_hash -I../lib/librte_hash -Ilib/librte_rcu -I../lib/librte_rcu -Ilib/librte_sched -I../lib/librte_sched -fdiagnostics-color=always -pipe -D_FILE_OFFSET_BITS=64 -Wall -Winvalid-pch -Werror -O3 -include rte_config.h -Wextra -Wcast-qual -Wdeprecated -Wformat -Wformat-nonliteral -Wformat-security -Wmissing-declarations -Wmissing-prototypes -Wnested-externs -Wold-style-definition -Wpointer-arith -Wsign-compare -Wstrict-prototypes -Wundef -Wwrite-strings -Wno-address-of-packed-member -Wno-packed-not-aligned -Wno-missing-field-initializers -Wno-pointer-to-int-cast -D_GNU_SOURCE -m32 -march=native -Wno-format-truncation -fPIC -DALLOW_EXPERIMENTAL_API -MD -MQ examples/dpdk-ifpga.p/ifpga_commands.c.o -MF examples/dpdk-ifpga.p/ifpga_commands.c.o.d -o examples/dpdk-ifpga.p/ifpga_commands.c.o -c ../examples/ifpga/commands.c
../examples/ifpga/commands.c: In function ‘cmd_flash_parsed’:
../examples/ifpga/commands.c:896:34: error: format ‘%lx’ expects argument of type ‘long unsigned int’, but argument 3 has type ‘uint64_t’ {aka ‘long long unsigned int’} [-Werror=format=]
  896 |   cmdline_printf(cl, "Error: 0x%lx\n", stat);
      |                                ~~^     ~~~~
      |                                  |     |
      |                                  |     uint64_t {aka long long unsigned int}
      |                                  long unsigned int
      |                                %llx
cc1: all warnings being treated as errors
[2235/2378] Compiling C object examples/dpdk-ip_pipeline.p/ip_pipeline_main.c.o
[2236/2378] Linking target examples/dpdk-flow_filtering
[2237/2378] Linking target examples/dpdk-flow_classify
[2238/2378] Compiling C object examples/dpdk-fips_validation.p/fips_validation_fips_dev_self_test.c.o
[2239/2378] Compiling C object examples/dpdk-ip_fragmentation.p/ip_fragmentation_main.c.o
[2240/2378] Compiling C object app/test/dpdk-test.p/test_trace_perf.c.o
[2241/2378] Compiling C object examples/dpdk-ip_pipeline.p/ip_pipeline_cli.c.o
[2242/2378] Compiling C object app/test/dpdk-test.p/test_ring_perf.c.o
[2243/2378] Compiling C object app/test/dpdk-test.p/test_ring.c.o
ninja: build stopped


DPDK STV team

^ permalink raw reply	[flat|nested] only message in thread

only message in thread, other threads:[~2021-02-22  3:49 UTC | newest]

Thread overview: (only message) (download: mbox.gz / follow: Atom feed)
-- links below jump to the message on this page --
2021-02-22  3:48 [dpdk-test-report] |FAILURE| pw(88074) [v14, 4/4] examples/ifpga: add example for ifpga APIs sys_stv

automatic DPDK test reports

This inbox may be cloned and mirrored by anyone:

	git clone --mirror https://inbox.dpdk.org/test-report/0 test-report/git/0.git

	# If you have public-inbox 1.1+ installed, you may
	# initialize and index your mirror using the following commands:
	public-inbox-init -V2 test-report test-report/ https://inbox.dpdk.org/test-report \
		test-report@dpdk.org
	public-inbox-index test-report

Example config snippet for mirrors.
Newsgroup available over NNTP:
	nntp://inbox.dpdk.org/inbox.dpdk.test-report


AGPL code for this site: git clone https://public-inbox.org/public-inbox.git