automatic DPDK test reports
 help / color / mirror / Atom feed
* [dpdk-test-report] |FAILURE| pw(90746) [4/4] vhost: remove unnecessary level of indirection
@ 2021-04-06 17:06 sys_stv
  0 siblings, 0 replies; only message in thread
From: sys_stv @ 2021-04-06 17:06 UTC (permalink / raw)
  To: test-report

[-- Attachment #1: Type: text/plain, Size: 46793 bytes --]


Test-Label: Intel-compilation
Test-Status: FAILURE
http://dpdk.org/patch/90746

_Compilation issues_

Submitter: Balazs Nemeth <bnemeth@redhat.com>
Date: 2021-04-06 15:44:46
Reply_mail: e52542758fb627a709dfb03d96a164fd58135f3b.1617723339.git.bnemeth@redhat.com

DPDK git baseline: Repo:dpdk-next-virtio, CommitID: e8b09b9ce40cc0778c7a0f5cffbc8e9fead9c8d0


Meson Build Summary: 22 Builds Done, 7 Successful, 15 Failures, 0 Blocked

+------------------+------------+--------------+------------+------------+-----------+----------+
| os               | gcc-static | clang-static | icc-static | gcc-shared | gcc-debug | document |
+------------------+------------+--------------+------------+------------+-----------+----------+
| UB2004-64        | FAIL       | FAIL         | pass       |            |           | FAIL     |
| RHEL83-64        | FAIL       |              |            |            |           |          |
| FC33-64          | FAIL       | FAIL         |            |            |           |          |
| CentOsStream8-64 | FAIL       |              |            |            |           |          |
| UB2010-64        | FAIL       |              |            |            |           |          |
| WIN10-64         |            | pass         |            |            |           |          |
| UB2004-32        | FAIL       |              |            |            |           |          |
| CENTOS83-64      | FAIL       | FAIL         | pass       | FAIL       | FAIL      |          |
| FreeBSD1201-64   | pass       | pass         |            | pass       | pass      |          |
| SUSE15-64        | FAIL       | FAIL         |            |            |           |          |
+------------------+------------+--------------+------------+------------+-----------+----------+
Test environment and configuration as below:


OS: UB2004-64
	Kernel Version: 5.6.0-050600-generic
	GCC Version: gcc (Ubuntu 10-20200416-0ubuntu1) 10.0.1 20200416 (experimental) [master revision 3c3f12e2a76:dcee354ce56:44b326839d864fc10c459916abcc97f35a9ac3de]
	Clang Version: 10.0.0-4ubuntu1
	x86_64-native-linuxapp-clang
	x86_64-native-linuxapp-gcc
	x86_64-native-linuxapp-icc
	x86_64-native-linuxapp-doc

OS: RHEL83-64
	Kernel Version: 4.18.0-240.el8.x86_64
	GCC Version: gcc (GCC) 8.3.1 20191121 (Red Hat 8.3.1-5)
	Clang Version: 10.0.1 (Red Hat 10.0.1-1.module+el8.3.0+7459+90c24896)
	x86_64-native-linuxapp-gcc

OS: FC33-64
	Kernel Version: 5.8.16-300.fc33.x86_64
	GCC Version: gcc (GCC) 10.2.1 20201005 (Red Hat 10.2.1-5)
	Clang Version: 11.0.0 (Fedora 11.0.0-1.fc33)
	x86_64-native-linuxapp-gcc
	x86_64-native-linuxapp-clang

OS: CentOsStream8-64
	Kernel Version: 4.18.0-257.el8.x86_64
	GCC Version: gcc (GCC) 8.4.1 20200928 (Red Hat 8.4.1-1)
	Clang Version: 11.0.0 (Red Hat 11.0.0-0.2.rc2.module_el8.4.0+533+50191577)
	x86_64-native-linuxapp-gcc

OS: UB2010-64
	Kernel Version: 5.8.0-25-generic
	GCC Version: gcc (Ubuntu 10.2.0-13ubuntu1) 10.2.0
	Clang Version: 11.0.0-2
	x86_64-native-linuxapp-gcc

OS: WIN10-64
	Kernel Version: N/A
	GCC Version: N/A
	Clang Version: Clang 8.0.0
	x86_64-windows-clang

OS: UB2004-32
	Kernel Version: 5.6.0-050600-generic
	GCC Version: gcc (Ubuntu 9.3.0-10ubuntu2) 9.3.0
	Clang Version: 10.0.0-4ubuntu1
	i686-native-linuxapp-gcc

OS: CENTOS83-64
	Kernel Version: 4.18.0-240.1.1.el8_3.x86_64
	GCC Version: gcc (GCC) 8.3.1 20191121 (Red Hat 8.3.1-5)
	Clang Version: 10.0.1 (Red Hat 10.0.1-1.module_el8.3.0+467+cb298d5b)
	x86_64-native-linuxapp-gcc
	x86_64-native-linuxapp-clang
	x86_64-native-linuxapp-icc
	x86_64-native-linuxapp-gcc+shared
	x86_64-native-linuxapp-gcc+debug

OS: FreeBSD1201-64
	Kernel Version: 12.1-RELEASE
	GCC Version: gcc (FreeBSD Ports Collection) 9.2.0
	Clang Version: 8.0.1 (tags/RELEASE_801/final 366581) (based on LLVM 8.0.1)
	x86_64-native-bsdapp-gcc
	x86_64-native-bsdapp-clang
	x86_64-native-bsdapp-gcc+shared
	x86_64-native-bsdapp-gcc+debug

OS: SUSE15-64
	Kernel Version: 5.3.18-lp152.57-default
	GCC Version: gcc (SUSE Linux) 7.5.0
	Clang Version: 9.0.1
	x86_64-native-linuxapp-clang
	x86_64-native-linuxapp-gcc



*Build Failed #1:
OS: CENTOS83-64
Target: x86_64-native-linuxapp-gcc
FAILED: lib/librte_vhost.a.p/librte_vhost_virtio_net.c.o 
gcc -Ilib/librte_vhost.a.p -Ilib -I../lib -Ilib/librte_vhost -I../lib/librte_vhost -I. -I.. -Iconfig -I../config -Ilib/librte_eal/include -I../lib/librte_eal/include -Ilib/librte_eal/linux/include -I../lib/librte_eal/linux/include -Ilib/librte_eal/x86/include -I../lib/librte_eal/x86/include -Ilib/librte_eal/common -I../lib/librte_eal/common -Ilib/librte_eal -I../lib/librte_eal -Ilib/librte_kvargs -I../lib/librte_kvargs -Ilib/librte_metrics -I../lib/librte_metrics -Ilib/librte_telemetry -I../lib/librte_telemetry -Ilib/librte_ethdev -I../lib/librte_ethdev -Ilib/librte_net -I../lib/librte_net -Ilib/librte_mbuf -I../lib/librte_mbuf -Ilib/librte_mempool -I../lib/librte_mempool -Ilib/librte_ring -I../lib/librte_ring -Ilib/librte_meter -I../lib/librte_meter -Ilib/librte_cryptodev -I../lib/librte_cryptodev -Ilib/librte_rcu -I../lib/librte_rcu -Ilib/librte_hash -I../lib/librte_hash -Ilib/librte_pci -I../lib/librte_pci -fdiagnostics-color=always -pipe -D_FILE_OFFSET_BITS=64 -Wall -Winvalid-pch -Werror -O3 -include rte_config.h -Wextra -Wcast-qual -Wdeprecated -Wformat -Wformat-nonliteral -Wformat-security -Wmissing-declarations -Wmissing-prototypes -Wnested-externs -Wold-style-definition -Wpointer-arith -Wsign-compare -Wstrict-prototypes -Wundef -Wwrite-strings -Wno-packed-not-aligned -Wno-missing-field-initializers -D_GNU_SOURCE -fPIC -march=native -DALLOW_EXPERIMENTAL_API -DALLOW_INTERNAL_API -Wno-format-truncation -DVHOST_GCC_UNROLL_PRAGMA -fno-strict-aliasing -MD -MQ lib/librte_vhost.a.p/librte_vhost_virtio_net.c.o -MF lib/librte_vhost.a.p/librte_vhost_virtio_net.c.o.d -o lib/librte_vhost.a.p/librte_vhost_virtio_net.c.o -c ../lib/librte_vhost/virtio_net.c
../lib/librte_vhost/virtio_net.c: In function ‘virtio_dev_tx_packed’:
../lib/librte_vhost/virtio_net.c:2472:11: error: unused variable ‘i’ [-Werror=unused-variable]
  uint16_t i;
           ^
cc1: all warnings being treated as errors
[496/2848] Compiling C object lib/librte_pipeline.a.p/librte_pipeline_rte_swx_ctl.c.o
[497/2848] Compiling C object lib/librte_pipeline.a.p/librte_pipeline_rte_swx_pipeline.c.o
[498/2848] Linking target lib/librte_fib.so.21.2
[499/2848] Generating rte_flow_classify_mingw with a custom command
[500/2848] Generating port.sym_chk with a meson_exe.py custom command
[501/2848] Generating table.sym_chk with a meson_exe.py custom command
[502/2848] Compiling C object lib/librte_bpf.a.p/librte_bpf_bpf.c.o
[503/2848] Compiling C object lib/librte_flow_classify.a.p/librte_flow_classify_rte_flow_classify.c.o
[504/2848] Compiling C object lib/librte_bpf.a.p/librte_bpf_bpf_exec.c.o
[505/2848] Compiling C object lib/librte_flow_classify.a.p/librte_flow_classify_rte_flow_classify_parse.c.o
[506/2848] Compiling C object lib/librte_pipeline.a.p/librte_pipeline_rte_table_action.c.o
ninja: build stopped




*Build Failed #2:
OS: CENTOS83-64
Target: x86_64-native-linuxapp-clang
FAILED: lib/librte_vhost.a.p/librte_vhost_virtio_net.c.o 
clang -Ilib/librte_vhost.a.p -Ilib -I../lib -Ilib/librte_vhost -I../lib/librte_vhost -I. -I.. -Iconfig -I../config -Ilib/librte_eal/include -I../lib/librte_eal/include -Ilib/librte_eal/linux/include -I../lib/librte_eal/linux/include -Ilib/librte_eal/x86/include -I../lib/librte_eal/x86/include -Ilib/librte_eal/common -I../lib/librte_eal/common -Ilib/librte_eal -I../lib/librte_eal -Ilib/librte_kvargs -I../lib/librte_kvargs -Ilib/librte_metrics -I../lib/librte_metrics -Ilib/librte_telemetry -I../lib/librte_telemetry -Ilib/librte_ethdev -I../lib/librte_ethdev -Ilib/librte_net -I../lib/librte_net -Ilib/librte_mbuf -I../lib/librte_mbuf -Ilib/librte_mempool -I../lib/librte_mempool -Ilib/librte_ring -I../lib/librte_ring -Ilib/librte_meter -I../lib/librte_meter -Ilib/librte_cryptodev -I../lib/librte_cryptodev -Ilib/librte_rcu -I../lib/librte_rcu -Ilib/librte_hash -I../lib/librte_hash -Ilib/librte_pci -I../lib/librte_pci -Xclang -fcolor-diagnostics -pipe -D_FILE_OFFSET_BITS=64 -Wall -Winvalid-pch -Werror -O3 -include rte_config.h -Wextra -Wcast-qual -Wdeprecated -Wformat -Wformat-nonliteral -Wformat-security -Wmissing-declarations -Wmissing-prototypes -Wnested-externs -Wold-style-definition -Wpointer-arith -Wsign-compare -Wstrict-prototypes -Wundef -Wwrite-strings -Wno-address-of-packed-member -Wno-missing-field-initializers -D_GNU_SOURCE -fPIC -march=native -DALLOW_EXPERIMENTAL_API -DALLOW_INTERNAL_API -DVHOST_CLANG_UNROLL_PRAGMA -fno-strict-aliasing -MD -MQ lib/librte_vhost.a.p/librte_vhost_virtio_net.c.o -MF lib/librte_vhost.a.p/librte_vhost_virtio_net.c.o.d -o lib/librte_vhost.a.p/librte_vhost_virtio_net.c.o -c ../lib/librte_vhost/virtio_net.c
../lib/librte_vhost/virtio_net.c:2472:11: error: unused variable 'i' [-Werror,-Wunused-variable]
        uint16_t i;
                 ^
1 error generated.
[432/2851] Generating sched.sym_chk with a meson_exe.py custom command
[433/2851] Compiling C object lib/librte_ipsec.a.p/librte_ipsec_ipsec_sad.c.o
[434/2851] Compiling C object lib/librte_vhost.a.p/librte_vhost_vhost.c.o
[435/2851] Compiling C object lib/librte_ipsec.a.p/librte_ipsec_sa.c.o
[436/2851] Compiling C object lib/librte_ipsec.a.p/librte_ipsec_ses.c.o
[437/2851] Compiling C object lib/librte_vhost.a.p/librte_vhost_vhost_user.c.o
[438/2851] Compiling C object lib/librte_ipsec.a.p/librte_ipsec_esp_outb.c.o
[439/2851] Compiling C object lib/librte_ipsec.a.p/librte_ipsec_esp_inb.c.o
[440/2851] Compiling C object lib/librte_vhost.a.p/librte_vhost_vhost_crypto.c.o
ninja: build stopped




*Build Failed #3:
OS: CENTOS83-64
Target: x86_64-native-linuxapp-gcc+shared
FAILED: lib/librte_vhost.a.p/librte_vhost_virtio_net.c.o 
gcc -Ilib/librte_vhost.a.p -Ilib -I../lib -Ilib/librte_vhost -I../lib/librte_vhost -I. -I.. -Iconfig -I../config -Ilib/librte_eal/include -I../lib/librte_eal/include -Ilib/librte_eal/linux/include -I../lib/librte_eal/linux/include -Ilib/librte_eal/x86/include -I../lib/librte_eal/x86/include -Ilib/librte_eal/common -I../lib/librte_eal/common -Ilib/librte_eal -I../lib/librte_eal -Ilib/librte_kvargs -I../lib/librte_kvargs -Ilib/librte_metrics -I../lib/librte_metrics -Ilib/librte_telemetry -I../lib/librte_telemetry -Ilib/librte_ethdev -I../lib/librte_ethdev -Ilib/librte_net -I../lib/librte_net -Ilib/librte_mbuf -I../lib/librte_mbuf -Ilib/librte_mempool -I../lib/librte_mempool -Ilib/librte_ring -I../lib/librte_ring -Ilib/librte_meter -I../lib/librte_meter -Ilib/librte_cryptodev -I../lib/librte_cryptodev -Ilib/librte_rcu -I../lib/librte_rcu -Ilib/librte_hash -I../lib/librte_hash -Ilib/librte_pci -I../lib/librte_pci -fdiagnostics-color=always -pipe -D_FILE_OFFSET_BITS=64 -Wall -Winvalid-pch -Werror -O3 -include rte_config.h -Wextra -Wcast-qual -Wdeprecated -Wformat -Wformat-nonliteral -Wformat-security -Wmissing-declarations -Wmissing-prototypes -Wnested-externs -Wold-style-definition -Wpointer-arith -Wsign-compare -Wstrict-prototypes -Wundef -Wwrite-strings -Wno-packed-not-aligned -Wno-missing-field-initializers -D_GNU_SOURCE -fPIC -march=native -DALLOW_EXPERIMENTAL_API -DALLOW_INTERNAL_API -Wno-format-truncation -DVHOST_GCC_UNROLL_PRAGMA -fno-strict-aliasing -MD -MQ lib/librte_vhost.a.p/librte_vhost_virtio_net.c.o -MF lib/librte_vhost.a.p/librte_vhost_virtio_net.c.o.d -o lib/librte_vhost.a.p/librte_vhost_virtio_net.c.o -c ../lib/librte_vhost/virtio_net.c
../lib/librte_vhost/virtio_net.c: In function ‘virtio_dev_tx_packed’:
../lib/librte_vhost/virtio_net.c:2472:11: error: unused variable ‘i’ [-Werror=unused-variable]
  uint16_t i;
           ^
cc1: all warnings being treated as errors
[514/2684] Compiling C object lib/librte_bpf.a.p/librte_bpf_bpf.c.o
[515/2684] Compiling C object lib/librte_bpf.a.p/librte_bpf_bpf_load.c.o
[516/2684] Generating table.sym_chk with a meson_exe.py custom command
[517/2684] Compiling C object lib/librte_flow_classify.a.p/librte_flow_classify_rte_flow_classify.c.o
[518/2684] Compiling C object drivers/libtmp_rte_net_bnxt.a.p/net_bnxt_bnxt_txr.c.o
[519/2684] Generating symbol file lib/librte_port.so.21.2.p/librte_port.so.21.2.symbols
[520/2684] Compiling C object lib/librte_bpf.a.p/librte_bpf_bpf_exec.c.o
[521/2684] Compiling C object lib/librte_bpf.a.p/librte_bpf_bpf_validate.c.o
[522/2684] Compiling C object lib/librte_pipeline.a.p/librte_pipeline_rte_swx_pipeline.c.o
[523/2684] Compiling C object lib/librte_vhost.a.p/librte_vhost_vhost_crypto.c.o
[524/2684] Compiling C object lib/librte_pipeline.a.p/librte_pipeline_rte_table_action.c.o
ninja: build stopped




*Build Failed #4:
OS: CENTOS83-64
Target: x86_64-native-linuxapp-gcc+debug
FAILED: lib/librte_vhost.a.p/librte_vhost_virtio_net.c.o 
gcc -Ilib/librte_vhost.a.p -Ilib -I../lib -Ilib/librte_vhost -I../lib/librte_vhost -I. -I.. -Iconfig -I../config -Ilib/librte_eal/include -I../lib/librte_eal/include -Ilib/librte_eal/linux/include -I../lib/librte_eal/linux/include -Ilib/librte_eal/x86/include -I../lib/librte_eal/x86/include -Ilib/librte_eal/common -I../lib/librte_eal/common -Ilib/librte_eal -I../lib/librte_eal -Ilib/librte_kvargs -I../lib/librte_kvargs -Ilib/librte_metrics -I../lib/librte_metrics -Ilib/librte_telemetry -I../lib/librte_telemetry -Ilib/librte_ethdev -I../lib/librte_ethdev -Ilib/librte_net -I../lib/librte_net -Ilib/librte_mbuf -I../lib/librte_mbuf -Ilib/librte_mempool -I../lib/librte_mempool -Ilib/librte_ring -I../lib/librte_ring -Ilib/librte_meter -I../lib/librte_meter -Ilib/librte_cryptodev -I../lib/librte_cryptodev -Ilib/librte_rcu -I../lib/librte_rcu -Ilib/librte_hash -I../lib/librte_hash -Ilib/librte_pci -I../lib/librte_pci -fdiagnostics-color=always -pipe -D_FILE_OFFSET_BITS=64 -Wall -Winvalid-pch -Werror -O2 -g -include rte_config.h -Wextra -Wcast-qual -Wdeprecated -Wformat -Wformat-nonliteral -Wformat-security -Wmissing-declarations -Wmissing-prototypes -Wnested-externs -Wold-style-definition -Wpointer-arith -Wsign-compare -Wstrict-prototypes -Wundef -Wwrite-strings -Wno-packed-not-aligned -Wno-missing-field-initializers -D_GNU_SOURCE -fPIC -march=native -DALLOW_EXPERIMENTAL_API -DALLOW_INTERNAL_API -Wno-format-truncation -DVHOST_GCC_UNROLL_PRAGMA -fno-strict-aliasing -MD -MQ lib/librte_vhost.a.p/librte_vhost_virtio_net.c.o -MF lib/librte_vhost.a.p/librte_vhost_virtio_net.c.o.d -o lib/librte_vhost.a.p/librte_vhost_virtio_net.c.o -c ../lib/librte_vhost/virtio_net.c
../lib/librte_vhost/virtio_net.c: In function ‘virtio_dev_tx_packed’:
../lib/librte_vhost/virtio_net.c:2472:11: error: unused variable ‘i’ [-Werror=unused-variable]
  uint16_t i;
           ^
cc1: all warnings being treated as errors
[502/2851] Generating symbol file lib/librte_table.so.21.2.p/librte_table.so.21.2.symbols
[503/2851] Compiling C object lib/librte_pipeline.a.p/librte_pipeline_rte_pipeline.c.o
[504/2851] Compiling C object lib/librte_flow_classify.a.p/librte_flow_classify_rte_flow_classify_parse.c.o
[505/2851] Compiling C object drivers/libtmp_rte_net_bnxt.a.p/net_bnxt_bnxt_txr.c.o
[506/2851] Compiling C object lib/librte_flow_classify.a.p/librte_flow_classify_rte_flow_classify.c.o
[507/2851] Compiling C object lib/librte_bpf.a.p/librte_bpf_bpf_exec.c.o
[508/2851] Compiling C object lib/librte_pipeline.a.p/librte_pipeline_rte_swx_pipeline.c.o
[509/2851] Compiling C object lib/librte_vhost.a.p/librte_vhost_vhost_crypto.c.o
[510/2851] Compiling C object lib/librte_pipeline.a.p/librte_pipeline_rte_table_action.c.o
ninja: build stopped




*Build Failed #5:
OS: FC33-64
Target: x86_64-native-linuxapp-gcc
FAILED: lib/librte_vhost.a.p/librte_vhost_virtio_net.c.o 
gcc -Ilib/librte_vhost.a.p -Ilib -I../lib -Ilib/librte_vhost -I../lib/librte_vhost -I. -I.. -Iconfig -I../config -Ilib/librte_eal/include -I../lib/librte_eal/include -Ilib/librte_eal/linux/include -I../lib/librte_eal/linux/include -Ilib/librte_eal/x86/include -I../lib/librte_eal/x86/include -Ilib/librte_eal/common -I../lib/librte_eal/common -Ilib/librte_eal -I../lib/librte_eal -Ilib/librte_kvargs -I../lib/librte_kvargs -Ilib/librte_metrics -I../lib/librte_metrics -Ilib/librte_telemetry -I../lib/librte_telemetry -Ilib/librte_ethdev -I../lib/librte_ethdev -Ilib/librte_net -I../lib/librte_net -Ilib/librte_mbuf -I../lib/librte_mbuf -Ilib/librte_mempool -I../lib/librte_mempool -Ilib/librte_ring -I../lib/librte_ring -Ilib/librte_meter -I../lib/librte_meter -Ilib/librte_cryptodev -I../lib/librte_cryptodev -Ilib/librte_rcu -I../lib/librte_rcu -Ilib/librte_hash -I../lib/librte_hash -Ilib/librte_pci -I../lib/librte_pci -fdiagnostics-color=always -pipe -D_FILE_OFFSET_BITS=64 -Wall -Winvalid-pch -Werror -O3 -include rte_config.h -Wextra -Wcast-qual -Wdeprecated -Wformat -Wformat-nonliteral -Wformat-security -Wmissing-declarations -Wmissing-prototypes -Wnested-externs -Wold-style-definition -Wpointer-arith -Wsign-compare -Wstrict-prototypes -Wundef -Wwrite-strings -Wno-address-of-packed-member -Wno-packed-not-aligned -Wno-missing-field-initializers -Wno-zero-length-bounds -D_GNU_SOURCE -fPIC -march=native -DALLOW_EXPERIMENTAL_API -DALLOW_INTERNAL_API -Wno-format-truncation -DVHOST_GCC_UNROLL_PRAGMA -fno-strict-aliasing -MD -MQ lib/librte_vhost.a.p/librte_vhost_virtio_net.c.o -MF lib/librte_vhost.a.p/librte_vhost_virtio_net.c.o.d -o lib/librte_vhost.a.p/librte_vhost_virtio_net.c.o -c ../lib/librte_vhost/virtio_net.c
../lib/librte_vhost/virtio_net.c: In function ‘virtio_dev_tx_packed’:
../lib/librte_vhost/virtio_net.c:2472:11: error: unused variable ‘i’ [-Werror=unused-variable]
 2472 |  uint16_t i;
      |           ^
cc1: all warnings being treated as errors
[504/2850] Compiling C object lib/librte_flow_classify.a.p/librte_flow_classify_rte_flow_classify_parse.c.o
[505/2850] Compiling C object drivers/libtmp_rte_net_bnxt.a.p/net_bnxt_bnxt_vnic.c.o
[506/2850] Compiling C object lib/librte_flow_classify.a.p/librte_flow_classify_rte_flow_classify.c.o
[507/2850] Generating symbol file lib/librte_table.so.21.2.p/librte_table.so.21.2.symbols
[508/2850] Compiling C object drivers/libtmp_rte_net_bnxt.a.p/net_bnxt_bnxt_txr.c.o
[509/2850] Compiling C object lib/librte_bpf.a.p/librte_bpf_bpf_load.c.o
[510/2850] Compiling C object lib/librte_bpf.a.p/librte_bpf_bpf_exec.c.o
[511/2850] Compiling C object lib/librte_bpf.a.p/librte_bpf_bpf_pkt.c.o
[512/2850] Compiling C object lib/librte_pipeline.a.p/librte_pipeline_rte_swx_pipeline.c.o
[513/2850] Compiling C object lib/librte_vhost.a.p/librte_vhost_vhost_crypto.c.o
[514/2850] Compiling C object lib/librte_pipeline.a.p/librte_pipeline_rte_table_action.c.o
ninja: build stopped




*Build Failed #6:
OS: FC33-64
Target: x86_64-native-linuxapp-clang
FAILED: lib/librte_vhost.a.p/librte_vhost_virtio_net.c.o 
clang -Ilib/librte_vhost.a.p -Ilib -I../lib -Ilib/librte_vhost -I../lib/librte_vhost -I. -I.. -Iconfig -I../config -Ilib/librte_eal/include -I../lib/librte_eal/include -Ilib/librte_eal/linux/include -I../lib/librte_eal/linux/include -Ilib/librte_eal/x86/include -I../lib/librte_eal/x86/include -Ilib/librte_eal/common -I../lib/librte_eal/common -Ilib/librte_eal -I../lib/librte_eal -Ilib/librte_kvargs -I../lib/librte_kvargs -Ilib/librte_metrics -I../lib/librte_metrics -Ilib/librte_telemetry -I../lib/librte_telemetry -Ilib/librte_ethdev -I../lib/librte_ethdev -Ilib/librte_net -I../lib/librte_net -Ilib/librte_mbuf -I../lib/librte_mbuf -Ilib/librte_mempool -I../lib/librte_mempool -Ilib/librte_ring -I../lib/librte_ring -Ilib/librte_meter -I../lib/librte_meter -Ilib/librte_cryptodev -I../lib/librte_cryptodev -Ilib/librte_rcu -I../lib/librte_rcu -Ilib/librte_hash -I../lib/librte_hash -Ilib/librte_pci -I../lib/librte_pci -Xclang -fcolor-diagnostics -pipe -D_FILE_OFFSET_BITS=64 -Wall -Winvalid-pch -Werror -O3 -include rte_config.h -Wextra -Wcast-qual -Wdeprecated -Wformat -Wformat-nonliteral -Wformat-security -Wmissing-declarations -Wmissing-prototypes -Wnested-externs -Wold-style-definition -Wpointer-arith -Wsign-compare -Wstrict-prototypes -Wundef -Wwrite-strings -Wno-address-of-packed-member -Wno-missing-field-initializers -D_GNU_SOURCE -fPIC -march=native -DALLOW_EXPERIMENTAL_API -DALLOW_INTERNAL_API -DVHOST_CLANG_UNROLL_PRAGMA -fno-strict-aliasing -MD -MQ lib/librte_vhost.a.p/librte_vhost_virtio_net.c.o -MF lib/librte_vhost.a.p/librte_vhost_virtio_net.c.o.d -o lib/librte_vhost.a.p/librte_vhost_virtio_net.c.o -c ../lib/librte_vhost/virtio_net.c
../lib/librte_vhost/virtio_net.c:2472:11: error: unused variable 'i' [-Werror,-Wunused-variable]
        uint16_t i;
                 ^
1 error generated.
[432/2850] Generating symbol file lib/librte_rib.so.21.2.p/librte_rib.so.21.2.symbols
[433/2850] Generating symbol file lib/librte_sched.so.21.2.p/librte_sched.so.21.2.symbols
[434/2850] Compiling C object lib/librte_vhost.a.p/librte_vhost_vhost.c.o
[435/2850] Compiling C object lib/librte_ipsec.a.p/librte_ipsec_esp_inb.c.o
[436/2850] Compiling C object lib/librte_ipsec.a.p/librte_ipsec_sa.c.o
[437/2850] Compiling C object lib/librte_vhost.a.p/librte_vhost_vhost_user.c.o
[438/2850] Compiling C object lib/librte_ipsec.a.p/librte_ipsec_ses.c.o
[439/2850] Compiling C object lib/librte_ipsec.a.p/librte_ipsec_esp_outb.c.o
[440/2850] Compiling C object lib/librte_vhost.a.p/librte_vhost_vhost_crypto.c.o
ninja: build stopped




*Build Failed #7:
OS: RHEL83-64
Target: x86_64-native-linuxapp-gcc
FAILED: lib/librte_vhost.a.p/librte_vhost_virtio_net.c.o 
gcc -Ilib/librte_vhost.a.p -Ilib -I../lib -Ilib/librte_vhost -I../lib/librte_vhost -I. -I.. -Iconfig -I../config -Ilib/librte_eal/include -I../lib/librte_eal/include -Ilib/librte_eal/linux/include -I../lib/librte_eal/linux/include -Ilib/librte_eal/x86/include -I../lib/librte_eal/x86/include -Ilib/librte_eal/common -I../lib/librte_eal/common -Ilib/librte_eal -I../lib/librte_eal -Ilib/librte_kvargs -I../lib/librte_kvargs -Ilib/librte_metrics -I../lib/librte_metrics -Ilib/librte_telemetry -I../lib/librte_telemetry -Ilib/librte_ethdev -I../lib/librte_ethdev -Ilib/librte_net -I../lib/librte_net -Ilib/librte_mbuf -I../lib/librte_mbuf -Ilib/librte_mempool -I../lib/librte_mempool -Ilib/librte_ring -I../lib/librte_ring -Ilib/librte_meter -I../lib/librte_meter -Ilib/librte_cryptodev -I../lib/librte_cryptodev -Ilib/librte_rcu -I../lib/librte_rcu -Ilib/librte_hash -I../lib/librte_hash -Ilib/librte_pci -I../lib/librte_pci -fdiagnostics-color=always -pipe -D_FILE_OFFSET_BITS=64 -Wall -Winvalid-pch -Werror -O3 -include rte_config.h -Wextra -Wcast-qual -Wdeprecated -Wformat -Wformat-nonliteral -Wformat-security -Wmissing-declarations -Wmissing-prototypes -Wnested-externs -Wold-style-definition -Wpointer-arith -Wsign-compare -Wstrict-prototypes -Wundef -Wwrite-strings -Wno-packed-not-aligned -Wno-missing-field-initializers -D_GNU_SOURCE -fPIC -march=native -DALLOW_EXPERIMENTAL_API -DALLOW_INTERNAL_API -Wno-format-truncation -DVHOST_GCC_UNROLL_PRAGMA -fno-strict-aliasing -MD -MQ lib/librte_vhost.a.p/librte_vhost_virtio_net.c.o -MF lib/librte_vhost.a.p/librte_vhost_virtio_net.c.o.d -o lib/librte_vhost.a.p/librte_vhost_virtio_net.c.o -c ../lib/librte_vhost/virtio_net.c
../lib/librte_vhost/virtio_net.c: In function ‘virtio_dev_tx_packed’:
../lib/librte_vhost/virtio_net.c:2472:11: error: unused variable ‘i’ [-Werror=unused-variable]
  uint16_t i;
           ^
cc1: all warnings being treated as errors
[492/2851] Generating rte_pipeline_mingw with a custom command
[493/2851] Generating port.sym_chk with a custom command (wrapped by meson to capture output)
[494/2851] Compiling C object lib/librte_pipeline.a.p/librte_pipeline_rte_swx_ctl.c.o
[495/2851] Compiling C object lib/librte_pipeline.a.p/librte_pipeline_rte_swx_pipeline_spec.c.o
[496/2851] Generating table.sym_chk with a custom command (wrapped by meson to capture output)
[497/2851] Compiling C object lib/librte_pipeline.a.p/librte_pipeline_rte_pipeline.c.o
[498/2851] Compiling C object lib/librte_pipeline.a.p/librte_pipeline_rte_swx_pipeline.c.o
[499/2851] Compiling C object lib/librte_vhost.a.p/librte_vhost_vhost_crypto.c.o
[500/2851] Compiling C object lib/librte_pipeline.a.p/librte_pipeline_rte_table_action.c.o
ninja: build stopped




*Build Failed #8:
OS: SUSE15-64
Target: x86_64-native-linuxapp-clang
FAILED: lib/librte_vhost.a.p/librte_vhost_virtio_net.c.o 
clang -Ilib/librte_vhost.a.p -Ilib -I../lib -Ilib/librte_vhost -I../lib/librte_vhost -I. -I.. -Iconfig -I../config -Ilib/librte_eal/include -I../lib/librte_eal/include -Ilib/librte_eal/linux/include -I../lib/librte_eal/linux/include -Ilib/librte_eal/x86/include -I../lib/librte_eal/x86/include -Ilib/librte_eal/common -I../lib/librte_eal/common -Ilib/librte_eal -I../lib/librte_eal -Ilib/librte_kvargs -I../lib/librte_kvargs -Ilib/librte_metrics -I../lib/librte_metrics -Ilib/librte_telemetry -I../lib/librte_telemetry -Ilib/librte_ethdev -I../lib/librte_ethdev -Ilib/librte_net -I../lib/librte_net -Ilib/librte_mbuf -I../lib/librte_mbuf -Ilib/librte_mempool -I../lib/librte_mempool -Ilib/librte_ring -I../lib/librte_ring -Ilib/librte_meter -I../lib/librte_meter -Ilib/librte_cryptodev -I../lib/librte_cryptodev -Ilib/librte_rcu -I../lib/librte_rcu -Ilib/librte_hash -I../lib/librte_hash -Ilib/librte_pci -I../lib/librte_pci -Xclang -fcolor-diagnostics -pipe -D_FILE_OFFSET_BITS=64 -Wall -Winvalid-pch -Werror -O3 -include rte_config.h -Wextra -Wcast-qual -Wdeprecated -Wformat -Wformat-nonliteral -Wformat-security -Wmissing-declarations -Wmissing-prototypes -Wnested-externs -Wold-style-definition -Wpointer-arith -Wsign-compare -Wstrict-prototypes -Wundef -Wwrite-strings -Wno-address-of-packed-member -Wno-missing-field-initializers -D_GNU_SOURCE -fPIC -march=native -DALLOW_EXPERIMENTAL_API -DALLOW_INTERNAL_API -DVHOST_CLANG_UNROLL_PRAGMA -fno-strict-aliasing -MD -MQ lib/librte_vhost.a.p/librte_vhost_virtio_net.c.o -MF lib/librte_vhost.a.p/librte_vhost_virtio_net.c.o.d -o lib/librte_vhost.a.p/librte_vhost_virtio_net.c.o -c ../lib/librte_vhost/virtio_net.c
../lib/librte_vhost/virtio_net.c:2472:11: error: unused variable 'i' [-Werror,-Wunused-variable]
        uint16_t i;
                 ^
1 error generated.
[430/2807] Generating symbol file lib/librte_sched.so.21.2.p/librte_sched.so.21.2.symbols
[431/2807] Compiling C object lib/librte_vhost.a.p/librte_vhost_vhost.c.o
[432/2807] Generating symbol file lib/librte_rib.so.21.2.p/librte_rib.so.21.2.symbols
[433/2807] Compiling C object lib/librte_ipsec.a.p/librte_ipsec_sa.c.o
[434/2807] Compiling C object lib/librte_vhost.a.p/librte_vhost_vhost_user.c.o
[435/2807] Compiling C object lib/librte_ipsec.a.p/librte_ipsec_ses.c.o
[436/2807] Compiling C object lib/librte_ipsec.a.p/librte_ipsec_esp_inb.c.o
[437/2807] Compiling C object lib/librte_ipsec.a.p/librte_ipsec_esp_outb.c.o
[438/2807] Compiling C object lib/librte_vhost.a.p/librte_vhost_vhost_crypto.c.o
ninja: build stopped




*Build Failed #9:
OS: SUSE15-64
Target: x86_64-native-linuxapp-gcc
FAILED: lib/librte_vhost.a.p/librte_vhost_virtio_net.c.o 
gcc -Ilib/librte_vhost.a.p -Ilib -I../lib -Ilib/librte_vhost -I../lib/librte_vhost -I. -I.. -Iconfig -I../config -Ilib/librte_eal/include -I../lib/librte_eal/include -Ilib/librte_eal/linux/include -I../lib/librte_eal/linux/include -Ilib/librte_eal/x86/include -I../lib/librte_eal/x86/include -Ilib/librte_eal/common -I../lib/librte_eal/common -Ilib/librte_eal -I../lib/librte_eal -Ilib/librte_kvargs -I../lib/librte_kvargs -Ilib/librte_metrics -I../lib/librte_metrics -Ilib/librte_telemetry -I../lib/librte_telemetry -Ilib/librte_ethdev -I../lib/librte_ethdev -Ilib/librte_net -I../lib/librte_net -Ilib/librte_mbuf -I../lib/librte_mbuf -Ilib/librte_mempool -I../lib/librte_mempool -Ilib/librte_ring -I../lib/librte_ring -Ilib/librte_meter -I../lib/librte_meter -Ilib/librte_cryptodev -I../lib/librte_cryptodev -Ilib/librte_rcu -I../lib/librte_rcu -Ilib/librte_hash -I../lib/librte_hash -Ilib/librte_pci -I../lib/librte_pci -fdiagnostics-color=always -pipe -D_FILE_OFFSET_BITS=64 -Wall -Winvalid-pch -Werror -O3 -include rte_config.h -Wextra -Wcast-qual -Wdeprecated -Wformat -Wformat-nonliteral -Wformat-security -Wmissing-declarations -Wmissing-prototypes -Wnested-externs -Wold-style-definition -Wpointer-arith -Wsign-compare -Wstrict-prototypes -Wundef -Wwrite-strings -Wno-missing-field-initializers -D_GNU_SOURCE -fPIC -march=native -DALLOW_EXPERIMENTAL_API -DALLOW_INTERNAL_API -Wno-format-truncation -fno-strict-aliasing -MD -MQ lib/librte_vhost.a.p/librte_vhost_virtio_net.c.o -MF lib/librte_vhost.a.p/librte_vhost_virtio_net.c.o.d -o lib/librte_vhost.a.p/librte_vhost_virtio_net.c.o -c ../lib/librte_vhost/virtio_net.c
../lib/librte_vhost/virtio_net.c: In function ‘virtio_dev_tx_packed’:
../lib/librte_vhost/virtio_net.c:2472:11: error: unused variable ‘i’ [-Werror=unused-variable]
  uint16_t i;
           ^
cc1: all warnings being treated as errors
[468/2774] Compiling C object lib/librte_port.a.p/librte_port_rte_port_kni.c.o
[469/2774] Compiling C object lib/librte_table.a.p/librte_table_rte_table_acl.c.o
[470/2774] Compiling C object lib/librte_table.a.p/librte_table_rte_table_lpm.c.o
[471/2774] Generating fib.sym_chk with a custom command (wrapped by meson to capture output)
[472/2774] Compiling C object lib/librte_table.a.p/librte_table_rte_table_lpm_ipv6.c.o
[473/2774] Compiling C object lib/librte_port.a.p/librte_port_rte_port_ring.c.o
[474/2774] Compiling C object lib/librte_vhost.a.p/librte_vhost_vhost_crypto.c.o
ninja: build stopped




*Build Failed #10:
OS: CentOsStream8-64
Target: x86_64-native-linuxapp-gcc
FAILED: lib/librte_vhost.a.p/librte_vhost_virtio_net.c.o 
gcc -Ilib/librte_vhost.a.p -Ilib -I../lib -Ilib/librte_vhost -I../lib/librte_vhost -I. -I.. -Iconfig -I../config -Ilib/librte_eal/include -I../lib/librte_eal/include -Ilib/librte_eal/linux/include -I../lib/librte_eal/linux/include -Ilib/librte_eal/x86/include -I../lib/librte_eal/x86/include -Ilib/librte_eal/common -I../lib/librte_eal/common -Ilib/librte_eal -I../lib/librte_eal -Ilib/librte_kvargs -I../lib/librte_kvargs -Ilib/librte_metrics -I../lib/librte_metrics -Ilib/librte_telemetry -I../lib/librte_telemetry -Ilib/librte_ethdev -I../lib/librte_ethdev -Ilib/librte_net -I../lib/librte_net -Ilib/librte_mbuf -I../lib/librte_mbuf -Ilib/librte_mempool -I../lib/librte_mempool -Ilib/librte_ring -I../lib/librte_ring -Ilib/librte_meter -I../lib/librte_meter -Ilib/librte_cryptodev -I../lib/librte_cryptodev -Ilib/librte_rcu -I../lib/librte_rcu -Ilib/librte_hash -I../lib/librte_hash -Ilib/librte_pci -I../lib/librte_pci -fdiagnostics-color=always -pipe -D_FILE_OFFSET_BITS=64 -Wall -Winvalid-pch -Werror -O3 -include rte_config.h -Wextra -Wcast-qual -Wdeprecated -Wformat -Wformat-nonliteral -Wformat-security -Wmissing-declarations -Wmissing-prototypes -Wnested-externs -Wold-style-definition -Wpointer-arith -Wsign-compare -Wstrict-prototypes -Wundef -Wwrite-strings -Wno-packed-not-aligned -Wno-missing-field-initializers -D_GNU_SOURCE -fPIC -march=native -DALLOW_EXPERIMENTAL_API -DALLOW_INTERNAL_API -Wno-format-truncation -DVHOST_GCC_UNROLL_PRAGMA -fno-strict-aliasing -MD -MQ lib/librte_vhost.a.p/librte_vhost_virtio_net.c.o -MF lib/librte_vhost.a.p/librte_vhost_virtio_net.c.o.d -o lib/librte_vhost.a.p/librte_vhost_virtio_net.c.o -c ../lib/librte_vhost/virtio_net.c
../lib/librte_vhost/virtio_net.c: In function ‘virtio_dev_tx_packed’:
../lib/librte_vhost/virtio_net.c:2472:11: error: unused variable ‘i’ [-Werror=unused-variable]
  uint16_t i;
           ^
cc1: all warnings being treated as errors
[501/2841] Compiling C object lib/librte_flow_classify.a.p/librte_flow_classify_rte_flow_classify_parse.c.o
[502/2841] Linking target lib/librte_port.so.21.2
[503/2841] Compiling C object lib/librte_bpf.a.p/librte_bpf_bpf.c.o
[504/2841] Compiling C object lib/librte_flow_classify.a.p/librte_flow_classify_rte_flow_classify.c.o
[505/2841] Compiling C object drivers/libtmp_rte_net_bnxt.a.p/net_bnxt_bnxt_txr.c.o
[506/2841] Compiling C object lib/librte_bpf.a.p/librte_bpf_bpf_exec.c.o
[507/2841] Compiling C object lib/librte_bpf.a.p/librte_bpf_bpf_load.c.o
[508/2841] Compiling C object lib/librte_bpf.a.p/librte_bpf_bpf_pkt.c.o
[509/2841] Compiling C object lib/librte_pipeline.a.p/librte_pipeline_rte_swx_pipeline.c.o
[510/2841] Compiling C object lib/librte_vhost.a.p/librte_vhost_vhost_crypto.c.o
[511/2841] Compiling C object lib/librte_pipeline.a.p/librte_pipeline_rte_table_action.c.o
ninja: build stopped




*Build Failed #11:
OS: UB2004-32
Target: i686-native-linuxapp-gcc
FAILED: lib/librte_vhost.a.p/librte_vhost_virtio_net.c.o 
gcc -Ilib/librte_vhost.a.p -Ilib -I../lib -Ilib/librte_vhost -I../lib/librte_vhost -I. -I.. -Iconfig -I../config -Ilib/librte_eal/include -I../lib/librte_eal/include -Ilib/librte_eal/linux/include -I../lib/librte_eal/linux/include -Ilib/librte_eal/x86/include -I../lib/librte_eal/x86/include -Ilib/librte_eal/common -I../lib/librte_eal/common -Ilib/librte_eal -I../lib/librte_eal -Ilib/librte_kvargs -I../lib/librte_kvargs -Ilib/librte_metrics -I../lib/librte_metrics -Ilib/librte_telemetry -I../lib/librte_telemetry -Ilib/librte_ethdev -I../lib/librte_ethdev -Ilib/librte_net -I../lib/librte_net -Ilib/librte_mbuf -I../lib/librte_mbuf -Ilib/librte_mempool -I../lib/librte_mempool -Ilib/librte_ring -I../lib/librte_ring -Ilib/librte_meter -I../lib/librte_meter -Ilib/librte_cryptodev -I../lib/librte_cryptodev -Ilib/librte_rcu -I../lib/librte_rcu -Ilib/librte_hash -I../lib/librte_hash -Ilib/librte_pci -I../lib/librte_pci -fdiagnostics-color=always -pipe -D_FILE_OFFSET_BITS=64 -Wall -Winvalid-pch -Werror -O3 -include rte_config.h -Wextra -Wcast-qual -Wdeprecated -Wformat -Wformat-nonliteral -Wformat-security -Wmissing-declarations -Wmissing-prototypes -Wnested-externs -Wold-style-definition -Wpointer-arith -Wsign-compare -Wstrict-prototypes -Wundef -Wwrite-strings -Wno-address-of-packed-member -Wno-packed-not-aligned -Wno-missing-field-initializers -Wno-pointer-to-int-cast -D_GNU_SOURCE -m32 -fPIC -march=native -DALLOW_EXPERIMENTAL_API -DALLOW_INTERNAL_API -Wno-format-truncation -DVHOST_GCC_UNROLL_PRAGMA -fno-strict-aliasing -MD -MQ lib/librte_vhost.a.p/librte_vhost_virtio_net.c.o -MF lib/librte_vhost.a.p/librte_vhost_virtio_net.c.o.d -o lib/librte_vhost.a.p/librte_vhost_virtio_net.c.o -c ../lib/librte_vhost/virtio_net.c
../lib/librte_vhost/virtio_net.c: In function ‘virtio_dev_tx_packed’:
../lib/librte_vhost/virtio_net.c:2472:11: error: unused variable ‘i’ [-Werror=unused-variable]
 2472 |  uint16_t i;
      |           ^
cc1: all warnings being treated as errors
[516/2379] Linking static target lib/librte_graph.a
[517/2379] Compiling C object lib/librte_node.a.p/librte_node_ethdev_rx.c.o
[518/2379] Compiling C object lib/librte_node.a.p/librte_node_ethdev_tx.c.o
[519/2379] Compiling C object lib/librte_node.a.p/librte_node_pkt_drop.c.o
[520/2379] Compiling C object lib/librte_node.a.p/librte_node_ethdev_ctrl.c.o
[521/2379] Compiling C object lib/librte_node.a.p/librte_node_ip4_lookup.c.o
[522/2379] Compiling C object lib/librte_node.a.p/librte_node_ip4_rewrite.c.o
[523/2379] Compiling C object lib/librte_vhost.a.p/librte_vhost_vhost_crypto.c.o
[524/2379] Compiling C object lib/librte_pipeline.a.p/librte_pipeline_rte_table_action.c.o
ninja: build stopped




*Build Failed #12:
OS: UB2004-64
Target: x86_64-native-linuxapp-clang
FAILED: lib/librte_vhost.a.p/librte_vhost_virtio_net.c.o 
clang -Ilib/librte_vhost.a.p -Ilib -I../lib -Ilib/librte_vhost -I../lib/librte_vhost -I. -I.. -Iconfig -I../config -Ilib/librte_eal/include -I../lib/librte_eal/include -Ilib/librte_eal/linux/include -I../lib/librte_eal/linux/include -Ilib/librte_eal/x86/include -I../lib/librte_eal/x86/include -Ilib/librte_eal/common -I../lib/librte_eal/common -Ilib/librte_eal -I../lib/librte_eal -Ilib/librte_kvargs -I../lib/librte_kvargs -Ilib/librte_metrics -I../lib/librte_metrics -Ilib/librte_telemetry -I../lib/librte_telemetry -Ilib/librte_ethdev -I../lib/librte_ethdev -Ilib/librte_net -I../lib/librte_net -Ilib/librte_mbuf -I../lib/librte_mbuf -Ilib/librte_mempool -I../lib/librte_mempool -Ilib/librte_ring -I../lib/librte_ring -Ilib/librte_meter -I../lib/librte_meter -Ilib/librte_cryptodev -I../lib/librte_cryptodev -Ilib/librte_rcu -I../lib/librte_rcu -Ilib/librte_hash -I../lib/librte_hash -Ilib/librte_pci -I../lib/librte_pci -Xclang -fcolor-diagnostics -pipe -D_FILE_OFFSET_BITS=64 -Wall -Winvalid-pch -Werror -O3 -include rte_config.h -Wextra -Wcast-qual -Wdeprecated -Wformat -Wformat-nonliteral -Wformat-security -Wmissing-declarations -Wmissing-prototypes -Wnested-externs -Wold-style-definition -Wpointer-arith -Wsign-compare -Wstrict-prototypes -Wundef -Wwrite-strings -Wno-address-of-packed-member -Wno-missing-field-initializers -D_GNU_SOURCE -fPIC -march=native -DALLOW_EXPERIMENTAL_API -DALLOW_INTERNAL_API -DVHOST_CLANG_UNROLL_PRAGMA -fno-strict-aliasing -MD -MQ lib/librte_vhost.a.p/librte_vhost_virtio_net.c.o -MF lib/librte_vhost.a.p/librte_vhost_virtio_net.c.o.d -o lib/librte_vhost.a.p/librte_vhost_virtio_net.c.o -c ../lib/librte_vhost/virtio_net.c
../lib/librte_vhost/virtio_net.c:2472:11: error: unused variable 'i' [-Werror,-Wunused-variable]
        uint16_t i;
                 ^
1 error generated.
[433/2837] Generating symbol file lib/librte_security.so.21.2.p/librte_security.so.21.2.symbols
[434/2837] Generating symbol file lib/librte_rib.so.21.2.p/librte_rib.so.21.2.symbols
[435/2837] Linking target lib/librte_sched.so.21.2
[436/2837] Compiling C object lib/librte_vhost.a.p/librte_vhost_vhost.c.o
[437/2837] Compiling C object lib/librte_ipsec.a.p/librte_ipsec_sa.c.o
[438/2837] Compiling C object lib/librte_vhost.a.p/librte_vhost_vhost_user.c.o
[439/2837] Compiling C object lib/librte_ipsec.a.p/librte_ipsec_esp_outb.c.o
[440/2837] Compiling C object lib/librte_ipsec.a.p/librte_ipsec_esp_inb.c.o
[441/2837] Compiling C object lib/librte_vhost.a.p/librte_vhost_vhost_crypto.c.o
ninja: build stopped




*Build Failed #13:
OS: UB2004-64
Target: x86_64-native-linuxapp-gcc
FAILED: lib/librte_vhost.a.p/librte_vhost_virtio_net.c.o 
gcc -Ilib/librte_vhost.a.p -Ilib -I../lib -Ilib/librte_vhost -I../lib/librte_vhost -I. -I.. -Iconfig -I../config -Ilib/librte_eal/include -I../lib/librte_eal/include -Ilib/librte_eal/linux/include -I../lib/librte_eal/linux/include -Ilib/librte_eal/x86/include -I../lib/librte_eal/x86/include -Ilib/librte_eal/common -I../lib/librte_eal/common -Ilib/librte_eal -I../lib/librte_eal -Ilib/librte_kvargs -I../lib/librte_kvargs -Ilib/librte_metrics -I../lib/librte_metrics -Ilib/librte_telemetry -I../lib/librte_telemetry -Ilib/librte_ethdev -I../lib/librte_ethdev -Ilib/librte_net -I../lib/librte_net -Ilib/librte_mbuf -I../lib/librte_mbuf -Ilib/librte_mempool -I../lib/librte_mempool -Ilib/librte_ring -I../lib/librte_ring -Ilib/librte_meter -I../lib/librte_meter -Ilib/librte_cryptodev -I../lib/librte_cryptodev -Ilib/librte_rcu -I../lib/librte_rcu -Ilib/librte_hash -I../lib/librte_hash -Ilib/librte_pci -I../lib/librte_pci -fdiagnostics-color=always -pipe -D_FILE_OFFSET_BITS=64 -Wall -Winvalid-pch -Werror -O3 -include rte_config.h -Wextra -Wcast-qual -Wdeprecated -Wformat -Wformat-nonliteral -Wformat-security -Wmissing-declarations -Wmissing-prototypes -Wnested-externs -Wold-style-definition -Wpointer-arith -Wsign-compare -Wstrict-prototypes -Wundef -Wwrite-strings -Wno-address-of-packed-member -Wno-packed-not-aligned -Wno-missing-field-initializers -Wno-zero-length-bounds -D_GNU_SOURCE -fPIC -march=native -DALLOW_EXPERIMENTAL_API -DALLOW_INTERNAL_API -Wno-format-truncation -DVHOST_GCC_UNROLL_PRAGMA -fno-strict-aliasing -MD -MQ lib/librte_vhost.a.p/librte_vhost_virtio_net.c.o -MF lib/librte_vhost.a.p/librte_vhost_virtio_net.c.o.d -o lib/librte_vhost.a.p/librte_vhost_virtio_net.c.o -c ../lib/librte_vhost/virtio_net.c
../lib/librte_vhost/virtio_net.c: In function ‘virtio_dev_tx_packed’:
../lib/librte_vhost/virtio_net.c:2472:11: error: unused variable ‘i’ [-Werror=unused-variable]
 2472 |  uint16_t i;
      |           ^
cc1: all warnings being treated as errors
[501/2837] Generating symbol file lib/librte_table.so.21.2.p/librte_table.so.21.2.symbols
[502/2837] Compiling C object drivers/libtmp_rte_net_bnxt.a.p/net_bnxt_bnxt_vnic.c.o
[503/2837] Compiling C object lib/librte_flow_classify.a.p/librte_flow_classify_rte_flow_classify_parse.c.o
[504/2837] Compiling C object lib/librte_bpf.a.p/librte_bpf_bpf.c.o
[505/2837] Compiling C object drivers/libtmp_rte_net_bnxt.a.p/net_bnxt_bnxt_reps.c.o
[506/2837] Compiling C object lib/librte_bpf.a.p/librte_bpf_bpf_exec.c.o
[507/2837] Compiling C object lib/librte_pipeline.a.p/librte_pipeline_rte_swx_pipeline.c.o
[508/2837] Compiling C object lib/librte_vhost.a.p/librte_vhost_vhost_crypto.c.o
[509/2837] Compiling C object lib/librte_pipeline.a.p/librte_pipeline_rte_table_action.c.o
ninja: build stopped




*Build Failed #14:
OS: UB2004-64
Target: x86_64-native-linuxapp-doc
FAILED: lib/librte_vhost.a.p/librte_vhost_virtio_net.c.o 
gcc -Ilib/librte_vhost.a.p -Ilib -I../lib -Ilib/librte_vhost -I../lib/librte_vhost -I. -I.. -Iconfig -I../config -Ilib/librte_eal/include -I../lib/librte_eal/include -Ilib/librte_eal/linux/include -I../lib/librte_eal/linux/include -Ilib/librte_eal/x86/include -I../lib/librte_eal/x86/include -Ilib/librte_eal/common -I../lib/librte_eal/common -Ilib/librte_eal -I../lib/librte_eal -Ilib/librte_kvargs -I../lib/librte_kvargs -Ilib/librte_metrics -I../lib/librte_metrics -Ilib/librte_telemetry -I../lib/librte_telemetry -Ilib/librte_ethdev -I../lib/librte_ethdev -Ilib/librte_net -I../lib/librte_net -Ilib/librte_mbuf -I../lib/librte_mbuf -Ilib/librte_mempool -I../lib/librte_mempool -Ilib/librte_ring -I../lib/librte_ring -Ilib/librte_meter -I../lib/librte_meter -Ilib/librte_cryptodev -I../lib/librte_cryptodev -Ilib/librte_rcu -I../lib/librte_rcu -Ilib/librte_hash -I../lib/librte_hash -Ilib/librte_pci -I../lib/librte_pci -fdiagnostics-color=always -pipe -D_FILE_OFFSET_BITS=64 -Wall -Winvalid-pch -Werror -O3 -include rte_config.h -Wextra -Wcast-qual -Wdeprecated -Wformat -Wformat-nonliteral -Wformat-security -Wmissing-declarations -Wmissing-prototypes -Wnested-externs -Wold-style-definition -Wpointer-arith -Wsign-compare -Wstrict-prototypes -Wundef -Wwrite-strings -Wno-address-of-packed-member -Wno-packed-not-aligned -Wno-missing-field-initializers -D_GNU_SOURCE -fPIC -march=native -DALLOW_EXPERIMENTAL_API -DALLOW_INTERNAL_API -Wno-format-truncation -DVHOST_GCC_UNROLL_PRAGMA -fno-strict-aliasing -MD -MQ lib/librte_vhost.a.p/librte_vhost_virtio_net.c.o -MF lib/librte_vhost.a.p/librte_vhost_virtio_net.c.o.d -o lib/librte_vhost.a.p/librte_vhost_virtio_net.c.o -c ../lib/librte_vhost/virtio_net.c
../lib/librte_vhost/virtio_net.c: In function ‘virtio_dev_tx_packed’:
../lib/librte_vhost/virtio_net.c:2472:11: error: unused variable ‘i’ [-Werror=unused-variable]
 2472 |  uint16_t i;
      |           ^
cc1: all warnings being treated as errors
[500/2647] Compiling C object lib/librte_flow_classify.a.p/librte_flow_classify_rte_flow_classify_parse.c.o
[501/2647] Compiling C object drivers/libtmp_rte_net_bnxt.a.p/net_bnxt_bnxt_vnic.c.o
[502/2647] Compiling C object lib/librte_bpf.a.p/librte_bpf_bpf.c.o
[503/2647] Compiling C object drivers/libtmp_rte_net_bnxt.a.p/net_bnxt_bnxt_txr.c.o
[504/2647] Compiling C object lib/librte_bpf.a.p/librte_bpf_bpf_exec.c.o
[505/2647] Generating symbol file lib/librte_table.so.21.2.p/librte_table.so.21.2.symbols
[506/2647] Compiling C object lib/librte_pipeline.a.p/librte_pipeline_rte_swx_pipeline.c.o
[507/2647] Compiling C object lib/librte_vhost.a.p/librte_vhost_vhost_crypto.c.o
[508/2647] Compiling C object lib/librte_pipeline.a.p/librte_pipeline_rte_table_action.c.o
ninja: build stopped




*Build Failed #15:
OS: UB2010-64
Target: x86_64-native-linuxapp-gcc
FAILED: lib/76b5a35@@rte_vhost@sta/librte_vhost_virtio_net.c.o 
gcc -Ilib/76b5a35@@rte_vhost@sta -Ilib -I../lib -Ilib/librte_vhost -I../lib/librte_vhost -I. -I../ -Iconfig -I../config -Ilib/librte_eal/include -I../lib/librte_eal/include -Ilib/librte_eal/linux/include -I../lib/librte_eal/linux/include -Ilib/librte_eal/x86/include -I../lib/librte_eal/x86/include -Ilib/librte_eal/common -I../lib/librte_eal/common -Ilib/librte_eal -I../lib/librte_eal -Ilib/librte_kvargs -I../lib/librte_kvargs -Ilib/librte_telemetry/../librte_metrics -I../lib/librte_telemetry/../librte_metrics -Ilib/librte_telemetry -I../lib/librte_telemetry -Ilib/librte_ethdev -I../lib/librte_ethdev -Ilib/librte_net -I../lib/librte_net -Ilib/librte_mbuf -I../lib/librte_mbuf -Ilib/librte_mempool -I../lib/librte_mempool -Ilib/librte_ring -I../lib/librte_ring -Ilib/librte_meter -I../lib/librte_meter -Ilib/librte_cryptodev -I../lib/librte_cryptodev -Ilib/librte_rcu -I../lib/librte_rcu -Ilib/librte_hash -I../lib/librte_hash -Ilib/librte_pci -I../lib/librte_pci -fdiagnostics-color=always -pipe -D_FILE_OFFSET_BITS=64 -Wall -Winvalid-pch -Werror -O3 -include rte_config.h -Wextra -Wcast-qual -Wdeprecated -Wformat -Wformat-nonliteral -Wformat-security -Wmissing-declarations -Wmissing-prototypes -Wnested-externs -Wold-style-definition -Wpointer-arith -Wsign-compare -Wstrict-prototypes -Wundef -Wwrite-strings -Wno-address-of-packed-member -Wno-packed-not-aligned -Wno-missing-field-initializers -Wno-zero-length-bounds -D_GNU_SOURCE -fPIC -march=native -DALLOW_EXPERIMENTAL_API -DALLOW_INTERNAL_API -Wno-format-truncation -DVHOST_GCC_UNROLL_PRAGMA -fno-strict-aliasing -MD -MQ 'lib/76b5a35@@rte_vhost@sta/librte_vhost_virtio_net.c.o' -MF 'lib/76b5a35@@rte_vhost@sta/librte_vhost_virtio_net.c.o.d' -o 'lib/76b5a35@@rte_vhost@sta/librte_vhost_virtio_net.c.o' -c ../lib/librte_vhost/virtio_net.c
../lib/librte_vhost/virtio_net.c: In function ‘virtio_dev_tx_packed’:
../lib/librte_vhost/virtio_net.c:2472:11: error: unused variable ‘i’ [-Werror=unused-variable]
 2472 |  uint16_t i;
      |           ^
cc1: all warnings being treated as errors
[488/2840] Compiling C object 'lib/76b5a35@@rte_table@sta/librte_table_rte_table_stub.c.o'.
[489/2840] Compiling C object 'lib/76b5a35@@rte_table@sta/librte_table_rte_table_array.c.o'.
[490/2840] Compiling C object 'lib/76b5a35@@rte_table@sta/librte_table_rte_swx_table_em.c.o'.
[491/2840] Compiling C object 'drivers/a715181@@tmp_rte_net_bnxt@sta/net_bnxt_bnxt_flow.c.o'.
[492/2840] Compiling C object 'lib/76b5a35@@rte_table@sta/librte_table_rte_table_hash_lru.c.o'.
[493/2840] Compiling C object 'lib/76b5a35@@rte_pipeline@sta/librte_pipeline_rte_swx_ctl.c.o'.
[494/2840] Compiling C object 'lib/76b5a35@@rte_pipeline@sta/librte_pipeline_rte_pipeline.c.o'.
[495/2840] Compiling C object 'drivers/a715181@@tmp_rte_net_bnxt@sta/net_bnxt_bnxt_hwrm.c.o'.
[496/2840] Compiling C object 'lib/76b5a35@@rte_vhost@sta/librte_vhost_vhost_crypto.c.o'.
ninja: build stopped


DPDK STV team

^ permalink raw reply	[flat|nested] only message in thread

only message in thread, other threads:[~2021-04-06 17:06 UTC | newest]

Thread overview: (only message) (download: mbox.gz / follow: Atom feed)
-- links below jump to the message on this page --
2021-04-06 17:06 [dpdk-test-report] |FAILURE| pw(90746) [4/4] vhost: remove unnecessary level of indirection sys_stv

automatic DPDK test reports

This inbox may be cloned and mirrored by anyone:

	git clone --mirror https://inbox.dpdk.org/test-report/0 test-report/git/0.git

	# If you have public-inbox 1.1+ installed, you may
	# initialize and index your mirror using the following commands:
	public-inbox-init -V2 test-report test-report/ https://inbox.dpdk.org/test-report \
		test-report@dpdk.org
	public-inbox-index test-report

Example config snippet for mirrors.
Newsgroup available over NNTP:
	nntp://inbox.dpdk.org/inbox.dpdk.test-report


AGPL code for this site: git clone https://public-inbox.org/public-inbox.git