automatic DPDK test reports
 help / color / mirror / Atom feed
* [dpdk-test-report]  |FAILURE| pw61379[v12, 6/7] examples/eventdev_pipeline: add new Rx RSS hash offload
@ 2019-10-17 13:40 sys_stv
  0 siblings, 0 replies; only message in thread
From: sys_stv @ 2019-10-17 13:40 UTC (permalink / raw)
  To: test-report

[-- Attachment #1: Type: text/plain, Size: 24641 bytes --]

Test-Label: Intel-compilation
Test-Status: FAILURE
http://dpdk.org/patch/61379

_Compilation issues_

Submitter: Pavan Nikhilesh Bhagavatula <pbhagavatula@marvell.com>
Date: 2019-10-17 12:02:43
Reply_mail: 20191017120245.984-7-pbhagavatula@marvell.com
DPDK git baseline: Repo:dpdk, CommitID: ad4305d0d5ed103cf5217eb120168ff8f285466c

Makefile build Summary: 22 Builds Done, 22 Successful, 0 Failures

Meson build Summary: 7 Builds Done, 2 Successful, 5 Failures

               +==============================================+===========+==========+
               |                   Makefile                   |   Meson   | Document |
+--------------+------+-------+------+------------+-----------+-----------+----------+
| os           | gcc  | clang | icc  | gcc+shared | gcc+debug | gcc/clang | pdf/html |
+--------------+------+-------+------+------------+-----------+-----------+----------+
| RHEL76-64    | pass |       |      |            |           |           |          |
| CENTOS76-64  | pass | pass  | pass | pass       | pass      |           |          |
| UB1804-64    | pass | pass  | pass |            |           | FAIL      | pass     |
| UB1604-32    | pass |       |      |            |           | FAIL      |          |
| UB1904-64    | pass |       |      |            |           |           |          |
| UB1604-64    | pass | pass  |      |            |           |           |          |
| FC30-64      | pass | pass  |      |            |           | FAIL      |          |
| WIN10-64     |      |       |      |            |           | pass      |          |
| FreeBSD12-64 | pass | pass  |      | pass       | pass      | FAIL      |          |
| RHEL80-64    | pass |       |      |            |           |           |          |
| SUSE15-64    | pass | pass  |      |            |           | FAIL      |          |
+--------------+------+-------+------+------------+-----------+-----------+----------+

Test environment and configuration as below:

** Makefile build **


OS: RHEL76-64
	Kernel Version: 3.10.0-957.el7.x86_64
	CPU info: Intel(R) Xeon(R) CPU E5-2699 v4 @ 2.20GHz
	GCC Version: gcc (GCC) 4.8.5 20150623 (Red Hat 4.8.5-36)
	Clang Version: NA
	x86_64-native-linuxapp-gcc


OS: CENTOS76-64
	Kernel Version: 3.10.0-957.27.2.el7.x86_64
	CPU info: Intel(R) Xeon(R) CPU E5-2699 v4 @ 2.20GHz
	GCC Version: gcc (GCC) 4.8.5 20150623 (Red Hat 4.8.5-36)
	Clang Version: 3.4.2 (tags/RELEASE_34/dot2-final)
	x86_64-native-linuxapp-clang
	x86_64-native-linuxapp-gcc+debug
	x86_64-native-linuxapp-gcc
	x86_64-native-linuxapp-gcc+shared
	x86_64-native-linuxapp-icc


OS: UB1804-64
	Kernel Version: 4.15.0-20-generic
	CPU info: Intel(R) Xeon(R) CPU E5-2699 v3 @ 2.30GHz
	GCC Version: gcc (Ubuntu 7.3.0-16ubuntu3) 7.3.0
	Clang Version: 6.0.0-1ubuntu2 (tags/RELEASE_600/final)
	x86_64-native-linuxapp-clang
	x86_64-native-linuxapp-icc
	x86_64-native-linuxapp-gcc


OS: UB1904-64
	Kernel Version: 5.0.0-13-generic
	CPU info: Intel(R) Xeon(R) CPU E5-2699 v3 @ 2.30GHz
	GCC Version: gcc (Ubuntu 8.3.0-6ubuntu1) 8.3.0
	Clang Version: 8.0.0-3 (tags/RELEASE_800/final)
	x86_64-native-linuxapp-gcc


OS: UB1604-32
	Kernel Version: 4.4.0-131-generic
	CPU info: Intel(R) Xeon(R) CPU E5-2699 v3 @ 2.30GHz
	GCC Version: gcc (Ubuntu 5.4.0-6ubuntu1~16.04.11) 5.4.0 20160609
	Clang Version: 3.8.0-2ubuntu4 (tags/RELEASE_380/final)
	i686-native-linuxapp-gcc


OS: UB1604-64
	Kernel Version: 4.4.0-47-generic
	CPU info: Intel(R) Xeon(R) CPU E5-2699 v3 @ 2.30GHz
	GCC Version: gcc (Ubuntu 5.4.0-6ubuntu1~16.04.10) 5.4.0 20160609
	Clang Version: 3.8.0-2ubuntu4 (tags/RELEASE_380/final)
	x86_64-native-linuxapp-clang
	x86_64-native-linuxapp-gcc


OS: FC30-64
	Kernel Version: 5.1.7-300.fc30.x86_64
	CPU info: Intel(R) Xeon(R) CPU E5-2699 v4 @ 2.20GHz
	GCC Version: gcc (GCC) 9.1.1 20190503 (Red Hat 9.1.1-1)
	Clang Version: 8.0.0 (Fedora 8.0.0-1.fc30)
	x86_64-native-linuxapp-gcc
	x86_64-native-linuxapp-clang


OS: FreeBSD12-64
	Kernel Version: 12.0-RC3
	CPU info: Intel(R) Xeon(R) CPU E5-2699 v4 @ 2.20GHz (2194.98-MHz K8-class CPU)
	GCC Version: gcc (FreeBSD Ports Collection) 7.3.0
	Clang Version: 6.0.1 (tags/RELEASE_601/final 335540) (based on LLVM 6.0.1)
	x86_64-native-bsdapp-clang
	x86_64-native-bsdapp-gcc+debug
	x86_64-native-bsdapp-gcc+shared
	x86_64-native-bsdapp-gcc


OS: RHEL80-64
	Kernel Version: 4.18.0-80.el8.x86_64
	CPU info: Intel(R) Xeon(R) CPU E5-2699 v4 @ 2.20GHz
	GCC Version: gcc (GCC) 8.2.1 20180905 (Red Hat 8.2.1-3)
	Clang Version: 6.0.1 (tags/RELEASE_601/final)
	x86_64-native-linuxapp-gcc


OS: SUSE15-64
	Kernel Version: 4.12.14-lp150.11-default
	CPU info: Intel(R) Xeon(R) CPU E5-2699 v4 @ 2.20GHz
	GCC Version: gcc (SUSE Linux) 7.3.1 20180323 [gcc-7-branch revision 258812]
	Clang Version: 5.0.1 (tags/RELEASE_501/final 312548)
	x86_64-native-linuxapp-gcc
	x86_64-native-linuxapp-clang


** Meson build **


OS: UB1804-64
	Kernel Version: 4.15.0-20-generic
	CPU info: Intel(R) Xeon(R) CPU E5-2699 v4 @ 2.20GHz
	GCC Version: gcc (Ubuntu 7.3.0-27ubuntu1~18.04) 7.3.0
	Clang Version: 6.0.0-1ubuntu2 (tags/RELEASE_600/final)
	x86_64-native-linuxapp-doc
	build-gcc-static
	build-gcc-shared
	build-clang-static
	build-clang-shared
	build-x86-default


OS: UB1604-32
	Kernel Version: 4.4.0-131-generic
	CPU info: Intel(R) Xeon(R) CPU E5-2699 v4 @ 2.20GHz
	GCC Version: gcc (Ubuntu 5.4.0-6ubuntu1~16.04.11) 5.4.0 20160609
	Clang Version: 3.8.0-2ubuntu4 (tags/RELEASE_380/final)
	build-gcc-static
	build-gcc-shared
	build-clang-static
	build-clang-shared
	build-x86-default


OS: FC30-64
	Kernel Version: 5.0.9-301.fc30.x86_64
	CPU info: Intel(R) Xeon(R) CPU E5-2699 v4 @ 2.20GHz
	GCC Version: gcc (GCC) 9.1.1 20190503 (Red Hat 9.1.1-1)
	Clang Version: 8.0.0 (Fedora 8.0.0-1.fc30)
	build-gcc-static
	build-gcc-shared
	build-clang-static
	build-clang-shared
	build-x86-default


OS: WIN10-64
	Kernel Version: N/A
	CPU info: N/A
	GCC Version: N/A
	Clang Version: Clang 8.0.0
	x86_64-windows-clang


OS: FreeBSD12-64
	Kernel Version: 12.0-RC3
	CPU info: Intel(R) Xeon(R) CPU E5-2699 v4 @ 2.20GHz (2194.97-MHz K8-class CPU)
	GCC Version: gcc (FreeBSD Ports Collection) 7.3.0
	Clang Version: 6.0.1 (tags/RELEASE_601/final 335540) (based on LLVM 6.0.1)
	build-gcc-static
	build-gcc-shared
	build-clang-static
	build-clang-shared
	build-x86-default


OS: SUSE15-64
	Kernel Version: 4.12.14-lp150.11-default
	CPU info: Intel(R) Xeon(R) CPU E5-2699 v4 @ 2.20GHz
	GCC Version: gcc (SUSE Linux) 7.3.1 20180323 [gcc-7-branch revision 258812]
	Clang Version: 5.0.1 (tags/RELEASE_501/final 312548)
	build-gcc-static
	build-gcc-shared
	build-clang-static
	build-clang-shared
	build-x86-default


*Meson Build Failed #1:
OS: SUSE15-64
Target:build-gcc-static
FAILED: examples/c590b3c@@dpdk-link_status_interrupt@exe/link_status_interrupt_main.c.o 
gcc -Iexamples/c590b3c@@dpdk-link_status_interrupt@exe -Iexamples -I../examples -Iexamples/link_status_interrupt -I../examples/link_status_interrupt -I. -I../ -Iconfig -I../config -Ilib/librte_eal/common/include -I../lib/librte_eal/common/include -I../lib/librte_eal/linux/eal/include -Ilib/librte_eal/common -I../lib/librte_eal/common -Ilib/librte_eal/common/include/arch/x86 -I../lib/librte_eal/common/include/arch/x86 -Ilib/librte_eal -I../lib/librte_eal -Ilib/librte_kvargs -I../lib/librte_kvargs -Ilib/librte_mempool -I../lib/librte_mempool -Ilib/librte_ring -I../lib/librte_ring -Ilib/librte_net -I../lib/librte_net -Ilib/librte_mbuf -I../lib/librte_mbuf -Ilib/librte_ethdev -I../lib/librte_ethdev -Ilib/librte_meter -I../lib/librte_meter -Ilib/librte_cmdline -I../lib/librte_cmdline -fdiagnostics-color=always -pipe -D_FILE_OFFSET_BITS=64 -Wall -Winvalid-pch -Werror -O3 -include rte_config.h -Wunused-parameter -Wsign-compare -Wcast-qual -D_GNU_SOURCE -march=native -Wno-format-truncation -DALLOW_EXPERIMENTAL_API -MD -MQ 'examples/c590b3c@@dpdk-link_status_interrupt@exe/link_status_interrupt_main.c.o' -MF 'examples/c590b3c@@dpdk-link_status_interrupt@exe/link_status_interrupt_main.c.o.d' -o 'examples/c590b3c@@dpdk-link_status_interrupt@exe/link_status_interrupt_main.c.o' -c ../examples/link_status_interrupt/main.c
../examples/link_status_interrupt/main.c: In function ‘main’:
../examples/link_status_interrupt/main.c:707:3: error: implicit declaration of function ‘rte_eth_dev_set_supported_ptypes’; did you mean ‘rte_eth_dev_get_supported_ptypes’? [-Werror=implicit-function-declaration]
   rte_eth_dev_set_supported_ptypes(portid, RTE_PTYPE_UNKNOWN,
   ^~~~~~~~~~~~~~~~~~~~~~~~~~~~~~~~
   rte_eth_dev_get_supported_ptypes
cc1: all warnings being treated as errors
[1596/1892] Compiling C object 'app/a172ced@@dpdk-testpmd@exe/test-pmd_noisy_vnf.c.o'.
[1597/1892] Compiling C object 'app/a172ced@@dpdk-testpmd@exe/test-pmd_cmdline.c.o'.
[1598/1892] Compiling C object 'app/a172ced@@dpdk-testpmd@exe/test-pmd_rxonly.c.o'.
[1599/1892] Compiling C object 'app/a172ced@@dpdk-testpmd@exe/test-pmd_parameters.c.o'.
[1600/1892] Compiling C object 'app/a172ced@@dpdk-testpmd@exe/test-pmd_txonly.c.o'.
[1601/1892] Compiling C object 'drivers/a715181@@tmp_rte_pmd_octeontx2_event@sta/event_octeontx2_otx2_worker_dual.c.o'.
[1602/1892] Compiling C object 'app/a172ced@@dpdk-testpmd@exe/test-pmd_testpmd.c.o'.
ninja: build stopped: subcommand failed




*Meson Build Failed #2:
OS: FC30-64
Target:build-gcc-static
FAILED: examples/c590b3c@@dpdk-skeleton@exe/skeleton_basicfwd.c.o 
gcc -Iexamples/c590b3c@@dpdk-skeleton@exe -Iexamples -I../examples -Iexamples/skeleton -I../examples/skeleton -I. -I../ -Iconfig -I../config -Ilib/librte_eal/common/include -I../lib/librte_eal/common/include -I../lib/librte_eal/linux/eal/include -Ilib/librte_eal/common -I../lib/librte_eal/common -Ilib/librte_eal/common/include/arch/x86 -I../lib/librte_eal/common/include/arch/x86 -Ilib/librte_eal -I../lib/librte_eal -Ilib/librte_kvargs -I../lib/librte_kvargs -Ilib/librte_mempool -I../lib/librte_mempool -Ilib/librte_ring -I../lib/librte_ring -Ilib/librte_net -I../lib/librte_net -Ilib/librte_mbuf -I../lib/librte_mbuf -Ilib/librte_ethdev -I../lib/librte_ethdev -Ilib/librte_meter -I../lib/librte_meter -Ilib/librte_cmdline -I../lib/librte_cmdline -fdiagnostics-color=always -pipe -D_FILE_OFFSET_BITS=64 -Wall -Winvalid-pch -Werror -O3 -include rte_config.h -Wunused-parameter -Wsign-compare -Wcast-qual -Wno-address-of-packed-member -D_GNU_SOURCE -march=native -mno-avx512f -Wno-format-truncation -DALLOW_EXPERIMENTAL_API -MD -MQ 'examples/c590b3c@@dpdk-skeleton@exe/skeleton_basicfwd.c.o' -MF 'examples/c590b3c@@dpdk-skeleton@exe/skeleton_basicfwd.c.o.d' -o 'examples/c590b3c@@dpdk-skeleton@exe/skeleton_basicfwd.c.o' -c ../examples/skeleton/basicfwd.c
../examples/skeleton/basicfwd.c: In function ‘port_init’:
../examples/skeleton/basicfwd.c:85:2: error: implicit declaration of function ‘rte_eth_dev_set_supported_ptypes’; did you mean ‘rte_eth_dev_get_supported_ptypes’? [-Werror=implicit-function-declaration]
   85 |  rte_eth_dev_set_supported_ptypes(port, RTE_PTYPE_UNKNOWN, NULL, 0);
      |  ^~~~~~~~~~~~~~~~~~~~~~~~~~~~~~~~
      |  rte_eth_dev_get_supported_ptypes
cc1: all warnings being treated as errors
[926/1845] Compiling C object 'examples/c590b3c@@dpdk-vdpa@exe/vdpa_main.c.o'.
[927/1845] Compiling C object 'examples/c590b3c@@dpdk-tep_termination@exe/tep_termination_vxlan.c.o'.
[928/1845] Compiling C object 'drivers/a715181@@tmp_rte_pmd_liquidio@sta/net_liquidio_lio_rxtx.c.o'.
[929/1845] Compiling C object 'drivers/a715181@@tmp_rte_pmd_ixgbe@sta/net_ixgbe_ixgbe_rxtx.c.o'.
[930/1845] Compiling C object 'drivers/a715181@@tmp_rte_pmd_ixgbe@sta/net_ixgbe_ixgbe_ethdev.c.o'.
[931/1845] Compiling C object 'examples/c590b3c@@dpdk-tep_termination@exe/tep_termination_main.c.o'.
[932/1845] Compiling C object 'examples/c590b3c@@dpdk-vhost@exe/vhost_virtio_net.c.o'.
ninja: build stopped: subcommand failed




*Meson Build Failed #3:
OS: UB1604-32
Target:build-gcc-static
FAILED: examples/c590b3c@@dpdk-l3fwd-vf@exe/l3fwd-vf_main.c.o 
gcc -Iexamples/c590b3c@@dpdk-l3fwd-vf@exe -Iexamples -I../examples -Iexamples/l3fwd-vf -I../examples/l3fwd-vf -I. -I../ -Iconfig -I../config -Ilib/librte_eal/common/include -I../lib/librte_eal/common/include -I../lib/librte_eal/linux/eal/include -Ilib/librte_eal/common -I../lib/librte_eal/common -Ilib/librte_eal/common/include/arch/x86 -I../lib/librte_eal/common/include/arch/x86 -Ilib/librte_eal -I../lib/librte_eal -Ilib/librte_kvargs -I../lib/librte_kvargs -Ilib/librte_mempool -I../lib/librte_mempool -Ilib/librte_ring -I../lib/librte_ring -Ilib/librte_net -I../lib/librte_net -Ilib/librte_mbuf -I../lib/librte_mbuf -Ilib/librte_ethdev -I../lib/librte_ethdev -Ilib/librte_meter -I../lib/librte_meter -Ilib/librte_cmdline -I../lib/librte_cmdline -Ilib/librte_lpm -I../lib/librte_lpm -Ilib/librte_hash -I../lib/librte_hash -fdiagnostics-color=always -pipe -D_FILE_OFFSET_BITS=64 -Wall -Winvalid-pch -Werror -O3 -include rte_config.h -Wunused-parameter -Wsign-compare -Wcast-qual -Wno-pointer-to-int-cast -D_GNU_SOURCE -march=native -DALLOW_EXPERIMENTAL_API -MD -MQ 'examples/c590b3c@@dpdk-l3fwd-vf@exe/l3fwd-vf_main.c.o' -MF 'examples/c590b3c@@dpdk-l3fwd-vf@exe/l3fwd-vf_main.c.o.d' -o 'examples/c590b3c@@dpdk-l3fwd-vf@exe/l3fwd-vf_main.c.o' -c ../examples/l3fwd-vf/main.c
../examples/l3fwd-vf/main.c: In function ‘main’:
../examples/l3fwd-vf/main.c:1059:3: error: implicit declaration of function ‘rte_eth_dev_set_supported_ptypes’ [-Werror=implicit-function-declaration]
   rte_eth_dev_set_supported_ptypes(portid, RTE_PTYPE_UNKNOWN,
   ^
cc1: all warnings being treated as errors
[1400/1698] Compiling C object 'app/a172ced@@dpdk-testpmd@exe/test-pmd_macfwd.c.o'.
[1401/1698] Compiling C object 'app/a172ced@@dpdk-testpmd@exe/test-pmd_macswap.c.o'.
[1402/1698] Compiling C object 'app/a172ced@@dpdk-testpmd@exe/test-pmd_cmdline.c.o'.
[1403/1698] Compiling C object 'app/a172ced@@dpdk-testpmd@exe/test-pmd_cmdline_flow.c.o'.
[1404/1698] Compiling C object 'drivers/a715181@@tmp_rte_pmd_octeontx2_event@sta/event_octeontx2_otx2_worker_dual.c.o'.
ninja: build stopped: subcommand failed




*Meson Build Failed #4:
OS: UB1804-64
Target:build-gcc-static
FAILED: examples/c590b3c@@dpdk-skeleton@exe/skeleton_basicfwd.c.o 
gcc -Iexamples/c590b3c@@dpdk-skeleton@exe -Iexamples -I../examples -Iexamples/skeleton -I../examples/skeleton -I. -I../ -Iconfig -I../config -Ilib/librte_eal/common/include -I../lib/librte_eal/common/include -I../lib/librte_eal/linux/eal/include -Ilib/librte_eal/common -I../lib/librte_eal/common -Ilib/librte_eal/common/include/arch/x86 -I../lib/librte_eal/common/include/arch/x86 -Ilib/librte_eal -I../lib/librte_eal -Ilib/librte_kvargs -I../lib/librte_kvargs -Ilib/librte_mempool -I../lib/librte_mempool -Ilib/librte_ring -I../lib/librte_ring -Ilib/librte_net -I../lib/librte_net -Ilib/librte_mbuf -I../lib/librte_mbuf -Ilib/librte_ethdev -I../lib/librte_ethdev -Ilib/librte_meter -I../lib/librte_meter -Ilib/librte_cmdline -I../lib/librte_cmdline -fdiagnostics-color=always -pipe -D_FILE_OFFSET_BITS=64 -Wall -Winvalid-pch -Werror -O3 -include rte_config.h -Wunused-parameter -Wsign-compare -Wcast-qual -D_GNU_SOURCE -march=native -mno-avx512f -Wno-format-truncation -DALLOW_EXPERIMENTAL_API -MD -MQ 'examples/c590b3c@@dpdk-skeleton@exe/skeleton_basicfwd.c.o' -MF 'examples/c590b3c@@dpdk-skeleton@exe/skeleton_basicfwd.c.o.d' -o 'examples/c590b3c@@dpdk-skeleton@exe/skeleton_basicfwd.c.o' -c ../examples/skeleton/basicfwd.c
../examples/skeleton/basicfwd.c: In function ‘port_init’:
../examples/skeleton/basicfwd.c:85:2: error: implicit declaration of function ‘rte_eth_dev_set_supported_ptypes’; did you mean ‘rte_eth_dev_get_supported_ptypes’? [-Werror=implicit-function-declaration]
  rte_eth_dev_set_supported_ptypes(port, RTE_PTYPE_UNKNOWN, NULL, 0);
  ^~~~~~~~~~~~~~~~~~~~~~~~~~~~~~~~
  rte_eth_dev_get_supported_ptypes
cc1: all warnings being treated as errors
[929/1852] Compiling C object 'drivers/a715181@@tmp_rte_pmd_ixgbe@sta/net_ixgbe_ixgbe_rxtx_vec_sse.c.o'.
[930/1852] Compiling C object 'drivers/a715181@@tmp_rte_pmd_ixgbe@sta/net_ixgbe_ixgbe_ethdev.c.o'.
[931/1852] Compiling C object 'examples/c590b3c@@dpdk-vdpa@exe/vdpa_main.c.o'.
[932/1852] Compiling C object 'examples/c590b3c@@dpdk-vhost@exe/vhost_main.c.o'.
FAILED: examples/c590b3c@@dpdk-vhost@exe/vhost_main.c.o 
gcc -Iexamples/c590b3c@@dpdk-vhost@exe -Iexamples -I../examples -Iexamples/vhost -I../examples/vhost -I. -I../ -Iconfig -I../config -Ilib/librte_eal/common/include -I../lib/librte_eal/common/include -I../lib/librte_eal/linux/eal/include -Ilib/librte_eal/common -I../lib/librte_eal/common -Ilib/librte_eal/common/include/arch/x86 -I../lib/librte_eal/common/include/arch/x86 -Ilib/librte_eal -I../lib/librte_eal -Ilib/librte_kvargs -I../lib/librte_kvargs -Ilib/librte_mempool -I../lib/librte_mempool -Ilib/librte_ring -I../lib/librte_ring -Ilib/librte_net -I../lib/librte_net -Ilib/librte_mbuf -I../lib/librte_mbuf -Ilib/librte_ethdev -I../lib/librte_ethdev -Ilib/librte_meter -I../lib/librte_meter -Ilib/librte_cmdline -I../lib/librte_cmdline -Ilib/librte_vhost -I../lib/librte_vhost -Ilib/librte_cryptodev -I../lib/librte_cryptodev -Ilib/librte_hash -I../lib/librte_hash -Ilib/librte_pci -I../lib/librte_pci -fdiagnostics-color=always -pipe -D_FILE_OFFSET_BITS=64 -Wall -Winvalid-pch -Werror -O3 -include rte_config.h -Wunused-parameter -Wsign-compare -Wcast-qual -D_GNU_SOURCE -march=native -mno-avx512f -Wno-format-truncation -DALLOW_EXPERIMENTAL_API -MD -MQ 'examples/c590b3c@@dpdk-vhost@exe/vhost_main.c.o' -MF 'examples/c590b3c@@dpdk-vhost@exe/vhost_main.c.o.d' -o 'examples/c590b3c@@dpdk-vhost@exe/vhost_main.c.o' -c ../examples/vhost/main.c
../examples/vhost/main.c: In function ‘port_init’:
../examples/vhost/main.c:331:2: error: implicit declaration of function ‘rte_eth_dev_set_supported_ptypes’; did you mean ‘rte_eth_dev_get_supported_ptypes’? [-Werror=implicit-function-declaration]
  rte_eth_dev_set_supported_ptypes(port, RTE_PTYPE_UNKNOWN, NULL, 0);
  ^~~~~~~~~~~~~~~~~~~~~~~~~~~~~~~~
  rte_eth_dev_get_supported_ptypes
cc1: all warnings being treated as errors
[933/1852] Compiling C object 'drivers/a715181@@tmp_rte_pmd_ixgbe@sta/net_ixgbe_ixgbe_rxtx.c.o'.
ninja: build stopped: subcommand failed




*Meson Build Failed #5:
OS: FreeBSD12-64
Target:build-gcc-static
FAILED: examples/c590b3c@@dpdk-bond@exe/bond_main.c.o 
ccache gcc -Iexamples/c590b3c@@dpdk-bond@exe -Iexamples -I../examples -Iexamples/bond -I../examples/bond -I. -I../ -Iconfig -I../config -Ilib/librte_eal/common/include -I../lib/librte_eal/common/include -I../lib/librte_eal/freebsd/eal/include -Ilib/librte_eal/common -I../lib/librte_eal/common -Ilib/librte_eal/common/include/arch/x86 -I../lib/librte_eal/common/include/arch/x86 -Ilib/librte_eal -I../lib/librte_eal -Ilib/librte_kvargs -I../lib/librte_kvargs -Ilib/librte_mempool -I../lib/librte_mempool -Ilib/librte_ring -I../lib/librte_ring -Ilib/librte_net -I../lib/librte_net -Ilib/librte_mbuf -I../lib/librte_mbuf -Ilib/librte_ethdev -I../lib/librte_ethdev -Ilib/librte_meter -I../lib/librte_meter -Ilib/librte_cmdline -I../lib/librte_cmdline -Idrivers/net/bonding -I../drivers/net/bonding -Idrivers/bus/pci -I../drivers/bus/pci -I../drivers/bus/pci/bsd -Ilib/librte_pci -I../lib/librte_pci -Idrivers/bus/vdev -I../drivers/bus/vdev -Ilib/librte_sched -I../lib/librte_sched -Ilib/librte_ip_frag -I../lib/librte_ip_frag -Ilib/librte_hash -I../lib/librte_hash -fdiagnostics-color=always -pipe -D_FILE_OFFSET_BITS=64 -Wall -Winvalid-pch -Werror -O3 -include rte_config.h -Wunused-parameter -Wsign-compare -Wcast-qual -D_GNU_SOURCE -D__BSD_VISIBLE -march=native -Wno-format-truncation -DALLOW_EXPERIMENTAL_API -MD -MQ 'examples/c590b3c@@dpdk-bond@exe/bond_main.c.o' -MF 'examples/c590b3c@@dpdk-bond@exe/bond_main.c.o.d' -o 'examples/c590b3c@@dpdk-bond@exe/bond_main.c.o' -c ../examples/bond/main.c
../examples/bond/main.c: In function 'slave_port_init':
../examples/bond/main.c:203:2: error: implicit declaration of function 'rte_eth_dev_set_supported_ptypes'; did you mean 'rte_eth_dev_get_supported_ptypes'? [-Werror=implicit-function-declaration]
  rte_eth_dev_set_supported_ptypes(portid, RTE_PTYPE_UNKNOWN, NULL, 0);
  ^~~~~~~~~~~~~~~~~~~~~~~~~~~~~~~~
  rte_eth_dev_get_supported_ptypes
cc1: all warnings being treated as errors
[1329/1439] Compiling C object 'app/test/3062f5d@@dpdk-test@exe/virtual_pmd.c.o'.
[1330/1439] Compiling C object 'examples/c590b3c@@dpdk-eventdev_pipeline@exe/eventdev_pipeline_main.c.o'.
FAILED: examples/c590b3c@@dpdk-eventdev_pipeline@exe/eventdev_pipeline_main.c.o 
ccache gcc -Iexamples/c590b3c@@dpdk-eventdev_pipeline@exe -Iexamples -I../examples -Iexamples/eventdev_pipeline -I../examples/eventdev_pipeline -I. -I../ -Iconfig -I../config -Ilib/librte_eal/common/include -I../lib/librte_eal/common/include -I../lib/librte_eal/freebsd/eal/include -Ilib/librte_eal/common -I../lib/librte_eal/common -Ilib/librte_eal/common/include/arch/x86 -I../lib/librte_eal/common/include/arch/x86 -Ilib/librte_eal -I../lib/librte_eal -Ilib/librte_kvargs -I../lib/librte_kvargs -Ilib/librte_mempool -I../lib/librte_mempool -Ilib/librte_ring -I../lib/librte_ring -Ilib/librte_net -I../lib/librte_net -Ilib/librte_mbuf -I../lib/librte_mbuf -Ilib/librte_ethdev -I../lib/librte_ethdev -Ilib/librte_meter -I../lib/librte_meter -Ilib/librte_cmdline -I../lib/librte_cmdline -Ilib/librte_eventdev -I../lib/librte_eventdev -Ilib/librte_hash -I../lib/librte_hash -Ilib/librte_timer -I../lib/librte_timer -Ilib/librte_cryptodev -I../lib/librte_cryptodev -fdiagnostics-color=always -pipe -D_FILE_OFFSET_BITS=64 -Wall -Winvalid-pch -Werror -O3 -include rte_config.h -Wunused-parameter -Wsign-compare -Wcast-qual -D_GNU_SOURCE -D__BSD_VISIBLE -march=native -Wno-format-truncation -DALLOW_EXPERIMENTAL_API -MD -MQ 'examples/c590b3c@@dpdk-eventdev_pipeline@exe/eventdev_pipeline_main.c.o' -MF 'examples/c590b3c@@dpdk-eventdev_pipeline@exe/eventdev_pipeline_main.c.o.d' -o 'examples/c590b3c@@dpdk-eventdev_pipeline@exe/eventdev_pipeline_main.c.o' -c ../examples/eventdev_pipeline/main.c
../examples/eventdev_pipeline/main.c: In function 'main':
../examples/eventdev_pipeline/main.c:395:3: error: implicit declaration of function 'rte_eth_dev_set_supported_ptypes'; did you mean 'rte_eth_dev_get_supported_ptypes'? [-Werror=implicit-function-declaration]
   rte_eth_dev_set_supported_ptypes(portid, RTE_PTYPE_UNKNOWN,
   ^~~~~~~~~~~~~~~~~~~~~~~~~~~~~~~~
   rte_eth_dev_get_supported_ptypes
cc1: all warnings being treated as errors
[1331/1439] Compiling C object 'examples/c590b3c@@dpdk-eventdev_pipeline@exe/eventdev_pipeline_pipeline_worker_generic.c.o'.
[1332/1439] Compiling C object 'examples/c590b3c@@dpdk-eventdev_pipeline@exe/eventdev_pipeline_pipeline_worker_tx.c.o'.
[1333/1439] Compiling C object 'examples/c590b3c@@dpdk-bbdev_app@exe/bbdev_app_main.c.o'.
FAILED: examples/c590b3c@@dpdk-bbdev_app@exe/bbdev_app_main.c.o 
ccache gcc -Iexamples/c590b3c@@dpdk-bbdev_app@exe -Iexamples -I../examples -Iexamples/bbdev_app -I../examples/bbdev_app -I. -I../ -Iconfig -I../config -Ilib/librte_eal/common/include -I../lib/librte_eal/common/include -I../lib/librte_eal/freebsd/eal/include -Ilib/librte_eal/common -I../lib/librte_eal/common -Ilib/librte_eal/common/include/arch/x86 -I../lib/librte_eal/common/include/arch/x86 -Ilib/librte_eal -I../lib/librte_eal -Ilib/librte_kvargs -I../lib/librte_kvargs -Ilib/librte_mempool -I../lib/librte_mempool -Ilib/librte_ring -I../lib/librte_ring -Ilib/librte_net -I../lib/librte_net -Ilib/librte_mbuf -I../lib/librte_mbuf -Ilib/librte_ethdev -I../lib/librte_ethdev -Ilib/librte_meter -I../lib/librte_meter -Ilib/librte_cmdline -I../lib/librte_cmdline -Ilib/librte_bbdev -I../lib/librte_bbdev -fdiagnostics-color=always -pipe -D_FILE_OFFSET_BITS=64 -Wall -Winvalid-pch -Werror -O3 -include rte_config.h -Wunused-parameter -Wsign-compare -Wcast-qual -D_GNU_SOURCE -D__BSD_VISIBLE -march=native -Wno-format-truncation -DALLOW_EXPERIMENTAL_API -MD -MQ 'examples/c590b3c@@dpdk-bbdev_app@exe/bbdev_app_main.c.o' -MF 'examples/c590b3c@@dpdk-bbdev_app@exe/bbdev_app_main.c.o.d' -o 'examples/c590b3c@@dpdk-bbdev_app@exe/bbdev_app_main.c.o' -c ../examples/bbdev_app/main.c
../examples/bbdev_app/main.c: In function 'initialize_ports':
../examples/bbdev_app/main.c:502:2: error: implicit declaration of function 'rte_eth_dev_set_supported_ptypes'; did you mean 'rte_eth_dev_get_supported_ptypes'? [-Werror=implicit-function-declaration]
  rte_eth_dev_set_supported_ptypes(port_id, RTE_PTYPE_UNKNOWN, NULL, 0);
  ^~~~~~~~~~~~~~~~~~~~~~~~~~~~~~~~
  rte_eth_dev_get_supported_ptypes
cc1: all warnings being treated as errors
ninja: build stopped: subcommand failed



DPDK STV team

^ permalink raw reply	[flat|nested] only message in thread

only message in thread, other threads:[~2019-10-17 13:40 UTC | newest]

Thread overview: (only message) (download: mbox.gz / follow: Atom feed)
-- links below jump to the message on this page --
2019-10-17 13:40 [dpdk-test-report] |FAILURE| pw61379[v12, 6/7] examples/eventdev_pipeline: add new Rx RSS hash offload sys_stv

automatic DPDK test reports

This inbox may be cloned and mirrored by anyone:

	git clone --mirror https://inbox.dpdk.org/test-report/0 test-report/git/0.git

	# If you have public-inbox 1.1+ installed, you may
	# initialize and index your mirror using the following commands:
	public-inbox-init -V2 test-report test-report/ https://inbox.dpdk.org/test-report \
		test-report@dpdk.org
	public-inbox-index test-report

Example config snippet for mirrors.
Newsgroup available over NNTP:
	nntp://inbox.dpdk.org/inbox.dpdk.test-report


AGPL code for this site: git clone https://public-inbox.org/public-inbox.git