automatic DPDK test reports
 help / color / mirror / Atom feed
* [dpdk-test-report] |FAILURE| pw61383[v2] net/octeontx2: add set supported types op
@ 2019-10-17 14:36 sys_stv
  0 siblings, 0 replies; only message in thread
From: sys_stv @ 2019-10-17 14:36 UTC (permalink / raw)
  To: test-report

[-- Attachment #1: Type: text/plain, Size: 66072 bytes --]

Test-Label: Intel-compilation
Test-Status: FAILURE
http://dpdk.org/patch/61383

_Compilation issues_

Submitter: Pavan Nikhilesh Bhagavatula <pbhagavatula@marvell.com>
Date: 2019-10-17 12:20:03
Reply_mail: 20191017122004.5446-1-pbhagavatula@marvell.com
DPDK git baseline: Repo:dpdk-next-net-mrvl, CommitID: 19a6975e52d7746fd56e9d6d896f8cdd106cb5fc

Makefile build Summary: 22 Builds Done, 0 Successful, 22 Failures

Meson build Summary: 7 Builds Done, 2 Successful, 5 Failures

               +==============================================+===========+==========+
               |                   Makefile                   |   Meson   | Document |
+--------------+------+-------+------+------------+-----------+-----------+----------+
| os           | gcc  | clang | icc  | gcc+shared | gcc+debug | gcc/clang | pdf/html |
+--------------+------+-------+------+------------+-----------+-----------+----------+
| RHEL76-64    | FAIL |       |      |            |           |           |          |
| CENTOS76-64  | FAIL | FAIL  | FAIL | FAIL       | FAIL      |           |          |
| UB1804-64    | FAIL | FAIL  | FAIL |            |           | FAIL      | pass     |
| UB1604-32    | FAIL |       |      |            |           | FAIL      |          |
| UB1904-64    | FAIL |       |      |            |           |           |          |
| UB1604-64    | FAIL | FAIL  |      |            |           |           |          |
| FC30-64      | FAIL | FAIL  |      |            |           | FAIL      |          |
| WIN10-64     |      |       |      |            |           | pass      |          |
| FreeBSD12-64 | FAIL | FAIL  |      | FAIL       | FAIL      | FAIL      |          |
| RHEL80-64    | FAIL |       |      |            |           |           |          |
| SUSE15-64    | FAIL | FAIL  |      |            |           | FAIL      |          |
+--------------+------+-------+------+------------+-----------+-----------+----------+

Test environment and configuration as below:

** Makefile build **


OS: RHEL76-64
	Kernel Version: 3.10.0-957.el7.x86_64
	CPU info: Intel(R) Xeon(R) CPU E5-2699 v4 @ 2.20GHz
	GCC Version: gcc (GCC) 4.8.5 20150623 (Red Hat 4.8.5-36)
	Clang Version: NA
	x86_64-native-linuxapp-gcc


OS: CENTOS76-64
	Kernel Version: 3.10.0-957.27.2.el7.x86_64
	CPU info: Intel(R) Xeon(R) CPU E5-2699 v4 @ 2.20GHz
	GCC Version: gcc (GCC) 4.8.5 20150623 (Red Hat 4.8.5-36)
	Clang Version: 3.4.2 (tags/RELEASE_34/dot2-final)
	x86_64-native-linuxapp-clang
	x86_64-native-linuxapp-gcc
	x86_64-native-linuxapp-gcc+debug
	x86_64-native-linuxapp-icc
	x86_64-native-linuxapp-gcc+shared


OS: UB1804-64
	Kernel Version: 4.15.0-20-generic
	CPU info: Intel(R) Xeon(R) CPU E5-2699 v3 @ 2.30GHz
	GCC Version: gcc (Ubuntu 7.3.0-27ubuntu1~18.04) 7.3.0
	Clang Version: 6.0.0-1ubuntu2 (tags/RELEASE_600/final)
	x86_64-native-linuxapp-icc
	x86_64-native-linuxapp-clang
	x86_64-native-linuxapp-gcc


OS: UB1904-64
	Kernel Version: 5.0.0-13-generic
	CPU info: Intel(R) Xeon(R) CPU E5-2699 v3 @ 2.30GHz
	GCC Version: gcc (Ubuntu 8.3.0-6ubuntu1) 8.3.0
	Clang Version: 8.0.0-3 (tags/RELEASE_800/final)
	x86_64-native-linuxapp-gcc


OS: UB1604-32
	Kernel Version: 4.4.0-131-generic
	CPU info: Intel(R) Xeon(R) CPU E5-2699 v3 @ 2.30GHz
	GCC Version: gcc (Ubuntu 5.4.0-6ubuntu1~16.04.11) 5.4.0 20160609
	Clang Version: 3.8.0-2ubuntu4 (tags/RELEASE_380/final)
	i686-native-linuxapp-gcc


OS: UB1604-64
	Kernel Version: 4.4.0-47-generic
	CPU info: Intel(R) Xeon(R) CPU E5-2699 v3 @ 2.30GHz
	GCC Version: gcc (Ubuntu 5.4.0-6ubuntu1~16.04.10) 5.4.0 20160609
	Clang Version: 3.8.0-2ubuntu4 (tags/RELEASE_380/final)
	x86_64-native-linuxapp-clang
	x86_64-native-linuxapp-gcc


OS: FC30-64
	Kernel Version: 5.1.7-300.fc30.x86_64
	CPU info: Intel(R) Xeon(R) CPU E5-2699 v4 @ 2.20GHz
	GCC Version: gcc (GCC) 9.1.1 20190503 (Red Hat 9.1.1-1)
	Clang Version: 8.0.0 (Fedora 8.0.0-1.fc30)
	x86_64-native-linuxapp-gcc
	x86_64-native-linuxapp-clang


OS: FreeBSD12-64
	Kernel Version: 12.0-RC3
	CPU info: Intel(R) Xeon(R) CPU E5-2699 v4 @ 2.20GHz (2194.98-MHz K8-class CPU)
	GCC Version: gcc (FreeBSD Ports Collection) 7.3.0
	Clang Version: 6.0.1 (tags/RELEASE_601/final 335540) (based on LLVM 6.0.1)
	x86_64-native-bsdapp-clang
	x86_64-native-bsdapp-gcc+debug
	x86_64-native-bsdapp-gcc+shared
	x86_64-native-bsdapp-gcc


OS: RHEL80-64
	Kernel Version: 4.18.0-80.el8.x86_64
	CPU info: Intel(R) Xeon(R) CPU E5-2699 v4 @ 2.20GHz
	GCC Version: gcc (GCC) 8.2.1 20180905 (Red Hat 8.2.1-3)
	Clang Version: 6.0.1 (tags/RELEASE_601/final)
	x86_64-native-linuxapp-gcc


OS: SUSE15-64
	Kernel Version: 4.12.14-lp150.11-default
	CPU info: Intel(R) Xeon(R) CPU E5-2699 v4 @ 2.20GHz
	GCC Version: gcc (SUSE Linux) 7.3.1 20180323 [gcc-7-branch revision 258812]
	Clang Version: 5.0.1 (tags/RELEASE_501/final 312548)
	x86_64-native-linuxapp-gcc
	x86_64-native-linuxapp-clang


** Meson build **


OS: UB1804-64
	Kernel Version: 4.15.0-20-generic
	CPU info: Intel(R) Xeon(R) CPU E5-2699 v4 @ 2.20GHz
	GCC Version: gcc (Ubuntu 7.3.0-27ubuntu1~18.04) 7.3.0
	Clang Version: 6.0.0-1ubuntu2 (tags/RELEASE_600/final)
	x86_64-native-linuxapp-doc
	build-gcc-static
	build-gcc-shared
	build-clang-static
	build-clang-shared
	build-x86-default


OS: UB1604-32
	Kernel Version: 4.4.0-131-generic
	CPU info: Intel(R) Xeon(R) CPU E5-2699 v4 @ 2.20GHz
	GCC Version: gcc (Ubuntu 5.4.0-6ubuntu1~16.04.11) 5.4.0 20160609
	Clang Version: 3.8.0-2ubuntu4 (tags/RELEASE_380/final)
	build-gcc-static
	build-gcc-shared
	build-clang-static
	build-clang-shared
	build-x86-default


OS: FC30-64
	Kernel Version: 5.0.9-301.fc30.x86_64
	CPU info: Intel(R) Xeon(R) CPU E5-2699 v4 @ 2.20GHz
	GCC Version: gcc (GCC) 9.1.1 20190503 (Red Hat 9.1.1-1)
	Clang Version: 8.0.0 (Fedora 8.0.0-1.fc30)
	build-gcc-static
	build-gcc-shared
	build-clang-static
	build-clang-shared
	build-x86-default


OS: WIN10-64
	Kernel Version: N/A
	CPU info: N/A
	GCC Version: N/A
	Clang Version: Clang 8.0.0
	x86_64-windows-clang


OS: FreeBSD12-64
	Kernel Version: 12.0-RC3
	CPU info: Intel(R) Xeon(R) CPU E5-2699 v4 @ 2.20GHz (2194.97-MHz K8-class CPU)
	GCC Version: gcc (FreeBSD Ports Collection) 7.3.0
	Clang Version: 6.0.1 (tags/RELEASE_601/final 335540) (based on LLVM 6.0.1)
	build-gcc-static
	build-gcc-shared
	build-clang-static
	build-clang-shared
	build-x86-default


OS: SUSE15-64
	Kernel Version: 4.12.14-lp150.11-default
	CPU info: Intel(R) Xeon(R) CPU E5-2699 v4 @ 2.20GHz
	GCC Version: gcc (SUSE Linux) 7.3.1 20180323 [gcc-7-branch revision 258812]
	Clang Version: 5.0.1 (tags/RELEASE_501/final 312548)
	build-gcc-static
	build-gcc-shared
	build-clang-static
	build-clang-shared
	build-x86-default


*Make Build Failed #1:
OS: UB1604-64
Target: x86_64-native-linuxapp-clang
                                       ^
/tmp/UB1604-64_K4.4.0_Clang3.8.0/x86_64-native-linuxapp-clang/635c0aa5d6c14e308ed8077ddf24a243/dpdk/drivers/net/octeontx2/otx2_ethdev.c:1947:30: warning: incompatible pointer types initializing 'eth_dev_supported_ptypes_get_t' (aka 'const unsigned int *(*)(struct rte_eth_dev *)') with an expression of type 'int (struct rte_eth_dev *, uint32_t)' (aka 'int (struct rte_eth_dev *, unsigned int)') [-Wincompatible-pointer-types]
        .dev_supported_ptypes_set = otx2_nix_supported_ptypes_set,
                                    ^~~~~~~~~~~~~~~~~~~~~~~~~~~~~
1 warning and 1 error generated.
/tmp/UB1604-64_K4.4.0_Clang3.8.0/x86_64-native-linuxapp-clang/635c0aa5d6c14e308ed8077ddf24a243/dpdk/mk/internal/rte.compile-pre.mk:114: recipe for target 'otx2_ethdev.o' failed
make[6]: *** [otx2_ethdev.o] Error 1
make[6]: *** Waiting for unfinished jobs....
  CC efx_intr.o
  CC efx_lic.o
/tmp/UB1604-64_K4.4.0_Clang3.8.0/x86_64-native-linuxapp-clang/635c0aa5d6c14e308ed8077ddf24a243/dpdk/mk/rte.subdir.mk:35: recipe for target 'octeontx2' failed
make[5]: *** [octeontx2] Error 2
make[5]: *** Waiting for unfinished jobs....
  CC efx_mac.o
  CC efx_mcdi.o
  CC efx_mon.o
  CC efx_nic.o
--
  CC hunt_nic.o
  CC medford_nic.o
  CC medford2_nic.o
  AR librte_pmd_sfc_efx.a
  INSTALL-LIB librte_pmd_sfc_efx.a
/tmp/UB1604-64_K4.4.0_Clang3.8.0/x86_64-native-linuxapp-clang/635c0aa5d6c14e308ed8077ddf24a243/dpdk/mk/rte.subdir.mk:35: recipe for target 'net' failed
make[4]: *** [net] Error 2
/tmp/UB1604-64_K4.4.0_Clang3.8.0/x86_64-native-linuxapp-clang/635c0aa5d6c14e308ed8077ddf24a243/dpdk/mk/rte.sdkbuild.mk:46: recipe for target 'drivers' failed
make[3]: *** [drivers] Error 2
/tmp/UB1604-64_K4.4.0_Clang3.8.0/x86_64-native-linuxapp-clang/635c0aa5d6c14e308ed8077ddf24a243/dpdk/mk/rte.sdkroot.mk:98: recipe for target 'all' failed
make[2]: *** [all] Error 2
/tmp/UB1604-64_K4.4.0_Clang3.8.0/x86_64-native-linuxapp-clang/635c0aa5d6c14e308ed8077ddf24a243/dpdk/mk/rte.sdkinstall.mk:60: recipe for target 'pre_install' failed
make[1]: *** [pre_install] Error 2
/tmp/UB1604-64_K4.4.0_Clang3.8.0/x86_64-native-linuxapp-clang/635c0aa5d6c14e308ed8077ddf24a243/dpdk/mk/rte.sdkroot.mk:77: recipe for target 'install' failed
make: *** [install] Error 2


*Make Build Failed #2:
OS: UB1604-32
Target: i686-native-linuxapp-gcc
/tmp/UB1604-32_K4.4.0_GCC5.4.0/i686-native-linuxapp-gcc/635c0aa5d6c14e308ed8077ddf24a243/dpdk/drivers/net/octeontx2/otx2_ethdev.c:1992:23: warning: initialized field overwritten [-Woverride-init]
  .vlan_filter_set   = otx2_nix_vlan_filter_set,
                       ^
/tmp/UB1604-32_K4.4.0_GCC5.4.0/i686-native-linuxapp-gcc/635c0aa5d6c14e308ed8077ddf24a243/dpdk/drivers/net/octeontx2/otx2_ethdev.c:1992:23: note: (near initialization for ‘otx2_eth_dev_ops.vlan_filter_set’)
cc1: warning: unrecognized command line option ‘-Wno-address-of-packed-member’
/tmp/UB1604-32_K4.4.0_GCC5.4.0/i686-native-linuxapp-gcc/635c0aa5d6c14e308ed8077ddf24a243/dpdk/mk/internal/rte.compile-pre.mk:114: recipe for target 'otx2_ethdev.o' failed
make[6]: *** [otx2_ethdev.o] Error 1
make[6]: *** Waiting for unfinished jobs....
  PMDINFO qede_ethdev.o.pmd.c
  CC qede_ethdev.o.pmd.o
  LD qede_ethdev.o
/tmp/UB1604-32_K4.4.0_GCC5.4.0/i686-native-linuxapp-gcc/635c0aa5d6c14e308ed8077ddf24a243/dpdk/mk/rte.subdir.mk:35: recipe for target 'octeontx2' failed
make[5]: *** [octeontx2] Error 2
make[5]: *** Waiting for unfinished jobs....
  AR librte_pmd_qede.a
  INSTALL-LIB librte_pmd_qede.a
/tmp/UB1604-32_K4.4.0_GCC5.4.0/i686-native-linuxapp-gcc/635c0aa5d6c14e308ed8077ddf24a243/dpdk/mk/rte.subdir.mk:35: recipe for target 'net' failed
make[4]: *** [net] Error 2
/tmp/UB1604-32_K4.4.0_GCC5.4.0/i686-native-linuxapp-gcc/635c0aa5d6c14e308ed8077ddf24a243/dpdk/mk/rte.sdkbuild.mk:46: recipe for target 'drivers' failed
make[3]: *** [drivers] Error 2
/tmp/UB1604-32_K4.4.0_GCC5.4.0/i686-native-linuxapp-gcc/635c0aa5d6c14e308ed8077ddf24a243/dpdk/mk/rte.sdkroot.mk:98: recipe for target 'all' failed
make[2]: *** [all] Error 2
/tmp/UB1604-32_K4.4.0_GCC5.4.0/i686-native-linuxapp-gcc/635c0aa5d6c14e308ed8077ddf24a243/dpdk/mk/rte.sdkinstall.mk:60: recipe for target 'pre_install' failed
make[1]: *** [pre_install] Error 2
/tmp/UB1604-32_K4.4.0_GCC5.4.0/i686-native-linuxapp-gcc/635c0aa5d6c14e308ed8077ddf24a243/dpdk/mk/rte.sdkroot.mk:77: recipe for target 'install' failed
make: *** [install] Error 2


*Make Build Failed #3:
OS: UB1904-64
Target: x86_64-native-linuxapp-gcc
                       ^~~~~~~~~~~~~~~~~~~~~~~~
/tmp/UB1904-64_K4.18.0_GCC8.3.0/x86_64-native-linuxapp-gcc/635c0aa5d6c14e308ed8077ddf24a243/dpdk/drivers/net/octeontx2/otx2_ethdev.c:1992:23: note: (near initialization for ‘otx2_eth_dev_ops.vlan_filter_set’)
  LD ifcvf_vdpa.o
cc1: warning: unrecognized command line option ‘-Wno-address-of-packed-member’
  PMDINFO rte_eth_vhost.o.pmd.c
make[6]: *** [/tmp/UB1904-64_K4.18.0_GCC8.3.0/x86_64-native-linuxapp-gcc/635c0aa5d6c14e308ed8077ddf24a243/dpdk/mk/internal/rte.compile-pre.mk:116: otx2_ethdev.o] Error 1
make[6]: *** Waiting for unfinished jobs....
  CC rte_eth_vhost.o.pmd.o
  CC rte_eth_softnic_tm.o
  LD rte_eth_vhost.o
  CC efx_hash.o
--
  INSTALL-LIB librte_pmd_vhost.a
  CC virtio_user/vhost_kernel_tap.o
  INSTALL-LIB librte_pmd_ifc.a
  CC rte_eth_softnic_action.o
  CC virtio_user/virtio_user_dev.o
make[5]: *** [/tmp/UB1904-64_K4.18.0_GCC8.3.0/x86_64-native-linuxapp-gcc/635c0aa5d6c14e308ed8077ddf24a243/dpdk/mk/rte.subdir.mk:35: octeontx2] Error 2
make[5]: *** Waiting for unfinished jobs....
  CC ecore_sriov.o
  CC efx_lic.o
  CC efx_mac.o
  CC efx_mcdi.o
--
  CC hunt_nic.o
  CC medford_nic.o
  CC medford2_nic.o
  AR librte_pmd_sfc_efx.a
  INSTALL-LIB librte_pmd_sfc_efx.a
make[4]: *** [/tmp/UB1904-64_K4.18.0_GCC8.3.0/x86_64-native-linuxapp-gcc/635c0aa5d6c14e308ed8077ddf24a243/dpdk/mk/rte.subdir.mk:35: net] Error 2
make[3]: *** [/tmp/UB1904-64_K4.18.0_GCC8.3.0/x86_64-native-linuxapp-gcc/635c0aa5d6c14e308ed8077ddf24a243/dpdk/mk/rte.sdkbuild.mk:46: drivers] Error 2
make[2]: *** [/tmp/UB1904-64_K4.18.0_GCC8.3.0/x86_64-native-linuxapp-gcc/635c0aa5d6c14e308ed8077ddf24a243/dpdk/mk/rte.sdkroot.mk:99: all] Error 2
make[1]: *** [/tmp/UB1904-64_K4.18.0_GCC8.3.0/x86_64-native-linuxapp-gcc/635c0aa5d6c14e308ed8077ddf24a243/dpdk/mk/rte.sdkinstall.mk:61: pre_install] Error 2
make: *** [/tmp/UB1904-64_K4.18.0_GCC8.3.0/x86_64-native-linuxapp-gcc/635c0aa5d6c14e308ed8077ddf24a243/dpdk/mk/rte.sdkroot.mk:77: install] Error 2


*Make Build Failed #4:
OS: UB1804-64
Target: x86_64-native-linuxapp-icc
/tmp/UB1804-64_K4.15.0_ICC19.0.0/x86_64-native-linuxapp-icc/635c0aa5d6c14e308ed8077ddf24a243/dpdk/drivers/net/octeontx2/otx2_ethdev.c(1947): error: struct "eth_dev_ops" has no field "dev_supported_ptypes_set"
  	.dev_supported_ptypes_set = otx2_nix_supported_ptypes_set,
  	 ^

compilation aborted for /tmp/UB1804-64_K4.15.0_ICC19.0.0/x86_64-native-linuxapp-icc/635c0aa5d6c14e308ed8077ddf24a243/dpdk/drivers/net/octeontx2/otx2_ethdev.c (code 2)
/tmp/UB1804-64_K4.15.0_ICC19.0.0/x86_64-native-linuxapp-icc/635c0aa5d6c14e308ed8077ddf24a243/dpdk/mk/internal/rte.compile-pre.mk:114: recipe for target 'otx2_ethdev.o' failed
make[6]: *** [otx2_ethdev.o] Error 2
make[6]: *** Waiting for unfinished jobs....
  CC virtio_user/vhost_user.o
  CC rte_eth_softnic_tap.o
  LD vmxnet3_ethdev.o
  LD ifcvf_vdpa.o
--
  CC rte_eth_softnic_action.o
  CC rte_eth_softnic_pipeline.o
  PMDINFO rte_eth_vhost.o.pmd.c
  CC virtio_user/vhost_kernel_tap.o
  CC rte_eth_vhost.o.pmd.o
/tmp/UB1804-64_K4.15.0_ICC19.0.0/x86_64-native-linuxapp-icc/635c0aa5d6c14e308ed8077ddf24a243/dpdk/mk/rte.subdir.mk:35: recipe for target 'octeontx2' failed
make[5]: *** [octeontx2] Error 2
make[5]: *** Waiting for unfinished jobs....
  CC virtio_user/virtio_user_dev.o
  CC virtio_user_ethdev.o
  LD rte_eth_vhost.o
  CC rte_eth_softnic_thread.o
--
  LD virtio_user_ethdev.o
  AR librte_pmd_virtio.a
  INSTALL-LIB librte_pmd_virtio.a
  AR librte_pmd_softnic.a
  INSTALL-LIB librte_pmd_softnic.a
/tmp/UB1804-64_K4.15.0_ICC19.0.0/x86_64-native-linuxapp-icc/635c0aa5d6c14e308ed8077ddf24a243/dpdk/mk/rte.subdir.mk:35: recipe for target 'net' failed
make[4]: *** [net] Error 2
/tmp/UB1804-64_K4.15.0_ICC19.0.0/x86_64-native-linuxapp-icc/635c0aa5d6c14e308ed8077ddf24a243/dpdk/mk/rte.sdkbuild.mk:46: recipe for target 'drivers' failed
make[3]: *** [drivers] Error 2
/tmp/UB1804-64_K4.15.0_ICC19.0.0/x86_64-native-linuxapp-icc/635c0aa5d6c14e308ed8077ddf24a243/dpdk/mk/rte.sdkroot.mk:98: recipe for target 'all' failed
make[2]: *** [all] Error 2
/tmp/UB1804-64_K4.15.0_ICC19.0.0/x86_64-native-linuxapp-icc/635c0aa5d6c14e308ed8077ddf24a243/dpdk/mk/rte.sdkinstall.mk:60: recipe for target 'pre_install' failed
make[1]: *** [pre_install] Error 2
/tmp/UB1804-64_K4.15.0_ICC19.0.0/x86_64-native-linuxapp-icc/635c0aa5d6c14e308ed8077ddf24a243/dpdk/mk/rte.sdkroot.mk:77: recipe for target 'install' failed
make: *** [install] Error 2


*Make Build Failed #5:
OS: UB1804-64
Target: x86_64-native-linuxapp-clang
                                       ^
/tmp/UB1804-64_K4.15.0_Clang6.0.0/x86_64-native-linuxapp-clang/635c0aa5d6c14e308ed8077ddf24a243/dpdk/drivers/net/octeontx2/otx2_ethdev.c:1947:30: warning: incompatible pointer types initializing 'eth_dev_supported_ptypes_get_t' (aka 'const unsigned int *(*)(struct rte_eth_dev *)') with an expression of type 'int (struct rte_eth_dev *, uint32_t)' (aka 'int (struct rte_eth_dev *, unsigned int)') [-Wincompatible-pointer-types]
        .dev_supported_ptypes_set = otx2_nix_supported_ptypes_set,
                                    ^~~~~~~~~~~~~~~~~~~~~~~~~~~~~
1 warning and 1 error generated.
/tmp/UB1804-64_K4.15.0_Clang6.0.0/x86_64-native-linuxapp-clang/635c0aa5d6c14e308ed8077ddf24a243/dpdk/mk/internal/rte.compile-pre.mk:114: recipe for target 'otx2_ethdev.o' failed
make[6]: *** [otx2_ethdev.o] Error 1
/tmp/UB1804-64_K4.15.0_Clang6.0.0/x86_64-native-linuxapp-clang/635c0aa5d6c14e308ed8077ddf24a243/dpdk/mk/rte.subdir.mk:35: recipe for target 'octeontx2' failed
make[5]: *** [octeontx2] Error 2
make[5]: *** Waiting for unfinished jobs....
  CC bnxt_util.o
  AR librte_pmd_thunderx_nicvf.a
  INSTALL-LIB librte_pmd_thunderx_nicvf.a
  CC rte_pmd_bnxt.o
--
  CC hunt_nic.o
  CC medford2_nic.o
  CC medford_nic.o
  AR librte_pmd_sfc_efx.a
  INSTALL-LIB librte_pmd_sfc_efx.a
/tmp/UB1804-64_K4.15.0_Clang6.0.0/x86_64-native-linuxapp-clang/635c0aa5d6c14e308ed8077ddf24a243/dpdk/mk/rte.subdir.mk:35: recipe for target 'net' failed
make[4]: *** [net] Error 2
/tmp/UB1804-64_K4.15.0_Clang6.0.0/x86_64-native-linuxapp-clang/635c0aa5d6c14e308ed8077ddf24a243/dpdk/mk/rte.sdkbuild.mk:46: recipe for target 'drivers' failed
make[3]: *** [drivers] Error 2
/tmp/UB1804-64_K4.15.0_Clang6.0.0/x86_64-native-linuxapp-clang/635c0aa5d6c14e308ed8077ddf24a243/dpdk/mk/rte.sdkroot.mk:98: recipe for target 'all' failed
make[2]: *** [all] Error 2
/tmp/UB1804-64_K4.15.0_Clang6.0.0/x86_64-native-linuxapp-clang/635c0aa5d6c14e308ed8077ddf24a243/dpdk/mk/rte.sdkinstall.mk:60: recipe for target 'pre_install' failed
make[1]: *** [pre_install] Error 2
/tmp/UB1804-64_K4.15.0_Clang6.0.0/x86_64-native-linuxapp-clang/635c0aa5d6c14e308ed8077ddf24a243/dpdk/mk/rte.sdkroot.mk:77: recipe for target 'install' failed
make: *** [install] Error 2


*Make Build Failed #6:
OS: FC30-64
Target: x86_64-native-linuxapp-gcc
 1992 |  .vlan_filter_set   = otx2_nix_vlan_filter_set,
      |                       ^~~~~~~~~~~~~~~~~~~~~~~~
/tmp/FC30-64_K4.20_GCC9.1.1/x86_64-native-linuxapp-gcc/635c0aa5d6c14e308ed8077ddf24a243/dpdk/drivers/net/octeontx2/otx2_ethdev.c:1992:23: note: (near initialization for ‘otx2_eth_dev_ops.vlan_filter_set’)
  INSTALL-LIB librte_pmd_vhost.a
  CC virtio_rxtx_simple_sse.o
make[6]: *** [/tmp/FC30-64_K4.20_GCC9.1.1/x86_64-native-linuxapp-gcc/635c0aa5d6c14e308ed8077ddf24a243/dpdk/mk/internal/rte.compile-pre.mk:114: otx2_ethdev.o] Error 1
make[6]: *** Waiting for unfinished jobs....
  CC otx2_flow_ctrl.o
  CC sfc_filter.o
  CC sfc_flow.o
  CC rte_eth_softnic_tm.o
  CC ifcvf_vdpa.o
  CC virtio_user/vhost_user.o
  CC ecore_sp_commands.o
make[5]: *** [/tmp/FC30-64_K4.20_GCC9.1.1/x86_64-native-linuxapp-gcc/635c0aa5d6c14e308ed8077ddf24a243/dpdk/mk/rte.subdir.mk:35: octeontx2] Error 2
make[5]: *** Waiting for unfinished jobs....
  CC tap_bpf_api.o
  CC rte_eth_softnic_tap.o
  CC sfc_dp.o
  CC ifcvf.o
--
  CC hunt_nic.o
  CC medford_nic.o
  CC medford2_nic.o
  AR librte_pmd_sfc_efx.a
  INSTALL-LIB librte_pmd_sfc_efx.a
make[4]: *** [/tmp/FC30-64_K4.20_GCC9.1.1/x86_64-native-linuxapp-gcc/635c0aa5d6c14e308ed8077ddf24a243/dpdk/mk/rte.subdir.mk:35: net] Error 2
make[3]: *** [/tmp/FC30-64_K4.20_GCC9.1.1/x86_64-native-linuxapp-gcc/635c0aa5d6c14e308ed8077ddf24a243/dpdk/mk/rte.sdkbuild.mk:46: drivers] Error 2
make[2]: *** [/tmp/FC30-64_K4.20_GCC9.1.1/x86_64-native-linuxapp-gcc/635c0aa5d6c14e308ed8077ddf24a243/dpdk/mk/rte.sdkroot.mk:99: all] Error 2
make[1]: *** [/tmp/FC30-64_K4.20_GCC9.1.1/x86_64-native-linuxapp-gcc/635c0aa5d6c14e308ed8077ddf24a243/dpdk/mk/rte.sdkinstall.mk:61: pre_install] Error 2
make: *** [/tmp/FC30-64_K4.20_GCC9.1.1/x86_64-native-linuxapp-gcc/635c0aa5d6c14e308ed8077ddf24a243/dpdk/mk/rte.sdkroot.mk:77: install] Error 2


*Make Build Failed #7:
OS: SUSE15-64
Target: x86_64-native-linuxapp-gcc
/tmp/SUSE15-64_K4.12.14_GCC7.3.1/x86_64-native-linuxapp-gcc/635c0aa5d6c14e308ed8077ddf24a243/dpdk/drivers/net/octeontx2/otx2_ethdev.c:1992:23: warning: initialized field overwritten [-Woverride-init]
  .vlan_filter_set   = otx2_nix_vlan_filter_set,
                       ^~~~~~~~~~~~~~~~~~~~~~~~
/tmp/SUSE15-64_K4.12.14_GCC7.3.1/x86_64-native-linuxapp-gcc/635c0aa5d6c14e308ed8077ddf24a243/dpdk/drivers/net/octeontx2/otx2_ethdev.c:1992:23: note: (near initialization for ‘otx2_eth_dev_ops.vlan_filter_set’)
cc1: warning: unrecognized command line option ‘-Wno-address-of-packed-member’
make[6]: *** [/tmp/SUSE15-64_K4.12.14_GCC7.3.1/x86_64-native-linuxapp-gcc/635c0aa5d6c14e308ed8077ddf24a243/dpdk/mk/internal/rte.compile-pre.mk:116: otx2_ethdev.o] Error 1
make[5]: *** [/tmp/SUSE15-64_K4.12.14_GCC7.3.1/x86_64-native-linuxapp-gcc/635c0aa5d6c14e308ed8077ddf24a243/dpdk/mk/rte.subdir.mk:37: octeontx2] Error 2
make[5]: *** Waiting for unfinished jobs....
  CC ixgbe_fdir.o
  CC ecore_sriov.o
  CC bcm_osal.o
  CC tap_flow.o
--
  CC hunt_nic.o
  CC medford_nic.o
  CC medford2_nic.o
  AR librte_pmd_sfc_efx.a
  INSTALL-LIB librte_pmd_sfc_efx.a
make[4]: *** [/tmp/SUSE15-64_K4.12.14_GCC7.3.1/x86_64-native-linuxapp-gcc/635c0aa5d6c14e308ed8077ddf24a243/dpdk/mk/rte.subdir.mk:35: net] Error 2
make[3]: *** [/tmp/SUSE15-64_K4.12.14_GCC7.3.1/x86_64-native-linuxapp-gcc/635c0aa5d6c14e308ed8077ddf24a243/dpdk/mk/rte.sdkbuild.mk:46: drivers] Error 2
make[2]: *** [/tmp/SUSE15-64_K4.12.14_GCC7.3.1/x86_64-native-linuxapp-gcc/635c0aa5d6c14e308ed8077ddf24a243/dpdk/mk/rte.sdkroot.mk:99: all] Error 2
make[1]: *** [/tmp/SUSE15-64_K4.12.14_GCC7.3.1/x86_64-native-linuxapp-gcc/635c0aa5d6c14e308ed8077ddf24a243/dpdk/mk/rte.sdkinstall.mk:61: pre_install] Error 2
make: *** [/tmp/SUSE15-64_K4.12.14_GCC7.3.1/x86_64-native-linuxapp-gcc/635c0aa5d6c14e308ed8077ddf24a243/dpdk/mk/rte.sdkroot.mk:77: install] Error 2


*Make Build Failed #8:
OS: RHEL80-64
Target: x86_64-native-linuxapp-gcc
/tmp/RHEL80-64_K3.10.0_GCC8.2.1/x86_64-native-linuxapp-gcc/635c0aa5d6c14e308ed8077ddf24a243/dpdk/drivers/net/octeontx2/otx2_ethdev.c:1992:23: warning: initialized field overwritten [-Woverride-init]
  .vlan_filter_set   = otx2_nix_vlan_filter_set,
                       ^~~~~~~~~~~~~~~~~~~~~~~~
/tmp/RHEL80-64_K3.10.0_GCC8.2.1/x86_64-native-linuxapp-gcc/635c0aa5d6c14e308ed8077ddf24a243/dpdk/drivers/net/octeontx2/otx2_ethdev.c:1992:23: note: (near initialization for ‘otx2_eth_dev_ops.vlan_filter_set’)
cc1: warning: unrecognized command line option ‘-Wno-address-of-packed-member’
make[6]: *** [/tmp/RHEL80-64_K3.10.0_GCC8.2.1/x86_64-native-linuxapp-gcc/635c0aa5d6c14e308ed8077ddf24a243/dpdk/mk/internal/rte.compile-pre.mk:114: otx2_ethdev.o] Error 1
make[6]: *** Waiting for unfinished jobs....
== Build drivers/net/vdev_netvsc
  CC tap_tcmsgs.o
  CC ecore_init_fw_funcs.o
make[5]: *** [/tmp/RHEL80-64_K3.10.0_GCC8.2.1/x86_64-native-linuxapp-gcc/635c0aa5d6c14e308ed8077ddf24a243/dpdk/mk/rte.subdir.mk:35: octeontx2] Error 2
make[5]: *** Waiting for unfinished jobs....
  CC ixgbe_fdir.o
  CC bnxt_irq.o
  CC ixgbe_pf.o
  CC tap_bpf_api.o
--
  CC hunt_nic.o
  CC medford_nic.o
  CC medford2_nic.o
  AR librte_pmd_sfc_efx.a
  INSTALL-LIB librte_pmd_sfc_efx.a
make[4]: *** [/tmp/RHEL80-64_K3.10.0_GCC8.2.1/x86_64-native-linuxapp-gcc/635c0aa5d6c14e308ed8077ddf24a243/dpdk/mk/rte.subdir.mk:35: net] Error 2
make[3]: *** [/tmp/RHEL80-64_K3.10.0_GCC8.2.1/x86_64-native-linuxapp-gcc/635c0aa5d6c14e308ed8077ddf24a243/dpdk/mk/rte.sdkbuild.mk:46: drivers] Error 2
make[2]: *** [/tmp/RHEL80-64_K3.10.0_GCC8.2.1/x86_64-native-linuxapp-gcc/635c0aa5d6c14e308ed8077ddf24a243/dpdk/mk/rte.sdkroot.mk:99: all] Error 2
make[1]: *** [/tmp/RHEL80-64_K3.10.0_GCC8.2.1/x86_64-native-linuxapp-gcc/635c0aa5d6c14e308ed8077ddf24a243/dpdk/mk/rte.sdkinstall.mk:61: pre_install] Error 2
make: *** [/tmp/RHEL80-64_K3.10.0_GCC8.2.1/x86_64-native-linuxapp-gcc/635c0aa5d6c14e308ed8077ddf24a243/dpdk/mk/rte.sdkroot.mk:77: install] Error 2


*Make Build Failed #9:
OS: RHEL76-64
Target: x86_64-native-linuxapp-gcc
/tmp/RHEL76-64_K3.10.0_GCC4.8.5/x86_64-native-linuxapp-gcc/635c0aa5d6c14e308ed8077ddf24a243/dpdk/drivers/net/octeontx2/otx2_ethdev.c:1992:2: warning: initialized field overwritten [-Woverride-init]
  .vlan_filter_set   = otx2_nix_vlan_filter_set,
  ^
/tmp/RHEL76-64_K3.10.0_GCC4.8.5/x86_64-native-linuxapp-gcc/635c0aa5d6c14e308ed8077ddf24a243/dpdk/drivers/net/octeontx2/otx2_ethdev.c:1992:2: warning: (near initialization for ‘otx2_eth_dev_ops.vlan_filter_set’) [-Woverride-init]
cc1: warning: unrecognized command line option "-Wno-address-of-packed-member" [enabled by default]
make[6]: *** [otx2_ethdev.o] Error 1
make[6]: *** Waiting for unfinished jobs....
== Build drivers/net/kni
  CC virtio_pci.o
  CC sfc_ef10_essb_rx.o
make[5]: *** [octeontx2] Error 2
make[5]: *** Waiting for unfinished jobs....
  PMDINFO vdev_netvsc.o.pmd.c
  CC sfc_ef10_tx.o
  CC vdev_netvsc.o.pmd.o
  LD vdev_netvsc.o
--
  CC medford2_nic.o
  AR librte_pmd_sfc_efx.a
  INSTALL-LIB librte_pmd_sfc_efx.a
  AR librte_pmd_qede.a
  INSTALL-LIB librte_pmd_qede.a
make[4]: *** [net] Error 2
make[3]: *** [drivers] Error 2
make[2]: *** [all] Error 2
make[1]: *** [pre_install] Error 2
make: *** [install] Error 2


*Make Build Failed #10:
OS: FC30-64
Target: x86_64-native-linuxapp-clang
/tmp/FC30-64_K4.20_Clang8.0.0/x86_64-native-linuxapp-clang/635c0aa5d6c14e308ed8077ddf24a243/dpdk/drivers/net/octeontx2/otx2_ethdev.c:1947:30: warning: incompatible pointer types initializing 'eth_dev_supported_ptypes_get_t' (aka 'const unsigned int *(*)(struct rte_eth_dev *)') with an expression of type 'int (struct rte_eth_dev *, uint32_t)' (aka 'int (struct rte_eth_dev *, unsigned int)') [-Wincompatible-pointer-types]
        .dev_supported_ptypes_set = otx2_nix_supported_ptypes_set,
                                    ^~~~~~~~~~~~~~~~~~~~~~~~~~~~~
1 warning and 1 error generated.
  CC otx2_flow_utils.o
make[6]: *** [/tmp/FC30-64_K4.20_Clang8.0.0/x86_64-native-linuxapp-clang/635c0aa5d6c14e308ed8077ddf24a243/dpdk/mk/internal/rte.compile-pre.mk:116: otx2_ethdev.o] Error 1
make[6]: *** Waiting for unfinished jobs....
  CC sfc_kvargs.o
  CC ecore_l2.o
  CC sfc.o
  CC ecore_sp_commands.o
--
  AR librte_pmd_bnxt.a
  INSTALL-LIB librte_pmd_bnxt.a
== Build drivers/net/thunderx
  CC tap_netlink.o
  CC tap_tcmsgs.o
make[5]: *** [/tmp/FC30-64_K4.20_Clang8.0.0/x86_64-native-linuxapp-clang/635c0aa5d6c14e308ed8077ddf24a243/dpdk/mk/rte.subdir.mk:37: octeontx2] Error 2
make[5]: *** Waiting for unfinished jobs....
  CC tap_bpf_api.o
  CC sfc_mcdi.o
  CC sfc_intr.o
  CC nicvf_rxtx.o
--
  CC hunt_nic.o
  CC medford_nic.o
  CC medford2_nic.o
  AR librte_pmd_sfc_efx.a
  INSTALL-LIB librte_pmd_sfc_efx.a
make[4]: *** [/tmp/FC30-64_K4.20_Clang8.0.0/x86_64-native-linuxapp-clang/635c0aa5d6c14e308ed8077ddf24a243/dpdk/mk/rte.subdir.mk:35: net] Error 2
make[3]: *** [/tmp/FC30-64_K4.20_Clang8.0.0/x86_64-native-linuxapp-clang/635c0aa5d6c14e308ed8077ddf24a243/dpdk/mk/rte.sdkbuild.mk:46: drivers] Error 2
make[2]: *** [/tmp/FC30-64_K4.20_Clang8.0.0/x86_64-native-linuxapp-clang/635c0aa5d6c14e308ed8077ddf24a243/dpdk/mk/rte.sdkroot.mk:99: all] Error 2
make[1]: *** [/tmp/FC30-64_K4.20_Clang8.0.0/x86_64-native-linuxapp-clang/635c0aa5d6c14e308ed8077ddf24a243/dpdk/mk/rte.sdkinstall.mk:61: pre_install] Error 2
make: *** [/tmp/FC30-64_K4.20_Clang8.0.0/x86_64-native-linuxapp-clang/635c0aa5d6c14e308ed8077ddf24a243/dpdk/mk/rte.sdkroot.mk:77: install] Error 2


*Make Build Failed #11:
OS: SUSE15-64
Target: x86_64-native-linuxapp-clang
                                       ^
/tmp/SUSE15-64_K4.12.14_Clang5.0.1/x86_64-native-linuxapp-clang/635c0aa5d6c14e308ed8077ddf24a243/dpdk/drivers/net/octeontx2/otx2_ethdev.c:1947:30: warning: incompatible pointer types initializing 'eth_dev_supported_ptypes_get_t' (aka 'const unsigned int *(*)(struct rte_eth_dev *)') with an expression of type 'int (struct rte_eth_dev *, uint32_t)' (aka 'int (struct rte_eth_dev *, unsigned int)') [-Wincompatible-pointer-types]
        .dev_supported_ptypes_set = otx2_nix_supported_ptypes_set,
                                    ^~~~~~~~~~~~~~~~~~~~~~~~~~~~~
1 warning and 1 error generated.
make[6]: *** [/tmp/SUSE15-64_K4.12.14_Clang5.0.1/x86_64-native-linuxapp-clang/635c0aa5d6c14e308ed8077ddf24a243/dpdk/mk/internal/rte.compile-pre.mk:116: otx2_ethdev.o] Error 1
make[6]: *** Waiting for unfinished jobs....
  CC otx2_flow_parse.o
  CC efx_phy.o
  CC efx_port.o
  CC efx_proxy.o
--
  CC rte_eth_softnic_pipeline.o
  AR librte_pmd_qede.a
  CC rte_eth_softnic_thread.o
  INSTALL-LIB librte_pmd_qede.a
  CC rte_eth_softnic_cli.o
make[5]: *** [/tmp/SUSE15-64_K4.12.14_Clang5.0.1/x86_64-native-linuxapp-clang/635c0aa5d6c14e308ed8077ddf24a243/dpdk/mk/rte.subdir.mk:35: octeontx2] Error 2
make[5]: *** Waiting for unfinished jobs....
  CC rte_eth_softnic_flow.o
  CC efx_tunnel.o
  CC rte_eth_softnic_meter.o
  CC efx_tx.o
--
  CC hunt_nic.o
  CC medford_nic.o
  CC medford2_nic.o
  AR librte_pmd_sfc_efx.a
  INSTALL-LIB librte_pmd_sfc_efx.a
make[4]: *** [/tmp/SUSE15-64_K4.12.14_Clang5.0.1/x86_64-native-linuxapp-clang/635c0aa5d6c14e308ed8077ddf24a243/dpdk/mk/rte.subdir.mk:35: net] Error 2
make[3]: *** [/tmp/SUSE15-64_K4.12.14_Clang5.0.1/x86_64-native-linuxapp-clang/635c0aa5d6c14e308ed8077ddf24a243/dpdk/mk/rte.sdkbuild.mk:46: drivers] Error 2
make[2]: *** [/tmp/SUSE15-64_K4.12.14_Clang5.0.1/x86_64-native-linuxapp-clang/635c0aa5d6c14e308ed8077ddf24a243/dpdk/mk/rte.sdkroot.mk:99: all] Error 2
make[1]: *** [/tmp/SUSE15-64_K4.12.14_Clang5.0.1/x86_64-native-linuxapp-clang/635c0aa5d6c14e308ed8077ddf24a243/dpdk/mk/rte.sdkinstall.mk:61: pre_install] Error 2
make: *** [/tmp/SUSE15-64_K4.12.14_Clang5.0.1/x86_64-native-linuxapp-clang/635c0aa5d6c14e308ed8077ddf24a243/dpdk/mk/rte.sdkroot.mk:77: install] Error 2


*Make Build Failed #12:
OS: UB1604-64
Target: x86_64-native-linuxapp-gcc
/tmp/UB1604-64_K4.4.0_GCC5.4.0/x86_64-native-linuxapp-gcc/635c0aa5d6c14e308ed8077ddf24a243/dpdk/drivers/net/octeontx2/otx2_ethdev.c:1992:23: warning: initialized field overwritten [-Woverride-init]
  .vlan_filter_set   = otx2_nix_vlan_filter_set,
                       ^
/tmp/UB1604-64_K4.4.0_GCC5.4.0/x86_64-native-linuxapp-gcc/635c0aa5d6c14e308ed8077ddf24a243/dpdk/drivers/net/octeontx2/otx2_ethdev.c:1992:23: note: (near initialization for ‘otx2_eth_dev_ops.vlan_filter_set’)
cc1: warning: unrecognized command line option ‘-Wno-address-of-packed-member’
/tmp/UB1604-64_K4.4.0_GCC5.4.0/x86_64-native-linuxapp-gcc/635c0aa5d6c14e308ed8077ddf24a243/dpdk/mk/internal/rte.compile-pre.mk:114: recipe for target 'otx2_ethdev.o' failed
make[6]: *** [otx2_ethdev.o] Error 1
make[6]: *** Waiting for unfinished jobs....
== Build drivers/net/virtio
  CC sfc_flow.o
== Build drivers/net/vmxnet3
  PMDINFO vdev_netvsc.o.pmd.c
  CC vdev_netvsc.o.pmd.o
/tmp/UB1604-64_K4.4.0_GCC5.4.0/x86_64-native-linuxapp-gcc/635c0aa5d6c14e308ed8077ddf24a243/dpdk/mk/rte.subdir.mk:35: recipe for target 'octeontx2' failed
make[5]: *** [octeontx2] Error 2
make[5]: *** Waiting for unfinished jobs....
  CC nicvf_svf.o
  LD vdev_netvsc.o
  AR librte_pmd_vdev_netvsc.a
  INSTALL-LIB librte_pmd_vdev_netvsc.a
--
  CC medford2_nic.o
  AR librte_pmd_virtio.a
  INSTALL-LIB librte_pmd_virtio.a
  AR librte_pmd_sfc_efx.a
  INSTALL-LIB librte_pmd_sfc_efx.a
/tmp/UB1604-64_K4.4.0_GCC5.4.0/x86_64-native-linuxapp-gcc/635c0aa5d6c14e308ed8077ddf24a243/dpdk/mk/rte.subdir.mk:35: recipe for target 'net' failed
make[4]: *** [net] Error 2
/tmp/UB1604-64_K4.4.0_GCC5.4.0/x86_64-native-linuxapp-gcc/635c0aa5d6c14e308ed8077ddf24a243/dpdk/mk/rte.sdkbuild.mk:46: recipe for target 'drivers' failed
make[3]: *** [drivers] Error 2
/tmp/UB1604-64_K4.4.0_GCC5.4.0/x86_64-native-linuxapp-gcc/635c0aa5d6c14e308ed8077ddf24a243/dpdk/mk/rte.sdkroot.mk:98: recipe for target 'all' failed
make[2]: *** [all] Error 2
/tmp/UB1604-64_K4.4.0_GCC5.4.0/x86_64-native-linuxapp-gcc/635c0aa5d6c14e308ed8077ddf24a243/dpdk/mk/rte.sdkinstall.mk:60: recipe for target 'pre_install' failed
make[1]: *** [pre_install] Error 2
/tmp/UB1604-64_K4.4.0_GCC5.4.0/x86_64-native-linuxapp-gcc/635c0aa5d6c14e308ed8077ddf24a243/dpdk/mk/rte.sdkroot.mk:77: recipe for target 'install' failed
make: *** [install] Error 2


*Make Build Failed #13:
OS: UB1804-64
Target: x86_64-native-linuxapp-gcc
/tmp/UB1804-64_K4.15.0_GCC7.3.0/x86_64-native-linuxapp-gcc/635c0aa5d6c14e308ed8077ddf24a243/dpdk/drivers/net/octeontx2/otx2_ethdev.c:1992:23: warning: initialized field overwritten [-Woverride-init]
  .vlan_filter_set   = otx2_nix_vlan_filter_set,
                       ^~~~~~~~~~~~~~~~~~~~~~~~
/tmp/UB1804-64_K4.15.0_GCC7.3.0/x86_64-native-linuxapp-gcc/635c0aa5d6c14e308ed8077ddf24a243/dpdk/drivers/net/octeontx2/otx2_ethdev.c:1992:23: note: (near initialization for ‘otx2_eth_dev_ops.vlan_filter_set’)
cc1: warning: unrecognized command line option ‘-Wno-address-of-packed-member’
/tmp/UB1804-64_K4.15.0_GCC7.3.0/x86_64-native-linuxapp-gcc/635c0aa5d6c14e308ed8077ddf24a243/dpdk/mk/internal/rte.compile-pre.mk:114: recipe for target 'otx2_ethdev.o' failed
make[6]: *** [otx2_ethdev.o] Error 1
make[6]: *** Waiting for unfinished jobs....
  CC sfc_ef10_rx.o
  CC ecore_dcbx.o
  CC bcm_osal.o
  CC ecore_sriov.o
--
  CC virtio_user/virtio_user_dev.o
  CC efx_mon.o
  CC efx_nic.o
  PMDINFO virtio_ethdev.o.pmd.c
  CC virtio_ethdev.o.pmd.o
/tmp/UB1804-64_K4.15.0_GCC7.3.0/x86_64-native-linuxapp-gcc/635c0aa5d6c14e308ed8077ddf24a243/dpdk/mk/rte.subdir.mk:35: recipe for target 'octeontx2' failed
make[5]: *** [octeontx2] Error 2
make[5]: *** Waiting for unfinished jobs....
  LD virtio_ethdev.o
  CC efx_nvram.o
  CC virtio_user_ethdev.o
  CC efx_phy.o
--
  CC medford2_nic.o
  AR librte_pmd_sfc_efx.a
  INSTALL-LIB librte_pmd_sfc_efx.a
  AR librte_pmd_virtio.a
  INSTALL-LIB librte_pmd_virtio.a
/tmp/UB1804-64_K4.15.0_GCC7.3.0/x86_64-native-linuxapp-gcc/635c0aa5d6c14e308ed8077ddf24a243/dpdk/mk/rte.subdir.mk:35: recipe for target 'net' failed
make[4]: *** [net] Error 2
/tmp/UB1804-64_K4.15.0_GCC7.3.0/x86_64-native-linuxapp-gcc/635c0aa5d6c14e308ed8077ddf24a243/dpdk/mk/rte.sdkbuild.mk:46: recipe for target 'drivers' failed
make[3]: *** [drivers] Error 2
/tmp/UB1804-64_K4.15.0_GCC7.3.0/x86_64-native-linuxapp-gcc/635c0aa5d6c14e308ed8077ddf24a243/dpdk/mk/rte.sdkroot.mk:98: recipe for target 'all' failed
make[2]: *** [all] Error 2
/tmp/UB1804-64_K4.15.0_GCC7.3.0/x86_64-native-linuxapp-gcc/635c0aa5d6c14e308ed8077ddf24a243/dpdk/mk/rte.sdkinstall.mk:60: recipe for target 'pre_install' failed
make[1]: *** [pre_install] Error 2
/tmp/UB1804-64_K4.15.0_GCC7.3.0/x86_64-native-linuxapp-gcc/635c0aa5d6c14e308ed8077ddf24a243/dpdk/mk/rte.sdkroot.mk:77: recipe for target 'install' failed
make: *** [install] Error 2


*Make Build Failed #14:
OS: FreeBSD12-64
Target: x86_64-native-bsdapp-clang
        .dev_supported_ptypes_set = otx2_nix_supported_ptypes_set,
                                    ^~~~~~~~~~~~~~~~~~~~~~~~~~~~~
1 warning  CC bnxt_vnic.o
 and 1 error generated.
  CC sfc_mcdi.o
gmake[6]: *** [/tmp/FreeBSD12-64_K19.02_Clang6.0.1/x86_64-native-bsdapp-clang/635c0aa5d6c14e308ed8077ddf24a243/dpdk/mk/internal/rte.compile-pre.mk:116: otx2_ethdev.o] Error 1
gmake[6]: *** Waiting for unfinished jobs....
== Build drivers/net/vmxnet3
  CC nicvf_ethdev.o
  CC virtio_rxtx.o
gmake[5]: *** [/tmp/FreeBSD12-64_K19.02_Clang6.0.1/x86_64-native-bsdapp-clang/635c0aa5d6c14e308ed8077ddf24a243/dpdk/mk/rte.subdir.mk:37: octeontx2] Error 2
gmake[5]: *** Waiting for unfinished jobs....
  CC ixgbe_ethdev.o
  CC ecore_int.o
  CC vmxnet3_rxtx.o
  CC sfc_intr.o
--
  CC hunt_nic.o
  CC medford2_nic.o
  CC medford_nic.o
  AR librte_pmd_sfc_efx.a
  INSTALL-LIB librte_pmd_sfc_efx.a
gmake[4]: *** [/tmp/FreeBSD12-64_K19.02_Clang6.0.1/x86_64-native-bsdapp-clang/635c0aa5d6c14e308ed8077ddf24a243/dpdk/mk/rte.subdir.mk:35: net] Error 2
gmake[3]: *** [/tmp/FreeBSD12-64_K19.02_Clang6.0.1/x86_64-native-bsdapp-clang/635c0aa5d6c14e308ed8077ddf24a243/dpdk/mk/rte.sdkbuild.mk:46: drivers] Error 2
gmake[2]: *** [/tmp/FreeBSD12-64_K19.02_Clang6.0.1/x86_64-native-bsdapp-clang/635c0aa5d6c14e308ed8077ddf24a243/dpdk/mk/rte.sdkroot.mk:99: all] Error 2
gmake[1]: *** [/tmp/FreeBSD12-64_K19.02_Clang6.0.1/x86_64-native-bsdapp-clang/635c0aa5d6c14e308ed8077ddf24a243/dpdk/mk/rte.sdkinstall.mk:61: pre_install] Error 2
gmake: *** [/tmp/FreeBSD12-64_K19.02_Clang6.0.1/x86_64-native-bsdapp-clang/635c0aa5d6c14e308ed8077ddf24a243/dpdk/mk/rte.sdkroot.mk:77: install] Error 2


*Make Build Failed #15:
OS: FreeBSD12-64
Target: x86_64-native-bsdapp-gcc+debug
/tmp/FreeBSD12-64_K19.02_GCC7.3.0/x86_64-native-bsdapp-gcc+debug/635c0aa5d6c14e308ed8077ddf24a243/dpdk/drivers/net/octeontx2/otx2_ethdev.c:1992:23: warning: initialized field overwritten [-Woverride-init]
  .vlan_filter_set   = otx2_nix_vlan_filter_set,
                       ^~~~~~~~~~~~~~~~~~~~~~~~
/tmp/FreeBSD12-64_K19.02_GCC7.3.0/x86_64-native-bsdapp-gcc+debug/635c0aa5d6c14e308ed8077ddf24a243/dpdk/drivers/net/octeontx2/otx2_ethdev.c:1992:23: note: (near initialization for 'otx2_eth_dev_ops.vlan_filter_set')
cc1: warning: unrecognized command line option '-Wno-address-of-packed-member'
gmake[6]: *** [/tmp/FreeBSD12-64_K19.02_GCC7.3.0/x86_64-native-bsdapp-gcc+debug/635c0aa5d6c14e308ed8077ddf24a243/dpdk/mk/internal/rte.compile-pre.mk:116: otx2_ethdev.o] Error 1
gmake[5]: *** [/tmp/FreeBSD12-64_K19.02_GCC7.3.0/x86_64-native-bsdapp-gcc+debug/635c0aa5d6c14e308ed8077ddf24a243/dpdk/mk/rte.subdir.mk:35: octeontx2] Error 2
gmake[5]: *** Waiting for unfinished jobs....
  CC ecore_dcbx.o
  CC virtqueue.o
  CC nicvf_rxtx.o
  CC sfc_tx.o
--
  CC ef10_vpd.o
  CC medford_nic.o
  CC medford2_nic.o
  AR librte_pmd_sfc_efx.a
  INSTALL-LIB librte_pmd_sfc_efx.a
gmake[4]: *** [/tmp/FreeBSD12-64_K19.02_GCC7.3.0/x86_64-native-bsdapp-gcc+debug/635c0aa5d6c14e308ed8077ddf24a243/dpdk/mk/rte.subdir.mk:35: net] Error 2
gmake[3]: *** [/tmp/FreeBSD12-64_K19.02_GCC7.3.0/x86_64-native-bsdapp-gcc+debug/635c0aa5d6c14e308ed8077ddf24a243/dpdk/mk/rte.sdkbuild.mk:46: drivers] Error 2
gmake[2]: *** [/tmp/FreeBSD12-64_K19.02_GCC7.3.0/x86_64-native-bsdapp-gcc+debug/635c0aa5d6c14e308ed8077ddf24a243/dpdk/mk/rte.sdkroot.mk:99: all] Error 2
gmake[1]: *** [/tmp/FreeBSD12-64_K19.02_GCC7.3.0/x86_64-native-bsdapp-gcc+debug/635c0aa5d6c14e308ed8077ddf24a243/dpdk/mk/rte.sdkinstall.mk:61: pre_install] Error 2
gmake: *** [/tmp/FreeBSD12-64_K19.02_GCC7.3.0/x86_64-native-bsdapp-gcc+debug/635c0aa5d6c14e308ed8077ddf24a243/dpdk/mk/rte.sdkroot.mk:77: install] Error 2


*Make Build Failed #16:
OS: CENTOS76-64
Target: x86_64-native-linuxapp-clang
                                       ^
/tmp/CENTOS76-64_K3.10.0_Clang3.4.2/x86_64-native-linuxapp-clang/635c0aa5d6c14e308ed8077ddf24a243/dpdk/drivers/net/octeontx2/otx2_ethdev.c:1947:30: warning: incompatible pointer types initializing 'eth_dev_supported_ptypes_get_t' (aka 'const uint32_t *(*)(struct rte_eth_dev *)') with an expression of type 'int (struct rte_eth_dev *, uint32_t)' [-Wincompatible-pointer-types]
        .dev_supported_ptypes_set = otx2_nix_supported_ptypes_set,
                                    ^~~~~~~~~~~~~~~~~~~~~~~~~~~~~
1 warning and 1 error generated.
make[6]: *** [otx2_ethdev.o] Error 1
make[6]: *** Waiting for unfinished jobs....
  CC sfc_tx.o
  CC sfc_tso.o
  CC nicvf_hw.o
  CC tap_tcmsgs.o
  CC ixgbe_pf.o
  CC tap_bpf_api.o
make[5]: *** [octeontx2] Error 2
make[5]: *** Waiting for unfinished jobs....
  CC tap_intr.o
  CC ixgbe_flow.o
  CC ecore_init_fw_funcs.o
  CC nicvf_mbox.o
--
  CC hunt_nic.o
  CC medford_nic.o
  CC medford2_nic.o
  AR librte_pmd_sfc_efx.a
  INSTALL-LIB librte_pmd_sfc_efx.a
make[4]: *** [net] Error 2
make[3]: *** [drivers] Error 2
make[2]: *** [all] Error 2
make[1]: *** [pre_install] Error 2
make: *** [install] Error 2


*Make Build Failed #17:
OS: FreeBSD12-64
Target: x86_64-native-bsdapp-gcc+shared
/tmp/FreeBSD12-64_K19.02_GCC7.3.0/x86_64-native-bsdapp-gcc+shared/635c0aa5d6c14e308ed8077ddf24a243/dpdk/drivers/net/octeontx2/otx2_ethdev.c:1992:23: warning: initialized field overwritten [-Woverride-init]
  .vlan_filter_set   = otx2_nix_vlan_filter_set,
                       ^~~~~~~~~~~~~~~~~~~~~~~~
/tmp/FreeBSD12-64_K19.02_GCC7.3.0/x86_64-native-bsdapp-gcc+shared/635c0aa5d6c14e308ed8077ddf24a243/dpdk/drivers/net/octeontx2/otx2_ethdev.c:1992:23: note: (near initialization for 'otx2_eth_dev_ops.vlan_filter_set')
cc1: warning: unrecognized command line option '-Wno-address-of-packed-member'
gmake[6]: *** [/tmp/FreeBSD12-64_K19.02_GCC7.3.0/x86_64-native-bsdapp-gcc+shared/635c0aa5d6c14e308ed8077ddf24a243/dpdk/mk/internal/rte.compile-pre.mk:116: otx2_ethdev.o] Error 1
gmake[5]: *** [/tmp/FreeBSD12-64_K19.02_GCC7.3.0/x86_64-native-bsdapp-gcc+shared/635c0aa5d6c14e308ed8077ddf24a243/dpdk/mk/rte.subdir.mk:35: octeontx2] Error 2
gmake[5]: *** Waiting for unfinished jobs....
  CC ecore_dcbx.o
  PMDINFO ixgbe_ethdev.o.pmd.c
  CC ixgbe_ethdev.o.pmd.o
  CC vmxnet3_ethdev.o
--
  CC hunt_nic.o
  CC medford_nic.o
  CC medford2_nic.o
  LD librte_pmd_sfc_efx.so.1.1
  INSTALL-LIB librte_pmd_sfc_efx.so.1.1
gmake[4]: *** [/tmp/FreeBSD12-64_K19.02_GCC7.3.0/x86_64-native-bsdapp-gcc+shared/635c0aa5d6c14e308ed8077ddf24a243/dpdk/mk/rte.subdir.mk:35: net] Error 2
gmake[3]: *** [/tmp/FreeBSD12-64_K19.02_GCC7.3.0/x86_64-native-bsdapp-gcc+shared/635c0aa5d6c14e308ed8077ddf24a243/dpdk/mk/rte.sdkbuild.mk:46: drivers] Error 2
gmake[2]: *** [/tmp/FreeBSD12-64_K19.02_GCC7.3.0/x86_64-native-bsdapp-gcc+shared/635c0aa5d6c14e308ed8077ddf24a243/dpdk/mk/rte.sdkroot.mk:99: all] Error 2
gmake[1]: *** [/tmp/FreeBSD12-64_K19.02_GCC7.3.0/x86_64-native-bsdapp-gcc+shared/635c0aa5d6c14e308ed8077ddf24a243/dpdk/mk/rte.sdkinstall.mk:61: pre_install] Error 2
gmake: *** [/tmp/FreeBSD12-64_K19.02_GCC7.3.0/x86_64-native-bsdapp-gcc+shared/635c0aa5d6c14e308ed8077ddf24a243/dpdk/mk/rte.sdkroot.mk:77: install] Error 2


*Make Build Failed #18:
OS: CENTOS76-64
Target: x86_64-native-linuxapp-gcc
/tmp/CENTOS76-64_K3.10.0_GCC4.8.5/x86_64-native-linuxapp-gcc/635c0aa5d6c14e308ed8077ddf24a243/dpdk/drivers/net/octeontx2/otx2_ethdev.c:1992:2: warning: initialized field overwritten [-Woverride-init]
  .vlan_filter_set   = otx2_nix_vlan_filter_set,
  ^
/tmp/CENTOS76-64_K3.10.0_GCC4.8.5/x86_64-native-linuxapp-gcc/635c0aa5d6c14e308ed8077ddf24a243/dpdk/drivers/net/octeontx2/otx2_ethdev.c:1992:2: warning: (near initialization for ‘otx2_eth_dev_ops.vlan_filter_set’) [-Woverride-init]
cc1: warning: unrecognized command line option "-Wno-address-of-packed-member" [enabled by default]
make[6]: *** [otx2_ethdev.o] Error 1
make[6]: *** Waiting for unfinished jobs....
  CC ef10_evb.o
  PMDINFO ifcvf_vdpa.o.pmd.c
  CC ifcvf_vdpa.o.pmd.o
  CC ef10_filter.o
  LD ifcvf_vdpa.o
  AR librte_pmd_ifc.a
  CC ef10_intr.o
  INSTALL-LIB librte_pmd_ifc.a
make[5]: *** [octeontx2] Error 2
make[5]: *** Waiting for unfinished jobs....
  CC ef10_image.o
  CC rte_eth_softnic_meter.o
  CC rte_eth_softnic_cryptodev.o
  CC ef10_mac.o
--
  INSTALL-LIB librte_pmd_sfc_efx.a
  AR librte_pmd_softnic.a
  INSTALL-LIB librte_pmd_softnic.a
  AR librte_pmd_qede.a
  INSTALL-LIB librte_pmd_qede.a
make[4]: *** [net] Error 2
make[3]: *** [drivers] Error 2
make[2]: *** [all] Error 2
make[1]: *** [pre_install] Error 2
make: *** [install] Error 2


*Make Build Failed #19:
OS: CENTOS76-64
Target: x86_64-native-linuxapp-gcc+debug
/tmp/CENTOS76-64_K3.10.0_GCC4.8.5/x86_64-native-linuxapp-gcc+debug/635c0aa5d6c14e308ed8077ddf24a243/dpdk/drivers/net/octeontx2/otx2_ethdev.c:1992:2: warning: initialized field overwritten [-Woverride-init]
  .vlan_filter_set   = otx2_nix_vlan_filter_set,
  ^
/tmp/CENTOS76-64_K3.10.0_GCC4.8.5/x86_64-native-linuxapp-gcc+debug/635c0aa5d6c14e308ed8077ddf24a243/dpdk/drivers/net/octeontx2/otx2_ethdev.c:1992:2: warning: (near initialization for ‘otx2_eth_dev_ops.vlan_filter_set’) [-Woverride-init]
cc1: warning: unrecognized command line option "-Wno-address-of-packed-member" [enabled by default]
make[6]: *** [otx2_ethdev.o] Error 1
make[5]: *** [octeontx2] Error 2
make[5]: *** Waiting for unfinished jobs....
  CC efx_mac.o
  CC bcm_osal.o
  CC virtio_user/vhost_kernel_tap.o
  CC efx_mcdi.o
--
  CC medford2_nic.o
  AR librte_pmd_sfc_efx.a
  INSTALL-LIB librte_pmd_sfc_efx.a
  AR librte_pmd_qede.a
  INSTALL-LIB librte_pmd_qede.a
make[4]: *** [net] Error 2
make[3]: *** [drivers] Error 2
make[2]: *** [all] Error 2
make[1]: *** [pre_install] Error 2
make: *** [install] Error 2


*Make Build Failed #20:
OS: FreeBSD12-64
Target: x86_64-native-bsdapp-gcc
/tmp/FreeBSD12-64_K19.02_GCC7.3.0/x86_64-native-bsdapp-gcc/635c0aa5d6c14e308ed8077ddf24a243/dpdk/drivers/net/octeontx2/otx2_ethdev.c:1947:30: note: (near initialization for 'otx2_eth_dev_ops.vlan_filter_set')
/tmp/FreeBSD12-64_K19.02_GCC7.3.0/x86_64-native-bsdapp-gcc/635c0aa5d6c14e308ed8077ddf24a243/dpdk/drivers/net/octeontx2/otx2_ethdev.c:1992:23: warning: initialized field overwritten [-Woverride-init]
 1992 |  .vlan_filter_set   = otx2_nix_vlan_filter_set,
      |                       ^~~~~~~~~~~~~~~~~~~~~~~~
/tmp/FreeBSD12-64_K19.02_GCC7.3.0/x86_64-native-bsdapp-gcc/635c0aa5d6c14e308ed8077ddf24a243/dpdk/drivers/net/octeontx2/otx2_ethdev.c:1992:23: note: (near initialization for 'otx2_eth_dev_ops.vlan_filter_set')
gmake[6]: *** [/tmp/FreeBSD12-64_K19.02_GCC7.3.0/x86_64-native-bsdapp-gcc/635c0aa5d6c14e308ed8077ddf24a243/dpdk/mk/internal/rte.compile-pre.mk:116: otx2_ethdev.o] Error 1
gmake[5]: *** [/tmp/FreeBSD12-64_K19.02_GCC7.3.0/x86_64-native-bsdapp-gcc/635c0aa5d6c14e308ed8077ddf24a243/dpdk/mk/rte.subdir.mk:35: octeontx2] Error 2
gmake[5]: *** Waiting for unfinished jobs....
  CC sfc_rx.o
  CC ixgbe_flow.o
  CC virtio_ethdev.o
  CC bcm_osal.o
--
  CC medford_nic.o
  CC hunt_nic.o
  CC medford2_nic.o
  AR librte_pmd_sfc_efx.a
  INSTALL-LIB librte_pmd_sfc_efx.a
gmake[4]: *** [/tmp/FreeBSD12-64_K19.02_GCC7.3.0/x86_64-native-bsdapp-gcc/635c0aa5d6c14e308ed8077ddf24a243/dpdk/mk/rte.subdir.mk:35: net] Error 2
gmake[3]: *** [/tmp/FreeBSD12-64_K19.02_GCC7.3.0/x86_64-native-bsdapp-gcc/635c0aa5d6c14e308ed8077ddf24a243/dpdk/mk/rte.sdkbuild.mk:46: drivers] Error 2
gmake[2]: *** [/tmp/FreeBSD12-64_K19.02_GCC7.3.0/x86_64-native-bsdapp-gcc/635c0aa5d6c14e308ed8077ddf24a243/dpdk/mk/rte.sdkroot.mk:99: all] Error 2
gmake[1]: *** [/tmp/FreeBSD12-64_K19.02_GCC7.3.0/x86_64-native-bsdapp-gcc/635c0aa5d6c14e308ed8077ddf24a243/dpdk/mk/rte.sdkinstall.mk:61: pre_install] Error 2
gmake: *** [/tmp/FreeBSD12-64_K19.02_GCC7.3.0/x86_64-native-bsdapp-gcc/635c0aa5d6c14e308ed8077ddf24a243/dpdk/mk/rte.sdkroot.mk:77: install] Error 2


*Make Build Failed #21:
OS: CENTOS76-64
Target: x86_64-native-linuxapp-icc
/tmp/CENTOS76-64_K3.10.0_ICC19.0.0/x86_64-native-linuxapp-icc/635c0aa5d6c14e308ed8077ddf24a243/dpdk/drivers/net/octeontx2/otx2_ethdev.c(1947): error: struct "eth_dev_ops" has no field "dev_supported_ptypes_set"
  	.dev_supported_ptypes_set = otx2_nix_supported_ptypes_set,
  	 ^

compilation aborted for /tmp/CENTOS76-64_K3.10.0_ICC19.0.0/x86_64-native-linuxapp-icc/635c0aa5d6c14e308ed8077ddf24a243/dpdk/drivers/net/octeontx2/otx2_ethdev.c (code 2)
make[6]: *** [otx2_ethdev.o] Error 2
make[6]: *** Waiting for unfinished jobs....
  CC ecore_vf.o
  LD ifcvf_vdpa.o
  CC qede_ethdev.o
  LD rte_eth_vhost.o
--
  INSTALL-LIB librte_pmd_ifc.a
  CC rte_eth_softnic_action.o
  CC rte_eth_softnic_pipeline.o
  CC rte_eth_softnic_thread.o
  CC rte_eth_softnic_cli.o
make[5]: *** [octeontx2] Error 2
make[5]: *** Waiting for unfinished jobs....
  CC rte_eth_softnic_flow.o
  CC rte_eth_softnic_meter.o
  CC rte_eth_softnic_cryptodev.o
  CC parser.o
--
  LD qede_ethdev.o
  AR librte_pmd_softnic.a
  INSTALL-LIB librte_pmd_softnic.a
  AR librte_pmd_qede.a
  INSTALL-LIB librte_pmd_qede.a
make[4]: *** [net] Error 2
make[3]: *** [drivers] Error 2
make[2]: *** [all] Error 2
make[1]: *** [pre_install] Error 2
make: *** [install] Error 2


*Make Build Failed #22:
OS: CENTOS76-64
Target: x86_64-native-linuxapp-gcc+shared
/tmp/CENTOS76-64_K3.10.0_GCC4.8.5/x86_64-native-linuxapp-gcc+shared/635c0aa5d6c14e308ed8077ddf24a243/dpdk/drivers/net/octeontx2/otx2_ethdev.c:1992:2: warning: initialized field overwritten [-Woverride-init]
  .vlan_filter_set   = otx2_nix_vlan_filter_set,
  ^
/tmp/CENTOS76-64_K3.10.0_GCC4.8.5/x86_64-native-linuxapp-gcc+shared/635c0aa5d6c14e308ed8077ddf24a243/dpdk/drivers/net/octeontx2/otx2_ethdev.c:1992:2: warning: (near initialization for ‘otx2_eth_dev_ops.vlan_filter_set’) [-Woverride-init]
cc1: warning: unrecognized command line option "-Wno-address-of-packed-member" [enabled by default]
make[6]: *** [otx2_ethdev.o] Error 1
make[6]: *** Waiting for unfinished jobs....
  CC efx_proxy.o
  CC rte_eth_softnic_thread.o
  CC efx_rx.o
  CC rte_eth_softnic_cli.o
  CC efx_sram.o
  CC efx_tunnel.o
  CC rte_eth_softnic_flow.o
make[5]: *** [octeontx2] Error 2
make[5]: *** Waiting for unfinished jobs....
  CC rte_eth_softnic_meter.o
  CC rte_eth_softnic_cryptodev.o
  CC efx_tx.o
  CC parser.o
--
  CC medford2_nic.o
  LD librte_pmd_sfc_efx.so.1.1
  INSTALL-LIB librte_pmd_sfc_efx.so.1.1
  LD librte_pmd_softnic.so.1.1
  INSTALL-LIB librte_pmd_softnic.so.1.1
make[4]: *** [net] Error 2
make[3]: *** [drivers] Error 2
make[2]: *** [all] Error 2
make[1]: *** [pre_install] Error 2
make: *** [install] Error 2

*Meson Build Failed #1:
OS: SUSE15-64
Target:build-gcc-static
FAILED: drivers/a715181@@tmp_rte_pmd_octeontx2@sta/net_octeontx2_otx2_ethdev.c.o 
gcc -Idrivers/a715181@@tmp_rte_pmd_octeontx2@sta -Idrivers -I../drivers -Idrivers/net/octeontx2 -I../drivers/net/octeontx2 -Ilib/librte_ethdev -I../lib/librte_ethdev -I. -I../ -Iconfig -I../config -Ilib/librte_eal/common/include -I../lib/librte_eal/common/include -I../lib/librte_eal/linux/eal/include -Ilib/librte_eal/common -I../lib/librte_eal/common -Ilib/librte_eal/common/include/arch/x86 -I../lib/librte_eal/common/include/arch/x86 -Ilib/librte_eal -I../lib/librte_eal -Ilib/librte_kvargs -I../lib/librte_kvargs -Ilib/librte_net -I../lib/librte_net -Ilib/librte_mbuf -I../lib/librte_mbuf -Ilib/librte_mempool -I../lib/librte_mempool -Ilib/librte_ring -I../lib/librte_ring -Ilib/librte_meter -I../lib/librte_meter -Idrivers/bus/pci -I../drivers/bus/pci -I../drivers/bus/pci/linux -Ilib/librte_pci -I../lib/librte_pci -Idrivers/bus/vdev -I../drivers/bus/vdev -Idrivers/common/octeontx2 -I../drivers/common/octeontx2 -Idrivers/common/octeontx2/../../common/octeontx2 -I../drivers/common/octeontx2/../../common/octeontx2 -Idrivers/common/octeontx2/../../mempool/octeontx2 -I../drivers/common/octeontx2/../../mempool/octeontx2 -Idrivers/common/octeontx2/../../bus/pci -I../drivers/common/octeontx2/../../bus/pci -Idrivers/mempool/octeontx2 -I../drivers/mempool/octeontx2 -fdiagnostics-color=always -pipe -D_FILE_OFFSET_BITS=64 -Wall -Winvalid-pch -Werror -O3 -include rte_config.h -Wunused-parameter -Wsign-compare -Wcast-qual -D_GNU_SOURCE -fPIC -march=native -Wno-format-truncation -flax-vector-conversions -MD -MQ 'drivers/a715181@@tmp_rte_pmd_octeontx2@sta/net_octeontx2_otx2_ethdev.c.o' -MF 'drivers/a715181@@tmp_rte_pmd_octeontx2@sta/net_octeontx2_otx2_ethdev.c.o.d' -o 'drivers/a715181@@tmp_rte_pmd_octeontx2@sta/net_octeontx2_otx2_ethdev.c.o' -c ../drivers/net/octeontx2/otx2_ethdev.c
../drivers/net/octeontx2/otx2_ethdev.c:1947:3: error: ‘const struct eth_dev_ops’ has no member named ‘dev_supported_ptypes_set’; did you mean ‘dev_supported_ptypes_get’?
  .dev_supported_ptypes_set = otx2_nix_supported_ptypes_set,
   ^~~~~~~~~~~~~~~~~~~~~~~~
   dev_supported_ptypes_get
../drivers/net/octeontx2/otx2_ethdev.c:1947:30: error: initialization from incompatible pointer type [-Werror=incompatible-pointer-types]
  .dev_supported_ptypes_set = otx2_nix_supported_ptypes_set,
                              ^~~~~~~~~~~~~~~~~~~~~~~~~~~~~
../drivers/net/octeontx2/otx2_ethdev.c:1947:30: note: (near initialization for ‘otx2_eth_dev_ops.vlan_filter_set’)
cc1: all warnings being treated as errors
[1019/1887] Compiling C object 'drivers/a715181@@tmp_rte_pmd_octeontx2@sta/net_octeontx2_otx2_flow_parse.c.o'.
[1020/1887] Compiling C object 'drivers/a715181@@tmp_rte_pmd_octeontx2@sta/net_octeontx2_otx2_flow_ctrl.c.o'.
[1021/1887] Compiling C object 'drivers/a715181@@tmp_rte_pmd_octeontx2@sta/net_octeontx2_otx2_ethdev_ops.c.o'.
[1022/1887] Compiling C object 'drivers/a715181@@tmp_rte_pmd_octeontx2@sta/net_octeontx2_otx2_ethdev_irq.c.o'.
[1023/1887] Compiling C object 'drivers/a715181@@tmp_rte_pmd_octeontx2@sta/net_octeontx2_otx2_flow_utils.c.o'.
[1024/1887] Compiling C object 'drivers/a715181@@tmp_rte_pmd_octeontx2@sta/net_octeontx2_otx2_rx.c.o'.
[1025/1887] Compiling C object 'drivers/a715181@@tmp_rte_pmd_octeontx2@sta/net_octeontx2_otx2_tx.c.o'.
ninja: build stopped: subcommand failed




*Meson Build Failed #2:
OS: FC30-64
Target:build-gcc-static
FAILED: drivers/a715181@@tmp_rte_pmd_octeontx2@sta/net_octeontx2_otx2_ethdev.c.o 
gcc -Idrivers/a715181@@tmp_rte_pmd_octeontx2@sta -Idrivers -I../drivers -Idrivers/net/octeontx2 -I../drivers/net/octeontx2 -Ilib/librte_ethdev -I../lib/librte_ethdev -I. -I../ -Iconfig -I../config -Ilib/librte_eal/common/include -I../lib/librte_eal/common/include -I../lib/librte_eal/linux/eal/include -Ilib/librte_eal/common -I../lib/librte_eal/common -Ilib/librte_eal/common/include/arch/x86 -I../lib/librte_eal/common/include/arch/x86 -Ilib/librte_eal -I../lib/librte_eal -Ilib/librte_kvargs -I../lib/librte_kvargs -Ilib/librte_net -I../lib/librte_net -Ilib/librte_mbuf -I../lib/librte_mbuf -Ilib/librte_mempool -I../lib/librte_mempool -Ilib/librte_ring -I../lib/librte_ring -Ilib/librte_meter -I../lib/librte_meter -Idrivers/bus/pci -I../drivers/bus/pci -I../drivers/bus/pci/linux -Ilib/librte_pci -I../lib/librte_pci -Idrivers/bus/vdev -I../drivers/bus/vdev -Idrivers/common/octeontx2 -I../drivers/common/octeontx2 -Idrivers/common/octeontx2/../../common/octeontx2 -I../drivers/common/octeontx2/../../common/octeontx2 -Idrivers/common/octeontx2/../../mempool/octeontx2 -I../drivers/common/octeontx2/../../mempool/octeontx2 -Idrivers/common/octeontx2/../../bus/pci -I../drivers/common/octeontx2/../../bus/pci -Idrivers/mempool/octeontx2 -I../drivers/mempool/octeontx2 -fdiagnostics-color=always -pipe -D_FILE_OFFSET_BITS=64 -Wall -Winvalid-pch -Werror -O3 -include rte_config.h -Wunused-parameter -Wsign-compare -Wcast-qual -Wno-address-of-packed-member -D_GNU_SOURCE -fPIC -march=native -mno-avx512f -Wno-format-truncation -flax-vector-conversions -MD -MQ 'drivers/a715181@@tmp_rte_pmd_octeontx2@sta/net_octeontx2_otx2_ethdev.c.o' -MF 'drivers/a715181@@tmp_rte_pmd_octeontx2@sta/net_octeontx2_otx2_ethdev.c.o.d' -o 'drivers/a715181@@tmp_rte_pmd_octeontx2@sta/net_octeontx2_otx2_ethdev.c.o' -c ../drivers/net/octeontx2/otx2_ethdev.c
../drivers/net/octeontx2/otx2_ethdev.c:1947:3: error: ‘const struct eth_dev_ops’ has no member named ‘dev_supported_ptypes_set’; did you mean ‘dev_supported_ptypes_get’?
 1947 |  .dev_supported_ptypes_set = otx2_nix_supported_ptypes_set,
      |   ^~~~~~~~~~~~~~~~~~~~~~~~
      |   dev_supported_ptypes_get
../drivers/net/octeontx2/otx2_ethdev.c:1947:30: error: initialization of ‘int (*)(struct rte_eth_dev *, uint16_t,  int)’ {aka ‘int (*)(struct rte_eth_dev *, short unsigned int,  int)’} from incompatible pointer type ‘int (*)(struct rte_eth_dev *, uint32_t)’ {aka ‘int (*)(struct rte_eth_dev *, unsigned int)’} [-Werror=incompatible-pointer-types]
 1947 |  .dev_supported_ptypes_set = otx2_nix_supported_ptypes_set,
      |                              ^~~~~~~~~~~~~~~~~~~~~~~~~~~~~
../drivers/net/octeontx2/otx2_ethdev.c:1947:30: note: (near initialization for ‘otx2_eth_dev_ops.vlan_filter_set’)
cc1: all warnings being treated as errors
[1010/1840] Compiling C object 'drivers/a715181@@tmp_rte_pmd_octeontx2@sta/net_octeontx2_otx2_flow_ctrl.c.o'.
[1011/1840] Compiling C object 'drivers/a715181@@tmp_rte_pmd_octeontx2@sta/net_octeontx2_otx2_flow_parse.c.o'.
[1012/1840] Compiling C object 'drivers/a715181@@tmp_rte_pmd_octeontx2@sta/net_octeontx2_otx2_ethdev_ops.c.o'.
[1013/1840] Compiling C object 'drivers/a715181@@tmp_rte_pmd_octeontx2@sta/net_octeontx2_otx2_ethdev_irq.c.o'.
[1014/1840] Compiling C object 'drivers/a715181@@tmp_rte_pmd_octeontx2@sta/net_octeontx2_otx2_flow_utils.c.o'.
[1015/1840] Compiling C object 'drivers/a715181@@tmp_rte_pmd_octeontx2@sta/net_octeontx2_otx2_rx.c.o'.
[1016/1840] Compiling C object 'drivers/a715181@@tmp_rte_pmd_octeontx2@sta/net_octeontx2_otx2_tx.c.o'.
ninja: build stopped: subcommand failed




*Meson Build Failed #3:
OS: UB1604-32
Target:build-gcc-static
FAILED: drivers/a715181@@tmp_rte_pmd_octeontx2@sta/net_octeontx2_otx2_ethdev.c.o 
gcc -Idrivers/a715181@@tmp_rte_pmd_octeontx2@sta -Idrivers -I../drivers -Idrivers/net/octeontx2 -I../drivers/net/octeontx2 -Ilib/librte_ethdev -I../lib/librte_ethdev -I. -I../ -Iconfig -I../config -Ilib/librte_eal/common/include -I../lib/librte_eal/common/include -I../lib/librte_eal/linux/eal/include -Ilib/librte_eal/common -I../lib/librte_eal/common -Ilib/librte_eal/common/include/arch/x86 -I../lib/librte_eal/common/include/arch/x86 -Ilib/librte_eal -I../lib/librte_eal -Ilib/librte_kvargs -I../lib/librte_kvargs -Ilib/librte_net -I../lib/librte_net -Ilib/librte_mbuf -I../lib/librte_mbuf -Ilib/librte_mempool -I../lib/librte_mempool -Ilib/librte_ring -I../lib/librte_ring -Ilib/librte_meter -I../lib/librte_meter -Idrivers/bus/pci -I../drivers/bus/pci -I../drivers/bus/pci/linux -Ilib/librte_pci -I../lib/librte_pci -Idrivers/bus/vdev -I../drivers/bus/vdev -Idrivers/common/octeontx2 -I../drivers/common/octeontx2 -Idrivers/common/octeontx2/../../common/octeontx2 -I../drivers/common/octeontx2/../../common/octeontx2 -Idrivers/common/octeontx2/../../mempool/octeontx2 -I../drivers/common/octeontx2/../../mempool/octeontx2 -Idrivers/common/octeontx2/../../bus/pci -I../drivers/common/octeontx2/../../bus/pci -Idrivers/mempool/octeontx2 -I../drivers/mempool/octeontx2 -fdiagnostics-color=always -pipe -D_FILE_OFFSET_BITS=64 -Wall -Winvalid-pch -Werror -O3 -include rte_config.h -Wunused-parameter -Wsign-compare -Wcast-qual -Wno-pointer-to-int-cast -D_GNU_SOURCE -fPIC -march=native -flax-vector-conversions -Wno-int-to-pointer-cast -Wno-pointer-to-int-cast -MD -MQ 'drivers/a715181@@tmp_rte_pmd_octeontx2@sta/net_octeontx2_otx2_ethdev.c.o' -MF 'drivers/a715181@@tmp_rte_pmd_octeontx2@sta/net_octeontx2_otx2_ethdev.c.o.d' -o 'drivers/a715181@@tmp_rte_pmd_octeontx2@sta/net_octeontx2_otx2_ethdev.c.o' -c ../drivers/net/octeontx2/otx2_ethdev.c
../drivers/net/octeontx2/otx2_ethdev.c:1947:2: error: unknown field ‘dev_supported_ptypes_set’ specified in initializer
  .dev_supported_ptypes_set = otx2_nix_supported_ptypes_set,
  ^
../drivers/net/octeontx2/otx2_ethdev.c:1947:30: error: initialization from incompatible pointer type [-Werror=incompatible-pointer-types]
  .dev_supported_ptypes_set = otx2_nix_supported_ptypes_set,
                              ^
../drivers/net/octeontx2/otx2_ethdev.c:1947:30: note: (near initialization for ‘otx2_eth_dev_ops.vlan_filter_set’)
cc1: all warnings being treated as errors
[955/1693] Compiling C object 'drivers/a715181@@tmp_rte_pmd_octeontx2@sta/net_octeontx2_otx2_flow_parse.c.o'.
[956/1693] Compiling C object 'drivers/a715181@@tmp_rte_pmd_octeontx2@sta/net_octeontx2_otx2_ethdev_irq.c.o'.
[957/1693] Compiling C object 'drivers/a715181@@tmp_rte_pmd_octeontx2@sta/net_octeontx2_otx2_flow_utils.c.o'.
[958/1693] Compiling C object 'drivers/a715181@@tmp_rte_pmd_octeontx2@sta/net_octeontx2_otx2_rx.c.o'.
[959/1693] Compiling C object 'drivers/a715181@@tmp_rte_pmd_octeontx2@sta/net_octeontx2_otx2_tx.c.o'.
ninja: build stopped: subcommand failed




*Meson Build Failed #4:
OS: UB1804-64
Target:build-gcc-static
FAILED: drivers/a715181@@tmp_rte_pmd_octeontx2@sta/net_octeontx2_otx2_ethdev.c.o 
gcc -Idrivers/a715181@@tmp_rte_pmd_octeontx2@sta -Idrivers -I../drivers -Idrivers/net/octeontx2 -I../drivers/net/octeontx2 -Ilib/librte_ethdev -I../lib/librte_ethdev -I. -I../ -Iconfig -I../config -Ilib/librte_eal/common/include -I../lib/librte_eal/common/include -I../lib/librte_eal/linux/eal/include -Ilib/librte_eal/common -I../lib/librte_eal/common -Ilib/librte_eal/common/include/arch/x86 -I../lib/librte_eal/common/include/arch/x86 -Ilib/librte_eal -I../lib/librte_eal -Ilib/librte_kvargs -I../lib/librte_kvargs -Ilib/librte_net -I../lib/librte_net -Ilib/librte_mbuf -I../lib/librte_mbuf -Ilib/librte_mempool -I../lib/librte_mempool -Ilib/librte_ring -I../lib/librte_ring -Ilib/librte_meter -I../lib/librte_meter -Idrivers/bus/pci -I../drivers/bus/pci -I../drivers/bus/pci/linux -Ilib/librte_pci -I../lib/librte_pci -Idrivers/bus/vdev -I../drivers/bus/vdev -Idrivers/common/octeontx2 -I../drivers/common/octeontx2 -Idrivers/common/octeontx2/../../common/octeontx2 -I../drivers/common/octeontx2/../../common/octeontx2 -Idrivers/common/octeontx2/../../mempool/octeontx2 -I../drivers/common/octeontx2/../../mempool/octeontx2 -Idrivers/common/octeontx2/../../bus/pci -I../drivers/common/octeontx2/../../bus/pci -Idrivers/mempool/octeontx2 -I../drivers/mempool/octeontx2 -fdiagnostics-color=always -pipe -D_FILE_OFFSET_BITS=64 -Wall -Winvalid-pch -Werror -O3 -include rte_config.h -Wunused-parameter -Wsign-compare -Wcast-qual -D_GNU_SOURCE -fPIC -march=native -mno-avx512f -Wno-format-truncation -flax-vector-conversions -MD -MQ 'drivers/a715181@@tmp_rte_pmd_octeontx2@sta/net_octeontx2_otx2_ethdev.c.o' -MF 'drivers/a715181@@tmp_rte_pmd_octeontx2@sta/net_octeontx2_otx2_ethdev.c.o.d' -o 'drivers/a715181@@tmp_rte_pmd_octeontx2@sta/net_octeontx2_otx2_ethdev.c.o' -c ../drivers/net/octeontx2/otx2_ethdev.c
../drivers/net/octeontx2/otx2_ethdev.c:1947:3: error: ‘const struct eth_dev_ops’ has no member named ‘dev_supported_ptypes_set’; did you mean ‘dev_supported_ptypes_get’?
  .dev_supported_ptypes_set = otx2_nix_supported_ptypes_set,
   ^~~~~~~~~~~~~~~~~~~~~~~~
   dev_supported_ptypes_get
../drivers/net/octeontx2/otx2_ethdev.c:1947:30: error: initialization from incompatible pointer type [-Werror=incompatible-pointer-types]
  .dev_supported_ptypes_set = otx2_nix_supported_ptypes_set,
                              ^~~~~~~~~~~~~~~~~~~~~~~~~~~~~
../drivers/net/octeontx2/otx2_ethdev.c:1947:30: note: (near initialization for ‘otx2_eth_dev_ops.vlan_filter_set’)
cc1: all warnings being treated as errors
[1026/1847] Compiling C object 'drivers/a715181@@tmp_rte_pmd_octeontx2@sta/net_octeontx2_otx2_flow_ctrl.c.o'.
[1027/1847] Compiling C object 'drivers/a715181@@tmp_rte_pmd_octeontx2@sta/net_octeontx2_otx2_flow_parse.c.o'.
[1028/1847] Compiling C object 'drivers/a715181@@tmp_rte_pmd_octeontx2@sta/net_octeontx2_otx2_flow_utils.c.o'.
[1029/1847] Compiling C object 'drivers/a715181@@tmp_rte_pmd_octeontx2@sta/net_octeontx2_otx2_rx.c.o'.
[1030/1847] Compiling C object 'drivers/a715181@@tmp_rte_pmd_octeontx2@sta/net_octeontx2_otx2_tx.c.o'.
ninja: build stopped: subcommand failed




*Meson Build Failed #5:
OS: FreeBSD12-64
Target:build-gcc-static
FAILED: drivers/a715181@@tmp_rte_pmd_octeontx2@sta/net_octeontx2_otx2_ethdev.c.o 
ccache gcc -Idrivers/a715181@@tmp_rte_pmd_octeontx2@sta -Idrivers -I../drivers -Idrivers/net/octeontx2 -I../drivers/net/octeontx2 -Ilib/librte_ethdev -I../lib/librte_ethdev -I. -I../ -Iconfig -I../config -Ilib/librte_eal/common/include -I../lib/librte_eal/common/include -I../lib/librte_eal/freebsd/eal/include -Ilib/librte_eal/common -I../lib/librte_eal/common -Ilib/librte_eal/common/include/arch/x86 -I../lib/librte_eal/common/include/arch/x86 -Ilib/librte_eal -I../lib/librte_eal -Ilib/librte_kvargs -I../lib/librte_kvargs -Ilib/librte_net -I../lib/librte_net -Ilib/librte_mbuf -I../lib/librte_mbuf -Ilib/librte_mempool -I../lib/librte_mempool -Ilib/librte_ring -I../lib/librte_ring -Ilib/librte_meter -I../lib/librte_meter -Idrivers/bus/pci -I../drivers/bus/pci -I../drivers/bus/pci/bsd -Ilib/librte_pci -I../lib/librte_pci -Idrivers/bus/vdev -I../drivers/bus/vdev -Idrivers/common/octeontx2 -I../drivers/common/octeontx2 -Idrivers/common/octeontx2/../../common/octeontx2 -I../drivers/common/octeontx2/../../common/octeontx2 -Idrivers/common/octeontx2/../../mempool/octeontx2 -I../drivers/common/octeontx2/../../mempool/octeontx2 -Idrivers/common/octeontx2/../../bus/pci -I../drivers/common/octeontx2/../../bus/pci -Idrivers/mempool/octeontx2 -I../drivers/mempool/octeontx2 -fdiagnostics-color=always -pipe -D_FILE_OFFSET_BITS=64 -Wall -Winvalid-pch -Werror -O3 -include rte_config.h -Wunused-parameter -Wsign-compare -Wcast-qual -D_GNU_SOURCE -D__BSD_VISIBLE -fPIC -march=native -Wno-format-truncation -flax-vector-conversions -MD -MQ 'drivers/a715181@@tmp_rte_pmd_octeontx2@sta/net_octeontx2_otx2_ethdev.c.o' -MF 'drivers/a715181@@tmp_rte_pmd_octeontx2@sta/net_octeontx2_otx2_ethdev.c.o.d' -o 'drivers/a715181@@tmp_rte_pmd_octeontx2@sta/net_octeontx2_otx2_ethdev.c.o' -c ../drivers/net/octeontx2/otx2_ethdev.c
../drivers/net/octeontx2/otx2_ethdev.c:1947:3: error: 'const struct eth_dev_ops' has no member named 'dev_supported_ptypes_set'; did you mean 'dev_supported_ptypes_get'?
  .dev_supported_ptypes_set = otx2_nix_supported_ptypes_set,
   ^~~~~~~~~~~~~~~~~~~~~~~~
   dev_supported_ptypes_get
../drivers/net/octeontx2/otx2_ethdev.c:1947:30: error: initialization from incompatible pointer type [-Werror=incompatible-pointer-types]
  .dev_supported_ptypes_set = otx2_nix_supported_ptypes_set,
                              ^~~~~~~~~~~~~~~~~~~~~~~~~~~~~
../drivers/net/octeontx2/otx2_ethdev.c:1947:30: note: (near initialization for 'otx2_eth_dev_ops.vlan_filter_set')
cc1: all warnings being treated as errors
[543/1439] Compiling C object 'drivers/a715181@@tmp_rte_pmd_octeontx2@sta/net_octeontx2_otx2_stats.c.o'.
[544/1439] Compiling C object 'drivers/a715181@@tmp_rte_pmd_octeontx2@sta/net_octeontx2_otx2_rx.c.o'.
[545/1439] Compiling C object 'drivers/a715181@@tmp_rte_pmd_octeontx2@sta/net_octeontx2_otx2_flow_ctrl.c.o'.
[546/1439] Compiling C object 'drivers/a715181@@tmp_rte_pmd_octeontx2@sta/net_octeontx2_otx2_flow_parse.c.o'.
[547/1439] Compiling C object 'drivers/a715181@@tmp_rte_pmd_octeontx2@sta/net_octeontx2_otx2_tx.c.o'.
ninja: build stopped: subcommand failed



DPDK STV team

^ permalink raw reply	[flat|nested] only message in thread

only message in thread, other threads:[~2019-10-17 14:36 UTC | newest]

Thread overview: (only message) (download: mbox.gz / follow: Atom feed)
-- links below jump to the message on this page --
2019-10-17 14:36 [dpdk-test-report] |FAILURE| pw61383[v2] net/octeontx2: add set supported types op sys_stv

automatic DPDK test reports

This inbox may be cloned and mirrored by anyone:

	git clone --mirror https://inbox.dpdk.org/test-report/0 test-report/git/0.git

	# If you have public-inbox 1.1+ installed, you may
	# initialize and index your mirror using the following commands:
	public-inbox-init -V2 test-report test-report/ https://inbox.dpdk.org/test-report \
		test-report@dpdk.org
	public-inbox-index test-report

Example config snippet for mirrors.
Newsgroup available over NNTP:
	nntp://inbox.dpdk.org/inbox.dpdk.test-report


AGPL code for this site: git clone https://public-inbox.org/public-inbox.git