automatic DPDK test reports
 help / color / mirror / Atom feed
* [dpdk-test-report]  |FAILURE| pw61390[6/9, v2] raw/dpaa2_cmdif: add retry and timeout in packet enqueue API
@ 2019-10-17 16:43 sys_stv
  0 siblings, 0 replies; only message in thread
From: sys_stv @ 2019-10-17 16:43 UTC (permalink / raw)
  To: test-report

[-- Attachment #1: Type: text/plain, Size: 50498 bytes --]

Test-Label: Intel-compilation
Test-Status: FAILURE
http://dpdk.org/patch/61390

_Compilation issues_

Submitter: Nipun Gupta <nipun.gupta@nxp.com>
Date: 2019-10-17 12:44:00
Reply_mail: 20191017124403.26734-7-nipun.gupta@nxp.com
DPDK git baseline: Repo:dpdk, CommitID: ad4305d0d5ed103cf5217eb120168ff8f285466c

Makefile build Summary: 22 Builds Done, 4 Successful, 18 Failures

Meson build Summary: 7 Builds Done, 3 Successful, 4 Failures

               +==============================================+===========+==========+
               |                   Makefile                   |   Meson   | Document |
+--------------+------+-------+------+------------+-----------+-----------+----------+
| os           | gcc  | clang | icc  | gcc+shared | gcc+debug | gcc/clang | pdf/html |
+--------------+------+-------+------+------------+-----------+-----------+----------+
| RHEL76-64    | FAIL |       |      |            |           |           |          |
| CENTOS76-64  | FAIL | FAIL  | FAIL | FAIL       | FAIL      |           |          |
| UB1804-64    | FAIL | FAIL  | FAIL |            |           | FAIL      | pass     |
| UB1604-32    | FAIL |       |      |            |           | FAIL      |          |
| UB1904-64    | FAIL |       |      |            |           |           |          |
| UB1604-64    | FAIL | FAIL  |      |            |           |           |          |
| FC30-64      | FAIL | FAIL  |      |            |           | FAIL      |          |
| WIN10-64     |      |       |      |            |           | pass      |          |
| FreeBSD12-64 | pass | pass  |      | pass       | pass      | pass      |          |
| RHEL80-64    | FAIL |       |      |            |           |           |          |
| SUSE15-64    | FAIL | FAIL  |      |            |           | FAIL      |          |
+--------------+------+-------+------+------------+-----------+-----------+----------+

Test environment and configuration as below:

** Makefile build **


OS: RHEL76-64
	Kernel Version: 3.10.0-957.el7.x86_64
	CPU info: Intel(R) Xeon(R) CPU E5-2699 v4 @ 2.20GHz
	GCC Version: gcc (GCC) 4.8.5 20150623 (Red Hat 4.8.5-36)
	Clang Version: NA
	x86_64-native-linuxapp-gcc


OS: CENTOS76-64
	Kernel Version: 3.10.0-957.27.2.el7.x86_64
	CPU info: Intel(R) Xeon(R) CPU E5-2699 v4 @ 2.20GHz
	GCC Version: gcc (GCC) 4.8.5 20150623 (Red Hat 4.8.5-36)
	Clang Version: 3.4.2 (tags/RELEASE_34/dot2-final)
	x86_64-native-linuxapp-clang
	x86_64-native-linuxapp-gcc+debug
	x86_64-native-linuxapp-gcc
	x86_64-native-linuxapp-gcc+shared
	x86_64-native-linuxapp-icc


OS: UB1804-64
	Kernel Version: 4.15.0-20-generic
	CPU info: Intel(R) Xeon(R) CPU E5-2699 v3 @ 2.30GHz
	GCC Version: gcc (Ubuntu 7.3.0-27ubuntu1~18.04) 7.3.0
	Clang Version: 6.0.0-1ubuntu2 (tags/RELEASE_600/final)
	x86_64-native-linuxapp-icc
	x86_64-native-linuxapp-clang
	x86_64-native-linuxapp-gcc


OS: UB1904-64
	Kernel Version: 5.0.0-13-generic
	CPU info: Intel(R) Xeon(R) CPU E5-2699 v3 @ 2.30GHz
	GCC Version: gcc (Ubuntu 8.3.0-6ubuntu1) 8.3.0
	Clang Version: 8.0.0-3 (tags/RELEASE_800/final)
	x86_64-native-linuxapp-gcc


OS: UB1604-32
	Kernel Version: 4.4.0-131-generic
	CPU info: Intel(R) Xeon(R) CPU E5-2699 v3 @ 2.30GHz
	GCC Version: gcc (Ubuntu 5.4.0-6ubuntu1~16.04.11) 5.4.0 20160609
	Clang Version: 3.8.0-2ubuntu4 (tags/RELEASE_380/final)
	i686-native-linuxapp-gcc


OS: UB1604-64
	Kernel Version: 4.4.0-47-generic
	CPU info: Intel(R) Xeon(R) CPU E5-2699 v3 @ 2.30GHz
	GCC Version: gcc (Ubuntu 5.4.0-6ubuntu1~16.04.10) 5.4.0 20160609
	Clang Version: 3.8.0-2ubuntu4 (tags/RELEASE_380/final)
	x86_64-native-linuxapp-clang
	x86_64-native-linuxapp-gcc


OS: FC30-64
	Kernel Version: 5.1.7-300.fc30.x86_64
	CPU info: Intel(R) Xeon(R) CPU E5-2699 v4 @ 2.20GHz
	GCC Version: gcc (GCC) 9.1.1 20190503 (Red Hat 9.1.1-1)
	Clang Version: 8.0.0 (Fedora 8.0.0-1.fc30)
	x86_64-native-linuxapp-gcc
	x86_64-native-linuxapp-clang


OS: FreeBSD12-64
	Kernel Version: 12.0-RC3
	CPU info: Intel(R) Xeon(R) CPU E5-2699 v4 @ 2.20GHz (2194.98-MHz K8-class CPU)
	GCC Version: gcc (FreeBSD Ports Collection) 7.3.0
	Clang Version: 6.0.1 (tags/RELEASE_601/final 335540) (based on LLVM 6.0.1)
	x86_64-native-bsdapp-clang
	x86_64-native-bsdapp-gcc+shared
	x86_64-native-bsdapp-gcc+debug
	x86_64-native-bsdapp-gcc


OS: RHEL80-64
	Kernel Version: 4.18.0-80.el8.x86_64
	CPU info: Intel(R) Xeon(R) CPU E5-2699 v4 @ 2.20GHz
	GCC Version: gcc (GCC) 8.2.1 20180905 (Red Hat 8.2.1-3)
	Clang Version: 6.0.1 (tags/RELEASE_601/final)
	x86_64-native-linuxapp-gcc


OS: SUSE15-64
	Kernel Version: 4.12.14-lp150.11-default
	CPU info: Intel(R) Xeon(R) CPU E5-2699 v4 @ 2.20GHz
	GCC Version: gcc (SUSE Linux) 7.3.1 20180323 [gcc-7-branch revision 258812]
	Clang Version: 5.0.1 (tags/RELEASE_501/final 312548)
	x86_64-native-linuxapp-gcc
	x86_64-native-linuxapp-clang


** Meson build **


OS: UB1804-64
	Kernel Version: 4.15.0-20-generic
	CPU info: Intel(R) Xeon(R) CPU E5-2699 v4 @ 2.20GHz
	GCC Version: gcc (Ubuntu 7.3.0-27ubuntu1~18.04) 7.3.0
	Clang Version: 6.0.0-1ubuntu2 (tags/RELEASE_600/final)
	x86_64-native-linuxapp-doc
	build-gcc-static
	build-gcc-shared
	build-clang-static
	build-clang-shared
	build-x86-default


OS: UB1604-32
	Kernel Version: 4.4.0-131-generic
	CPU info: Intel(R) Xeon(R) CPU E5-2699 v4 @ 2.20GHz
	GCC Version: gcc (Ubuntu 5.4.0-6ubuntu1~16.04.11) 5.4.0 20160609
	Clang Version: 3.8.0-2ubuntu4 (tags/RELEASE_380/final)
	build-gcc-static
	build-gcc-shared
	build-clang-static
	build-clang-shared
	build-x86-default


OS: FC30-64
	Kernel Version: 5.0.9-301.fc30.x86_64
	CPU info: Intel(R) Xeon(R) CPU E5-2699 v4 @ 2.20GHz
	GCC Version: gcc (GCC) 9.1.1 20190503 (Red Hat 9.1.1-1)
	Clang Version: 8.0.0 (Fedora 8.0.0-1.fc30)
	build-gcc-static
	build-gcc-shared
	build-clang-static
	build-clang-shared
	build-x86-default


OS: WIN10-64
	Kernel Version: N/A
	CPU info: N/A
	GCC Version: N/A
	Clang Version: Clang 8.0.0
	x86_64-windows-clang


OS: FreeBSD12-64
	Kernel Version: 12.0-RC3
	CPU info: Intel(R) Xeon(R) CPU E5-2699 v4 @ 2.20GHz (2194.97-MHz K8-class CPU)
	GCC Version: gcc (FreeBSD Ports Collection) 7.3.0
	Clang Version: 6.0.1 (tags/RELEASE_601/final 335540) (based on LLVM 6.0.1)
	build-gcc-static
	build-gcc-shared
	build-clang-static
	build-clang-shared
	build-x86-default


OS: SUSE15-64
	Kernel Version: 4.12.14-lp150.11-default
	CPU info: Intel(R) Xeon(R) CPU E5-2699 v4 @ 2.20GHz
	GCC Version: gcc (SUSE Linux) 7.3.1 20180323 [gcc-7-branch revision 258812]
	Clang Version: 5.0.1 (tags/RELEASE_501/final 312548)
	build-gcc-static
	build-gcc-shared
	build-clang-static
	build-clang-shared
	build-x86-default


*Make Build Failed #1:
OS: UB1604-64
Target: x86_64-native-linuxapp-clang
  CC dpaa2_qdma.o
/tmp/UB1604-64_K4.4.0_Clang3.8.0/x86_64-native-linuxapp-clang/374852e247ea47b28e05d1065f094c10/dpdk/drivers/raw/dpaa2_cmdif/dpaa2_cmdif.c:105:45: error: use of undeclared identifier 'DPAA2_MAX_TX_RETRY_COUNT'
        } while ((ret == -EBUSY) && (retry_count < DPAA2_MAX_TX_RETRY_COUNT));
                                                   ^
1 error generated.
/tmp/UB1604-64_K4.4.0_Clang3.8.0/x86_64-native-linuxapp-clang/374852e247ea47b28e05d1065f094c10/dpdk/mk/internal/rte.compile-pre.mk:114: recipe for target 'dpaa2_cmdif.o' failed
make[6]: *** [dpaa2_cmdif.o] Error 1
/tmp/UB1604-64_K4.4.0_Clang3.8.0/x86_64-native-linuxapp-clang/374852e247ea47b28e05d1065f094c10/dpdk/mk/rte.subdir.mk:35: recipe for target 'dpaa2_cmdif' failed
make[5]: *** [dpaa2_cmdif] Error 2
make[5]: *** Waiting for unfinished jobs....
  CC skeleton_rawdev_test.o
  CC otx2_dpi_msg.o
  CC otx2_dpi_test.o
  PMDINFO ioat_rawdev.o.pmd.c
--
  PMDINFO ifpga_rawdev.o.pmd.c
  CC ifpga_rawdev.o.pmd.o
  LD ifpga_rawdev.o
  AR librte_rawdev_ifpga.a
  INSTALL-LIB librte_rawdev_ifpga.a
/tmp/UB1604-64_K4.4.0_Clang3.8.0/x86_64-native-linuxapp-clang/374852e247ea47b28e05d1065f094c10/dpdk/mk/rte.subdir.mk:35: recipe for target 'raw' failed
make[4]: *** [raw] Error 2
/tmp/UB1604-64_K4.4.0_Clang3.8.0/x86_64-native-linuxapp-clang/374852e247ea47b28e05d1065f094c10/dpdk/mk/rte.sdkbuild.mk:46: recipe for target 'drivers' failed
make[3]: *** [drivers] Error 2
/tmp/UB1604-64_K4.4.0_Clang3.8.0/x86_64-native-linuxapp-clang/374852e247ea47b28e05d1065f094c10/dpdk/mk/rte.sdkroot.mk:98: recipe for target 'all' failed
make[2]: *** [all] Error 2
/tmp/UB1604-64_K4.4.0_Clang3.8.0/x86_64-native-linuxapp-clang/374852e247ea47b28e05d1065f094c10/dpdk/mk/rte.sdkinstall.mk:60: recipe for target 'pre_install' failed
make[1]: *** [pre_install] Error 2
/tmp/UB1604-64_K4.4.0_Clang3.8.0/x86_64-native-linuxapp-clang/374852e247ea47b28e05d1065f094c10/dpdk/mk/rte.sdkroot.mk:77: recipe for target 'install' failed
make: *** [install] Error 2


*Make Build Failed #2:
OS: UB1604-32
Target: i686-native-linuxapp-gcc
  } while ((ret == -EBUSY) && (retry_count < DPAA2_MAX_TX_RETRY_COUNT));
                                             ^
/tmp/UB1604-32_K4.4.0_GCC5.4.0/i686-native-linuxapp-gcc/374852e247ea47b28e05d1065f094c10/dpdk/drivers/raw/dpaa2_cmdif/dpaa2_cmdif.c:105:45: note: each undeclared identifier is reported only once for each function it appears in
/tmp/UB1604-32_K4.4.0_GCC5.4.0/i686-native-linuxapp-gcc/374852e247ea47b28e05d1065f094c10/dpdk/drivers/raw/dpaa2_cmdif/dpaa2_cmdif.c: At top level:
cc1: warning: unrecognized command line option ‘-Wno-address-of-packed-member’
/tmp/UB1604-32_K4.4.0_GCC5.4.0/i686-native-linuxapp-gcc/374852e247ea47b28e05d1065f094c10/dpdk/mk/internal/rte.compile-pre.mk:114: recipe for target 'dpaa2_cmdif.o' failed
make[6]: *** [dpaa2_cmdif.o] Error 1
/tmp/UB1604-32_K4.4.0_GCC5.4.0/i686-native-linuxapp-gcc/374852e247ea47b28e05d1065f094c10/dpdk/mk/rte.subdir.mk:35: recipe for target 'dpaa2_cmdif' failed
make[5]: *** [dpaa2_cmdif] Error 2
make[5]: *** Waiting for unfinished jobs....
  CC ifpga_enumerate.o
  CC otx2_dpi_msg.o
  PMDINFO ioat_rawdev.o.pmd.c
  CC ioat_rawdev.o.pmd.o
--
  PMDINFO ifpga_rawdev.o.pmd.c
  CC ifpga_rawdev.o.pmd.o
  LD ifpga_rawdev.o
  AR librte_rawdev_ifpga.a
  INSTALL-LIB librte_rawdev_ifpga.a
/tmp/UB1604-32_K4.4.0_GCC5.4.0/i686-native-linuxapp-gcc/374852e247ea47b28e05d1065f094c10/dpdk/mk/rte.subdir.mk:35: recipe for target 'raw' failed
make[4]: *** [raw] Error 2
/tmp/UB1604-32_K4.4.0_GCC5.4.0/i686-native-linuxapp-gcc/374852e247ea47b28e05d1065f094c10/dpdk/mk/rte.sdkbuild.mk:46: recipe for target 'drivers' failed
make[3]: *** [drivers] Error 2
/tmp/UB1604-32_K4.4.0_GCC5.4.0/i686-native-linuxapp-gcc/374852e247ea47b28e05d1065f094c10/dpdk/mk/rte.sdkroot.mk:98: recipe for target 'all' failed
make[2]: *** [all] Error 2
/tmp/UB1604-32_K4.4.0_GCC5.4.0/i686-native-linuxapp-gcc/374852e247ea47b28e05d1065f094c10/dpdk/mk/rte.sdkinstall.mk:60: recipe for target 'pre_install' failed
make[1]: *** [pre_install] Error 2
/tmp/UB1604-32_K4.4.0_GCC5.4.0/i686-native-linuxapp-gcc/374852e247ea47b28e05d1065f094c10/dpdk/mk/rte.sdkroot.mk:77: recipe for target 'install' failed
make: *** [install] Error 2


*Make Build Failed #3:
OS: UB1904-64
Target: x86_64-native-linuxapp-gcc
  } while ((ret == -EBUSY) && (retry_count < DPAA2_MAX_TX_RETRY_COUNT));
                                             ^~~~~~~~~~~~~~~~~~~~~~~~
/tmp/UB1904-64_K4.18.0_GCC8.3.0/x86_64-native-linuxapp-gcc/374852e247ea47b28e05d1065f094c10/dpdk/drivers/raw/dpaa2_cmdif/dpaa2_cmdif.c:105:45: note: each undeclared identifier is reported only once for each function it appears in
/tmp/UB1904-64_K4.18.0_GCC8.3.0/x86_64-native-linuxapp-gcc/374852e247ea47b28e05d1065f094c10/dpdk/drivers/raw/dpaa2_cmdif/dpaa2_cmdif.c: At top level:
cc1: warning: unrecognized command line option ‘-Wno-address-of-packed-member’
make[6]: *** [/tmp/UB1904-64_K4.18.0_GCC8.3.0/x86_64-native-linuxapp-gcc/374852e247ea47b28e05d1065f094c10/dpdk/mk/internal/rte.compile-pre.mk:116: dpaa2_cmdif.o] Error 1
make[5]: *** [/tmp/UB1904-64_K4.18.0_GCC8.3.0/x86_64-native-linuxapp-gcc/374852e247ea47b28e05d1065f094c10/dpdk/mk/rte.subdir.mk:37: dpaa2_cmdif] Error 2
make[5]: *** Waiting for unfinished jobs....
  CC ifpga_enumerate.o
  CC ifpga_feature_dev.o
  PMDINFO dpaa2_qdma.o.pmd.c
  CC dpaa2_qdma.o.pmd.o
--
  PMDINFO ifpga_rawdev.o.pmd.c
  CC ifpga_rawdev.o.pmd.o
  LD ifpga_rawdev.o
  AR librte_rawdev_ifpga.a
  INSTALL-LIB librte_rawdev_ifpga.a
make[4]: *** [/tmp/UB1904-64_K4.18.0_GCC8.3.0/x86_64-native-linuxapp-gcc/374852e247ea47b28e05d1065f094c10/dpdk/mk/rte.subdir.mk:37: raw] Error 2
make[3]: *** [/tmp/UB1904-64_K4.18.0_GCC8.3.0/x86_64-native-linuxapp-gcc/374852e247ea47b28e05d1065f094c10/dpdk/mk/rte.sdkbuild.mk:46: drivers] Error 2
make[2]: *** [/tmp/UB1904-64_K4.18.0_GCC8.3.0/x86_64-native-linuxapp-gcc/374852e247ea47b28e05d1065f094c10/dpdk/mk/rte.sdkroot.mk:99: all] Error 2
make[1]: *** [/tmp/UB1904-64_K4.18.0_GCC8.3.0/x86_64-native-linuxapp-gcc/374852e247ea47b28e05d1065f094c10/dpdk/mk/rte.sdkinstall.mk:61: pre_install] Error 2
make: *** [/tmp/UB1904-64_K4.18.0_GCC8.3.0/x86_64-native-linuxapp-gcc/374852e247ea47b28e05d1065f094c10/dpdk/mk/rte.sdkroot.mk:77: install] Error 2


*Make Build Failed #4:
OS: UB1804-64
Target: x86_64-native-linuxapp-icc
/tmp/UB1804-64_K4.15.0_ICC19.0.0/x86_64-native-linuxapp-icc/374852e247ea47b28e05d1065f094c10/dpdk/drivers/raw/dpaa2_cmdif/dpaa2_cmdif.c(105): error: identifier "DPAA2_MAX_TX_RETRY_COUNT" is undefined
  	} while ((ret == -EBUSY) && (retry_count < DPAA2_MAX_TX_RETRY_COUNT));
  	                                           ^

compilation aborted for /tmp/UB1804-64_K4.15.0_ICC19.0.0/x86_64-native-linuxapp-icc/374852e247ea47b28e05d1065f094c10/dpdk/drivers/raw/dpaa2_cmdif/dpaa2_cmdif.c (code 2)
/tmp/UB1804-64_K4.15.0_ICC19.0.0/x86_64-native-linuxapp-icc/374852e247ea47b28e05d1065f094c10/dpdk/mk/internal/rte.compile-pre.mk:114: recipe for target 'dpaa2_cmdif.o' failed
make[6]: *** [dpaa2_cmdif.o] Error 2
/tmp/UB1804-64_K4.15.0_ICC19.0.0/x86_64-native-linuxapp-icc/374852e247ea47b28e05d1065f094c10/dpdk/mk/rte.subdir.mk:35: recipe for target 'dpaa2_cmdif' failed
make[5]: *** [dpaa2_cmdif] Error 2
make[5]: *** Waiting for unfinished jobs....
  PMDINFO otx2_dpi_rawdev.o.pmd.c
  CC ioat_rawdev_test.o
  PMDINFO ioat_rawdev.o.pmd.c
  CC ioat_rawdev.o.pmd.o
--
  PMDINFO ifpga_rawdev.o.pmd.c
  CC ifpga_rawdev.o.pmd.o
  LD ifpga_rawdev.o
  AR librte_rawdev_ifpga.a
  INSTALL-LIB librte_rawdev_ifpga.a
/tmp/UB1804-64_K4.15.0_ICC19.0.0/x86_64-native-linuxapp-icc/374852e247ea47b28e05d1065f094c10/dpdk/mk/rte.subdir.mk:35: recipe for target 'raw' failed
make[4]: *** [raw] Error 2
/tmp/UB1804-64_K4.15.0_ICC19.0.0/x86_64-native-linuxapp-icc/374852e247ea47b28e05d1065f094c10/dpdk/mk/rte.sdkbuild.mk:46: recipe for target 'drivers' failed
make[3]: *** [drivers] Error 2
/tmp/UB1804-64_K4.15.0_ICC19.0.0/x86_64-native-linuxapp-icc/374852e247ea47b28e05d1065f094c10/dpdk/mk/rte.sdkroot.mk:98: recipe for target 'all' failed
make[2]: *** [all] Error 2
/tmp/UB1804-64_K4.15.0_ICC19.0.0/x86_64-native-linuxapp-icc/374852e247ea47b28e05d1065f094c10/dpdk/mk/rte.sdkinstall.mk:60: recipe for target 'pre_install' failed
make[1]: *** [pre_install] Error 2
/tmp/UB1804-64_K4.15.0_ICC19.0.0/x86_64-native-linuxapp-icc/374852e247ea47b28e05d1065f094c10/dpdk/mk/rte.sdkroot.mk:77: recipe for target 'install' failed
make: *** [install] Error 2


*Make Build Failed #5:
OS: UB1804-64
Target: x86_64-native-linuxapp-clang
  LD ioat_rawdev.o
/tmp/UB1804-64_K4.15.0_Clang6.0.0/x86_64-native-linuxapp-clang/374852e247ea47b28e05d1065f094c10/dpdk/drivers/raw/dpaa2_cmdif/dpaa2_cmdif.c:105:45: error: use of undeclared identifier 'DPAA2_MAX_TX_RETRY_COUNT'
        } while ((ret == -EBUSY) && (retry_count < DPAA2_MAX_TX_RETRY_COUNT));
                                                   ^
1 error generated.
/tmp/UB1804-64_K4.15.0_Clang6.0.0/x86_64-native-linuxapp-clang/374852e247ea47b28e05d1065f094c10/dpdk/mk/internal/rte.compile-pre.mk:114: recipe for target 'dpaa2_cmdif.o' failed
make[6]: *** [dpaa2_cmdif.o] Error 1
/tmp/UB1804-64_K4.15.0_Clang6.0.0/x86_64-native-linuxapp-clang/374852e247ea47b28e05d1065f094c10/dpdk/mk/rte.subdir.mk:35: recipe for target 'dpaa2_cmdif' failed
make[5]: *** [dpaa2_cmdif] Error 2
make[5]: *** Waiting for unfinished jobs....
  PMDINFO skeleton_rawdev.o.pmd.c
  CC ifpga_fme.o
  CC skeleton_rawdev.o.pmd.o
  LD skeleton_rawdev.o
--
  PMDINFO ifpga_rawdev.o.pmd.c
  CC ifpga_rawdev.o.pmd.o
  LD ifpga_rawdev.o
  AR librte_rawdev_ifpga.a
  INSTALL-LIB librte_rawdev_ifpga.a
/tmp/UB1804-64_K4.15.0_Clang6.0.0/x86_64-native-linuxapp-clang/374852e247ea47b28e05d1065f094c10/dpdk/mk/rte.subdir.mk:35: recipe for target 'raw' failed
make[4]: *** [raw] Error 2
/tmp/UB1804-64_K4.15.0_Clang6.0.0/x86_64-native-linuxapp-clang/374852e247ea47b28e05d1065f094c10/dpdk/mk/rte.sdkbuild.mk:46: recipe for target 'drivers' failed
make[3]: *** [drivers] Error 2
/tmp/UB1804-64_K4.15.0_Clang6.0.0/x86_64-native-linuxapp-clang/374852e247ea47b28e05d1065f094c10/dpdk/mk/rte.sdkroot.mk:98: recipe for target 'all' failed
make[2]: *** [all] Error 2
/tmp/UB1804-64_K4.15.0_Clang6.0.0/x86_64-native-linuxapp-clang/374852e247ea47b28e05d1065f094c10/dpdk/mk/rte.sdkinstall.mk:60: recipe for target 'pre_install' failed
make[1]: *** [pre_install] Error 2
/tmp/UB1804-64_K4.15.0_Clang6.0.0/x86_64-native-linuxapp-clang/374852e247ea47b28e05d1065f094c10/dpdk/mk/rte.sdkroot.mk:77: recipe for target 'install' failed
make: *** [install] Error 2


*Make Build Failed #6:
OS: FC30-64
Target: x86_64-native-linuxapp-gcc
/tmp/FC30-64_K4.20_GCC9.1.1/x86_64-native-linuxapp-gcc/374852e247ea47b28e05d1065f094c10/dpdk/drivers/raw/dpaa2_cmdif/dpaa2_cmdif.c: In function ‘dpaa2_cmdif_enqueue_bufs’:
/tmp/FC30-64_K4.20_GCC9.1.1/x86_64-native-linuxapp-gcc/374852e247ea47b28e05d1065f094c10/dpdk/drivers/raw/dpaa2_cmdif/dpaa2_cmdif.c:105:45: error: ‘DPAA2_MAX_TX_RETRY_COUNT’ undeclared (first use in this function)
  105 |  } while ((ret == -EBUSY) && (retry_count < DPAA2_MAX_TX_RETRY_COUNT));
      |                                             ^~~~~~~~~~~~~~~~~~~~~~~~
/tmp/FC30-64_K4.20_GCC9.1.1/x86_64-native-linuxapp-gcc/374852e247ea47b28e05d1065f094c10/dpdk/drivers/raw/dpaa2_cmdif/dpaa2_cmdif.c:105:45: note: each undeclared identifier is reported only once for each function it appears in
make[6]: *** [/tmp/FC30-64_K4.20_GCC9.1.1/x86_64-native-linuxapp-gcc/374852e247ea47b28e05d1065f094c10/dpdk/mk/internal/rte.compile-pre.mk:116: dpaa2_cmdif.o] Error 1
make[5]: *** [/tmp/FC30-64_K4.20_GCC9.1.1/x86_64-native-linuxapp-gcc/374852e247ea47b28e05d1065f094c10/dpdk/mk/rte.subdir.mk:37: dpaa2_cmdif] Error 2
make[5]: *** Waiting for unfinished jobs....
  CC ifpga_feature_dev.o
  PMDINFO skeleton_rawdev.o.pmd.c
  CC skeleton_rawdev.o.pmd.o
  LD skeleton_rawdev.o
--
  PMDINFO ifpga_rawdev.o.pmd.c
  CC ifpga_rawdev.o.pmd.o
  LD ifpga_rawdev.o
  AR librte_rawdev_ifpga.a
  INSTALL-LIB librte_rawdev_ifpga.a
make[4]: *** [/tmp/FC30-64_K4.20_GCC9.1.1/x86_64-native-linuxapp-gcc/374852e247ea47b28e05d1065f094c10/dpdk/mk/rte.subdir.mk:37: raw] Error 2
make[3]: *** [/tmp/FC30-64_K4.20_GCC9.1.1/x86_64-native-linuxapp-gcc/374852e247ea47b28e05d1065f094c10/dpdk/mk/rte.sdkbuild.mk:46: drivers] Error 2
make[2]: *** [/tmp/FC30-64_K4.20_GCC9.1.1/x86_64-native-linuxapp-gcc/374852e247ea47b28e05d1065f094c10/dpdk/mk/rte.sdkroot.mk:99: all] Error 2
make[1]: *** [/tmp/FC30-64_K4.20_GCC9.1.1/x86_64-native-linuxapp-gcc/374852e247ea47b28e05d1065f094c10/dpdk/mk/rte.sdkinstall.mk:61: pre_install] Error 2
make: *** [/tmp/FC30-64_K4.20_GCC9.1.1/x86_64-native-linuxapp-gcc/374852e247ea47b28e05d1065f094c10/dpdk/mk/rte.sdkroot.mk:77: install] Error 2


*Make Build Failed #7:
OS: SUSE15-64
Target: x86_64-native-linuxapp-gcc
  } while ((ret == -EBUSY) && (retry_count < DPAA2_MAX_TX_RETRY_COUNT));
                                             ^~~~~~~~~~~~~~~~~~~~~~~~
/tmp/SUSE15-64_K4.12.14_GCC7.3.1/x86_64-native-linuxapp-gcc/374852e247ea47b28e05d1065f094c10/dpdk/drivers/raw/dpaa2_cmdif/dpaa2_cmdif.c:105:45: note: each undeclared identifier is reported only once for each function it appears in
/tmp/SUSE15-64_K4.12.14_GCC7.3.1/x86_64-native-linuxapp-gcc/374852e247ea47b28e05d1065f094c10/dpdk/drivers/raw/dpaa2_cmdif/dpaa2_cmdif.c: At top level:
cc1: warning: unrecognized command line option ‘-Wno-address-of-packed-member’
make[6]: *** [/tmp/SUSE15-64_K4.12.14_GCC7.3.1/x86_64-native-linuxapp-gcc/374852e247ea47b28e05d1065f094c10/dpdk/mk/internal/rte.compile-pre.mk:116: dpaa2_cmdif.o] Error 1
make[5]: *** [/tmp/SUSE15-64_K4.12.14_GCC7.3.1/x86_64-native-linuxapp-gcc/374852e247ea47b28e05d1065f094c10/dpdk/mk/rte.subdir.mk:37: dpaa2_cmdif] Error 2
make[5]: *** Waiting for unfinished jobs....
  CC otx2_dpi_test.o
  SYMLINK-FILE include/rte_ioat_spec.h
  CC ioat_rawdev.o
  CC ifpga_enumerate.o
--
  PMDINFO ifpga_rawdev.o.pmd.c
  CC ifpga_rawdev.o.pmd.o
  LD ifpga_rawdev.o
  AR librte_rawdev_ifpga.a
  INSTALL-LIB librte_rawdev_ifpga.a
make[4]: *** [/tmp/SUSE15-64_K4.12.14_GCC7.3.1/x86_64-native-linuxapp-gcc/374852e247ea47b28e05d1065f094c10/dpdk/mk/rte.subdir.mk:37: raw] Error 2
make[3]: *** [/tmp/SUSE15-64_K4.12.14_GCC7.3.1/x86_64-native-linuxapp-gcc/374852e247ea47b28e05d1065f094c10/dpdk/mk/rte.sdkbuild.mk:46: drivers] Error 2
make[2]: *** [/tmp/SUSE15-64_K4.12.14_GCC7.3.1/x86_64-native-linuxapp-gcc/374852e247ea47b28e05d1065f094c10/dpdk/mk/rte.sdkroot.mk:99: all] Error 2
make[1]: *** [/tmp/SUSE15-64_K4.12.14_GCC7.3.1/x86_64-native-linuxapp-gcc/374852e247ea47b28e05d1065f094c10/dpdk/mk/rte.sdkinstall.mk:61: pre_install] Error 2
make: *** [/tmp/SUSE15-64_K4.12.14_GCC7.3.1/x86_64-native-linuxapp-gcc/374852e247ea47b28e05d1065f094c10/dpdk/mk/rte.sdkroot.mk:77: install] Error 2


*Make Build Failed #8:
OS: RHEL80-64
Target: x86_64-native-linuxapp-gcc
/tmp/RHEL80-64_K3.10.0_GCC8.2.1/x86_64-native-linuxapp-gcc/374852e247ea47b28e05d1065f094c10/dpdk/drivers/raw/dpaa2_cmdif/dpaa2_cmdif.c: At top level:
cc1: warning: unrecognized command line option ‘-Wno-address-of-packed-member’
  CC ntb.o
  CC ioat_rawdev.o
  CC ioat_rawdev_test.o
make[6]: *** [/tmp/RHEL80-64_K3.10.0_GCC8.2.1/x86_64-native-linuxapp-gcc/374852e247ea47b28e05d1065f094c10/dpdk/mk/internal/rte.compile-pre.mk:116: dpaa2_cmdif.o] Error 1
make[6]: *** Waiting for unfinished jobs....
make[5]: *** [/tmp/RHEL80-64_K3.10.0_GCC8.2.1/x86_64-native-linuxapp-gcc/374852e247ea47b28e05d1065f094c10/dpdk/mk/rte.subdir.mk:37: dpaa2_cmdif] Error 2
make[5]: *** Waiting for unfinished jobs....
  CC ntb_hw_intel.o
  CC dpaa2_qdma.o
  CC otx2_dpi_rawdev.o
  CC otx2_dpi_msg.o
--
  PMDINFO ifpga_rawdev.o.pmd.c
  CC ifpga_rawdev.o.pmd.o
  LD ifpga_rawdev.o
  AR librte_rawdev_ifpga.a
  INSTALL-LIB librte_rawdev_ifpga.a
make[4]: *** [/tmp/RHEL80-64_K3.10.0_GCC8.2.1/x86_64-native-linuxapp-gcc/374852e247ea47b28e05d1065f094c10/dpdk/mk/rte.subdir.mk:37: raw] Error 2
make[3]: *** [/tmp/RHEL80-64_K3.10.0_GCC8.2.1/x86_64-native-linuxapp-gcc/374852e247ea47b28e05d1065f094c10/dpdk/mk/rte.sdkbuild.mk:46: drivers] Error 2
make[2]: *** [/tmp/RHEL80-64_K3.10.0_GCC8.2.1/x86_64-native-linuxapp-gcc/374852e247ea47b28e05d1065f094c10/dpdk/mk/rte.sdkroot.mk:99: all] Error 2
make[1]: *** [/tmp/RHEL80-64_K3.10.0_GCC8.2.1/x86_64-native-linuxapp-gcc/374852e247ea47b28e05d1065f094c10/dpdk/mk/rte.sdkinstall.mk:61: pre_install] Error 2
make: *** [/tmp/RHEL80-64_K3.10.0_GCC8.2.1/x86_64-native-linuxapp-gcc/374852e247ea47b28e05d1065f094c10/dpdk/mk/rte.sdkroot.mk:77: install] Error 2


*Make Build Failed #9:
OS: RHEL76-64
Target: x86_64-native-linuxapp-gcc
cc1: warning: unrecognized command line option "-Wno-address-of-packed-member" [enabled by default]
  AR librte_rawdev_octeontx2_dma.a
  PMDINFO skeleton_rawdev.o.pmd.c
  PMDINFO ntb.o.pmd.c
  CC skeleton_rawdev.o.pmd.o
make[6]: *** [dpaa2_cmdif.o] Error 1
  CC ntb.o.pmd.o
make[5]: *** [dpaa2_cmdif] Error 2
make[5]: *** Waiting for unfinished jobs....
  LD ntb.o
  INSTALL-LIB librte_rawdev_octeontx2_dma.a
  CC skeleton_rawdev_test.o
  LD skeleton_rawdev.o
--
  PMDINFO ifpga_rawdev.o.pmd.c
  CC ifpga_rawdev.o.pmd.o
  LD ifpga_rawdev.o
  AR librte_rawdev_ifpga.a
  INSTALL-LIB librte_rawdev_ifpga.a
make[4]: *** [raw] Error 2
make[3]: *** [drivers] Error 2
make[2]: *** [all] Error 2
make[1]: *** [pre_install] Error 2
make: *** [install] Error 2


*Make Build Failed #10:
OS: FC30-64
Target: x86_64-native-linuxapp-clang
  CC ntb_hw_intel.o
/tmp/FC30-64_K4.20_Clang8.0.0/x86_64-native-linuxapp-clang/374852e247ea47b28e05d1065f094c10/dpdk/drivers/raw/dpaa2_cmdif/dpaa2_cmdif.c:105:45: error: use of undeclared identifier 'DPAA2_MAX_TX_RETRY_COUNT'
        } while ((ret == -EBUSY) && (retry_count < DPAA2_MAX_TX_RETRY_COUNT));
                                                   ^
1 error generated.
make[6]: *** [/tmp/FC30-64_K4.20_Clang8.0.0/x86_64-native-linuxapp-clang/374852e247ea47b28e05d1065f094c10/dpdk/mk/internal/rte.compile-pre.mk:116: dpaa2_cmdif.o] Error 1
make[5]: *** [/tmp/FC30-64_K4.20_Clang8.0.0/x86_64-native-linuxapp-clang/374852e247ea47b28e05d1065f094c10/dpdk/mk/rte.subdir.mk:37: dpaa2_cmdif] Error 2
make[5]: *** Waiting for unfinished jobs....
  CC ifpga_feature_dev.o
  CC otx2_dpi_test.o
  CC ifpga_fme.o
  PMDINFO ntb.o.pmd.c
--
  PMDINFO ifpga_rawdev.o.pmd.c
  CC ifpga_rawdev.o.pmd.o
  LD ifpga_rawdev.o
  AR librte_rawdev_ifpga.a
  INSTALL-LIB librte_rawdev_ifpga.a
make[4]: *** [/tmp/FC30-64_K4.20_Clang8.0.0/x86_64-native-linuxapp-clang/374852e247ea47b28e05d1065f094c10/dpdk/mk/rte.subdir.mk:37: raw] Error 2
make[3]: *** [/tmp/FC30-64_K4.20_Clang8.0.0/x86_64-native-linuxapp-clang/374852e247ea47b28e05d1065f094c10/dpdk/mk/rte.sdkbuild.mk:46: drivers] Error 2
make[2]: *** [/tmp/FC30-64_K4.20_Clang8.0.0/x86_64-native-linuxapp-clang/374852e247ea47b28e05d1065f094c10/dpdk/mk/rte.sdkroot.mk:99: all] Error 2
make[1]: *** [/tmp/FC30-64_K4.20_Clang8.0.0/x86_64-native-linuxapp-clang/374852e247ea47b28e05d1065f094c10/dpdk/mk/rte.sdkinstall.mk:61: pre_install] Error 2
make: *** [/tmp/FC30-64_K4.20_Clang8.0.0/x86_64-native-linuxapp-clang/374852e247ea47b28e05d1065f094c10/dpdk/mk/rte.sdkroot.mk:77: install] Error 2


*Make Build Failed #11:
OS: SUSE15-64
Target: x86_64-native-linuxapp-clang
  SYMLINK-FILE include/rte_ioat_spec.h
/tmp/SUSE15-64_K4.12.14_Clang5.0.1/x86_64-native-linuxapp-clang/374852e247ea47b28e05d1065f094c10/dpdk/drivers/raw/dpaa2_cmdif/dpaa2_cmdif.c:105:45: error: use of undeclared identifier 'DPAA2_MAX_TX_RETRY_COUNT'
        } while ((ret == -EBUSY) && (retry_count < DPAA2_MAX_TX_RETRY_COUNT));
                                                   ^
1 error generated.
make[6]: *** [/tmp/SUSE15-64_K4.12.14_Clang5.0.1/x86_64-native-linuxapp-clang/374852e247ea47b28e05d1065f094c10/dpdk/mk/internal/rte.compile-pre.mk:116: dpaa2_cmdif.o] Error 1
make[5]: *** [/tmp/SUSE15-64_K4.12.14_Clang5.0.1/x86_64-native-linuxapp-clang/374852e247ea47b28e05d1065f094c10/dpdk/mk/rte.subdir.mk:37: dpaa2_cmdif] Error 2
make[5]: *** Waiting for unfinished jobs....
  CC ioat_rawdev.o
  CC ioat_rawdev_test.o
  PMDINFO skeleton_rawdev.o.pmd.c
  CC skeleton_rawdev.o.pmd.o
--
  PMDINFO ifpga_rawdev.o.pmd.c
  CC ifpga_rawdev.o.pmd.o
  LD ifpga_rawdev.o
  AR librte_rawdev_ifpga.a
  INSTALL-LIB librte_rawdev_ifpga.a
make[4]: *** [/tmp/SUSE15-64_K4.12.14_Clang5.0.1/x86_64-native-linuxapp-clang/374852e247ea47b28e05d1065f094c10/dpdk/mk/rte.subdir.mk:37: raw] Error 2
make[3]: *** [/tmp/SUSE15-64_K4.12.14_Clang5.0.1/x86_64-native-linuxapp-clang/374852e247ea47b28e05d1065f094c10/dpdk/mk/rte.sdkbuild.mk:46: drivers] Error 2
make[2]: *** [/tmp/SUSE15-64_K4.12.14_Clang5.0.1/x86_64-native-linuxapp-clang/374852e247ea47b28e05d1065f094c10/dpdk/mk/rte.sdkroot.mk:99: all] Error 2
make[1]: *** [/tmp/SUSE15-64_K4.12.14_Clang5.0.1/x86_64-native-linuxapp-clang/374852e247ea47b28e05d1065f094c10/dpdk/mk/rte.sdkinstall.mk:61: pre_install] Error 2
make: *** [/tmp/SUSE15-64_K4.12.14_Clang5.0.1/x86_64-native-linuxapp-clang/374852e247ea47b28e05d1065f094c10/dpdk/mk/rte.sdkroot.mk:77: install] Error 2


*Make Build Failed #12:
OS: UB1604-64
Target: x86_64-native-linuxapp-gcc
  } while ((ret == -EBUSY) && (retry_count < DPAA2_MAX_TX_RETRY_COUNT));
                                             ^
/tmp/UB1604-64_K4.4.0_GCC5.4.0/x86_64-native-linuxapp-gcc/374852e247ea47b28e05d1065f094c10/dpdk/drivers/raw/dpaa2_cmdif/dpaa2_cmdif.c:105:45: note: each undeclared identifier is reported only once for each function it appears in
/tmp/UB1604-64_K4.4.0_GCC5.4.0/x86_64-native-linuxapp-gcc/374852e247ea47b28e05d1065f094c10/dpdk/drivers/raw/dpaa2_cmdif/dpaa2_cmdif.c: At top level:
cc1: warning: unrecognized command line option ‘-Wno-address-of-packed-member’
/tmp/UB1604-64_K4.4.0_GCC5.4.0/x86_64-native-linuxapp-gcc/374852e247ea47b28e05d1065f094c10/dpdk/mk/internal/rte.compile-pre.mk:114: recipe for target 'dpaa2_cmdif.o' failed
make[6]: *** [dpaa2_cmdif.o] Error 1
/tmp/UB1604-64_K4.4.0_GCC5.4.0/x86_64-native-linuxapp-gcc/374852e247ea47b28e05d1065f094c10/dpdk/mk/rte.subdir.mk:35: recipe for target 'dpaa2_cmdif' failed
make[5]: *** [dpaa2_cmdif] Error 2
make[5]: *** Waiting for unfinished jobs....
  CC ifpga_enumerate.o
  CC ifpga_feature_dev.o
  PMDINFO ioat_rawdev.o.pmd.c
  CC ioat_rawdev.o.pmd.o
--
  PMDINFO ifpga_rawdev.o.pmd.c
  CC ifpga_rawdev.o.pmd.o
  LD ifpga_rawdev.o
  AR librte_rawdev_ifpga.a
  INSTALL-LIB librte_rawdev_ifpga.a
/tmp/UB1604-64_K4.4.0_GCC5.4.0/x86_64-native-linuxapp-gcc/374852e247ea47b28e05d1065f094c10/dpdk/mk/rte.subdir.mk:35: recipe for target 'raw' failed
make[4]: *** [raw] Error 2
/tmp/UB1604-64_K4.4.0_GCC5.4.0/x86_64-native-linuxapp-gcc/374852e247ea47b28e05d1065f094c10/dpdk/mk/rte.sdkbuild.mk:46: recipe for target 'drivers' failed
make[3]: *** [drivers] Error 2
/tmp/UB1604-64_K4.4.0_GCC5.4.0/x86_64-native-linuxapp-gcc/374852e247ea47b28e05d1065f094c10/dpdk/mk/rte.sdkroot.mk:98: recipe for target 'all' failed
make[2]: *** [all] Error 2
/tmp/UB1604-64_K4.4.0_GCC5.4.0/x86_64-native-linuxapp-gcc/374852e247ea47b28e05d1065f094c10/dpdk/mk/rte.sdkinstall.mk:60: recipe for target 'pre_install' failed
make[1]: *** [pre_install] Error 2
/tmp/UB1604-64_K4.4.0_GCC5.4.0/x86_64-native-linuxapp-gcc/374852e247ea47b28e05d1065f094c10/dpdk/mk/rte.sdkroot.mk:77: recipe for target 'install' failed
make: *** [install] Error 2


*Make Build Failed #13:
OS: UB1804-64
Target: x86_64-native-linuxapp-gcc
  } while ((ret == -EBUSY) && (retry_count < DPAA2_MAX_TX_RETRY_COUNT));
                                             ^~~~~~~~~~~~~~~~~~~~~~~~
/tmp/UB1804-64_K4.15.0_GCC7.3.0/x86_64-native-linuxapp-gcc/374852e247ea47b28e05d1065f094c10/dpdk/drivers/raw/dpaa2_cmdif/dpaa2_cmdif.c:105:45: note: each undeclared identifier is reported only once for each function it appears in
/tmp/UB1804-64_K4.15.0_GCC7.3.0/x86_64-native-linuxapp-gcc/374852e247ea47b28e05d1065f094c10/dpdk/drivers/raw/dpaa2_cmdif/dpaa2_cmdif.c: At top level:
cc1: warning: unrecognized command line option ‘-Wno-address-of-packed-member’
/tmp/UB1804-64_K4.15.0_GCC7.3.0/x86_64-native-linuxapp-gcc/374852e247ea47b28e05d1065f094c10/dpdk/mk/internal/rte.compile-pre.mk:114: recipe for target 'dpaa2_cmdif.o' failed
make[6]: *** [dpaa2_cmdif.o] Error 1
/tmp/UB1804-64_K4.15.0_GCC7.3.0/x86_64-native-linuxapp-gcc/374852e247ea47b28e05d1065f094c10/dpdk/mk/rte.subdir.mk:35: recipe for target 'dpaa2_cmdif' failed
make[5]: *** [dpaa2_cmdif] Error 2
make[5]: *** Waiting for unfinished jobs....
  CC ifpga_feature_dev.o
  CC ifpga_fme.o
  PMDINFO ioat_rawdev.o.pmd.c
  CC ioat_rawdev.o.pmd.o
--
  PMDINFO ifpga_rawdev.o.pmd.c
  CC ifpga_rawdev.o.pmd.o
  LD ifpga_rawdev.o
  AR librte_rawdev_ifpga.a
  INSTALL-LIB librte_rawdev_ifpga.a
/tmp/UB1804-64_K4.15.0_GCC7.3.0/x86_64-native-linuxapp-gcc/374852e247ea47b28e05d1065f094c10/dpdk/mk/rte.subdir.mk:35: recipe for target 'raw' failed
make[4]: *** [raw] Error 2
/tmp/UB1804-64_K4.15.0_GCC7.3.0/x86_64-native-linuxapp-gcc/374852e247ea47b28e05d1065f094c10/dpdk/mk/rte.sdkbuild.mk:46: recipe for target 'drivers' failed
make[3]: *** [drivers] Error 2
/tmp/UB1804-64_K4.15.0_GCC7.3.0/x86_64-native-linuxapp-gcc/374852e247ea47b28e05d1065f094c10/dpdk/mk/rte.sdkroot.mk:98: recipe for target 'all' failed
make[2]: *** [all] Error 2
/tmp/UB1804-64_K4.15.0_GCC7.3.0/x86_64-native-linuxapp-gcc/374852e247ea47b28e05d1065f094c10/dpdk/mk/rte.sdkinstall.mk:60: recipe for target 'pre_install' failed
make[1]: *** [pre_install] Error 2
/tmp/UB1804-64_K4.15.0_GCC7.3.0/x86_64-native-linuxapp-gcc/374852e247ea47b28e05d1065f094c10/dpdk/mk/rte.sdkroot.mk:77: recipe for target 'install' failed
make: *** [install] Error 2


*Make Build Failed #14:
OS: CENTOS76-64
Target: x86_64-native-linuxapp-clang
  CC ifpga_feature_dev.o
/tmp/CENTOS76-64_K3.10.0_Clang3.4.2/x86_64-native-linuxapp-clang/374852e247ea47b28e05d1065f094c10/dpdk/drivers/raw/dpaa2_cmdif/dpaa2_cmdif.c:105:45: error: use of undeclared identifier 'DPAA2_MAX_TX_RETRY_COUNT'
        } while ((ret == -EBUSY) && (retry_count < DPAA2_MAX_TX_RETRY_COUNT));
                                                   ^
1 error generated.
make[6]: *** [dpaa2_cmdif.o] Error 1
make[5]: *** [dpaa2_cmdif] Error 2
make[5]: *** Waiting for unfinished jobs....
  CC ifpga_fme.o
  PMDINFO ioat_rawdev.o.pmd.c
  CC ioat_rawdev.o.pmd.o
  LD ioat_rawdev.o
--
  PMDINFO ifpga_rawdev.o.pmd.c
  CC ifpga_rawdev.o.pmd.o
  LD ifpga_rawdev.o
  AR librte_rawdev_ifpga.a
  INSTALL-LIB librte_rawdev_ifpga.a
make[4]: *** [raw] Error 2
make[3]: *** [drivers] Error 2
make[2]: *** [all] Error 2
make[1]: *** [pre_install] Error 2
make: *** [install] Error 2


*Make Build Failed #15:
OS: CENTOS76-64
Target: x86_64-native-linuxapp-gcc+debug
  } while ((ret == -EBUSY) && (retry_count < DPAA2_MAX_TX_RETRY_COUNT));
                                             ^
/tmp/CENTOS76-64_K3.10.0_GCC4.8.5/x86_64-native-linuxapp-gcc+debug/374852e247ea47b28e05d1065f094c10/dpdk/drivers/raw/dpaa2_cmdif/dpaa2_cmdif.c:105:45: note: each undeclared identifier is reported only once for each function it appears in
/tmp/CENTOS76-64_K3.10.0_GCC4.8.5/x86_64-native-linuxapp-gcc+debug/374852e247ea47b28e05d1065f094c10/dpdk/drivers/raw/dpaa2_cmdif/dpaa2_cmdif.c: At top level:
cc1: warning: unrecognized command line option "-Wno-address-of-packed-member" [enabled by default]
make[6]: *** [dpaa2_cmdif.o] Error 1
make[5]: *** [dpaa2_cmdif] Error 2
make[5]: *** Waiting for unfinished jobs....
  LD skeleton_rawdev.o
  CC ioat_rawdev_test.o
  CC ifpga_fme.o
  PMDINFO ioat_rawdev.o.pmd.c
--
  PMDINFO ifpga_rawdev.o.pmd.c
  CC ifpga_rawdev.o.pmd.o
  LD ifpga_rawdev.o
  AR librte_rawdev_ifpga.a
  INSTALL-LIB librte_rawdev_ifpga.a
make[4]: *** [raw] Error 2
make[3]: *** [drivers] Error 2
make[2]: *** [all] Error 2
make[1]: *** [pre_install] Error 2
make: *** [install] Error 2


*Make Build Failed #16:
OS: CENTOS76-64
Target: x86_64-native-linuxapp-gcc
  } while ((ret == -EBUSY) && (retry_count < DPAA2_MAX_TX_RETRY_COUNT));
                                             ^
/tmp/CENTOS76-64_K3.10.0_GCC4.8.5/x86_64-native-linuxapp-gcc/374852e247ea47b28e05d1065f094c10/dpdk/drivers/raw/dpaa2_cmdif/dpaa2_cmdif.c:105:45: note: each undeclared identifier is reported only once for each function it appears in
/tmp/CENTOS76-64_K3.10.0_GCC4.8.5/x86_64-native-linuxapp-gcc/374852e247ea47b28e05d1065f094c10/dpdk/drivers/raw/dpaa2_cmdif/dpaa2_cmdif.c: At top level:
cc1: warning: unrecognized command line option "-Wno-address-of-packed-member" [enabled by default]
make[6]: *** [dpaa2_cmdif.o] Error 1
make[5]: *** [dpaa2_cmdif] Error 2
make[5]: *** Waiting for unfinished jobs....
  CC dpaa2_qdma.o
  CC otx2_dpi_rawdev.o
  CC ifpga_enumerate.o
  CC ifpga_feature_dev.o
--
  PMDINFO ifpga_rawdev.o.pmd.c
  CC ifpga_rawdev.o.pmd.o
  LD ifpga_rawdev.o
  AR librte_rawdev_ifpga.a
  INSTALL-LIB librte_rawdev_ifpga.a
make[4]: *** [raw] Error 2
make[3]: *** [drivers] Error 2
make[2]: *** [all] Error 2
make[1]: *** [pre_install] Error 2
make: *** [install] Error 2


*Make Build Failed #17:
OS: CENTOS76-64
Target: x86_64-native-linuxapp-gcc+shared
  } while ((ret == -EBUSY) && (retry_count < DPAA2_MAX_TX_RETRY_COUNT));
                                             ^
/tmp/CENTOS76-64_K3.10.0_GCC4.8.5/x86_64-native-linuxapp-gcc+shared/374852e247ea47b28e05d1065f094c10/dpdk/drivers/raw/dpaa2_cmdif/dpaa2_cmdif.c:105:45: note: each undeclared identifier is reported only once for each function it appears in
/tmp/CENTOS76-64_K3.10.0_GCC4.8.5/x86_64-native-linuxapp-gcc+shared/374852e247ea47b28e05d1065f094c10/dpdk/drivers/raw/dpaa2_cmdif/dpaa2_cmdif.c: At top level:
cc1: warning: unrecognized command line option "-Wno-address-of-packed-member" [enabled by default]
make[6]: *** [dpaa2_cmdif.o] Error 1
make[5]: *** [dpaa2_cmdif] Error 2
make[5]: *** Waiting for unfinished jobs....
  PMDINFO skeleton_rawdev.o.pmd.c
  CC skeleton_rawdev.o.pmd.o
  CC ifpga_feature_dev.o
  LD skeleton_rawdev.o
--
  PMDINFO ifpga_rawdev.o.pmd.c
  CC ifpga_rawdev.o.pmd.o
  LD ifpga_rawdev.o
  LD librte_rawdev_ifpga.so.1.1
  INSTALL-LIB librte_rawdev_ifpga.so.1.1
make[4]: *** [raw] Error 2
make[3]: *** [drivers] Error 2
make[2]: *** [all] Error 2
make[1]: *** [pre_install] Error 2
make: *** [install] Error 2


*Make Build Failed #18:
OS: CENTOS76-64
Target: x86_64-native-linuxapp-icc
/tmp/CENTOS76-64_K3.10.0_ICC19.0.0/x86_64-native-linuxapp-icc/374852e247ea47b28e05d1065f094c10/dpdk/drivers/raw/dpaa2_cmdif/dpaa2_cmdif.c(105): error: identifier "DPAA2_MAX_TX_RETRY_COUNT" is undefined
  	} while ((ret == -EBUSY) && (retry_count < DPAA2_MAX_TX_RETRY_COUNT));
  	                                           ^

compilation aborted for /tmp/CENTOS76-64_K3.10.0_ICC19.0.0/x86_64-native-linuxapp-icc/374852e247ea47b28e05d1065f094c10/dpdk/drivers/raw/dpaa2_cmdif/dpaa2_cmdif.c (code 2)
make[6]: *** [dpaa2_cmdif.o] Error 2
make[5]: *** [dpaa2_cmdif] Error 2
make[5]: *** Waiting for unfinished jobs....
  CC ifpga_enumerate.o
  CC otx2_dpi_test.o
  PMDINFO ioat_rawdev.o.pmd.c
  CC ioat_rawdev.o.pmd.o
--
  PMDINFO ifpga_rawdev.o.pmd.c
  CC ifpga_rawdev.o.pmd.o
  LD ifpga_rawdev.o
  AR librte_rawdev_ifpga.a
  INSTALL-LIB librte_rawdev_ifpga.a
make[4]: *** [raw] Error 2
make[3]: *** [drivers] Error 2
make[2]: *** [all] Error 2
make[1]: *** [pre_install] Error 2
make: *** [install] Error 2

*Meson Build Failed #1:
OS: SUSE15-64
Target:build-gcc-static
FAILED: drivers/a715181@@tmp_rte_rawdev_dpaa2_cmdif@sta/raw_dpaa2_cmdif_dpaa2_cmdif.c.o 
gcc -Idrivers/a715181@@tmp_rte_rawdev_dpaa2_cmdif@sta -Idrivers -I../drivers -Idrivers/raw/dpaa2_cmdif -I../drivers/raw/dpaa2_cmdif -Ilib/librte_rawdev -I../lib/librte_rawdev -I. -I../ -Iconfig -I../config -Ilib/librte_eal/common/include -I../lib/librte_eal/common/include -I../lib/librte_eal/linux/eal/include -Ilib/librte_eal/common -I../lib/librte_eal/common -Ilib/librte_eal/common/include/arch/x86 -I../lib/librte_eal/common/include/arch/x86 -Ilib/librte_eal -I../lib/librte_eal -Ilib/librte_kvargs -I../lib/librte_kvargs -Idrivers/mempool/dpaa2 -I../drivers/mempool/dpaa2 -Ilib/librte_mempool -I../lib/librte_mempool -Ilib/librte_ring -I../lib/librte_ring -Idrivers/bus/fslmc -I../drivers/bus/fslmc -I../drivers/bus/fslmc/mc -I../drivers/bus/fslmc/qbman/include -I../drivers/bus/fslmc/portal -Idrivers/common/dpaax -I../drivers/common/dpaax -Ilib/librte_eventdev -I../lib/librte_eventdev -Ilib/librte_ethdev -I../lib/librte_ethdev -Ilib/librte_net -I../lib/librte_net -Ilib/librte_mbuf -I../lib/librte_mbuf -Ilib/librte_meter -I../lib/librte_meter -Ilib/librte_hash -I../lib/librte_hash -Ilib/librte_timer -I../lib/librte_timer -Ilib/librte_cryptodev -I../lib/librte_cryptodev -Idrivers/bus/vdev -I../drivers/bus/vdev -fdiagnostics-color=always -pipe -D_FILE_OFFSET_BITS=64 -Wall -Winvalid-pch -Werror -O3 -include rte_config.h -Wunused-parameter -Wsign-compare -Wcast-qual -D_GNU_SOURCE -fPIC -march=native -Wno-format-truncation -DALLOW_EXPERIMENTAL_API -MD -MQ 'drivers/a715181@@tmp_rte_rawdev_dpaa2_cmdif@sta/raw_dpaa2_cmdif_dpaa2_cmdif.c.o' -MF 'drivers/a715181@@tmp_rte_rawdev_dpaa2_cmdif@sta/raw_dpaa2_cmdif_dpaa2_cmdif.c.o.d' -o 'drivers/a715181@@tmp_rte_rawdev_dpaa2_cmdif@sta/raw_dpaa2_cmdif_dpaa2_cmdif.c.o' -c ../drivers/raw/dpaa2_cmdif/dpaa2_cmdif.c
../drivers/raw/dpaa2_cmdif/dpaa2_cmdif.c: In function ‘dpaa2_cmdif_enqueue_bufs’:
../drivers/raw/dpaa2_cmdif/dpaa2_cmdif.c:105:45: error: ‘DPAA2_MAX_TX_RETRY_COUNT’ undeclared (first use in this function)
  } while ((ret == -EBUSY) && (retry_count < DPAA2_MAX_TX_RETRY_COUNT));
                                             ^~~~~~~~~~~~~~~~~~~~~~~~
../drivers/raw/dpaa2_cmdif/dpaa2_cmdif.c:105:45: note: each undeclared identifier is reported only once for each function it appears in
[1440/1892] Linking static target drivers/libtmp_rte_pmd_sw_event.a.
[1441/1892] Compiling C object 'drivers/a715181@@tmp_rte_pmd_bbdev_null@sta/baseband_null_bbdev_null.c.o'.
[1442/1892] Compiling C object 'drivers/a715181@@tmp_rte_pmd_bbdev_turbo_sw@sta/baseband_turbo_sw_bbdev_turbo_software.c.o'.
[1443/1892] Compiling C object 'drivers/a715181@@tmp_rte_pmd_bbdev_fpga_lte_fec@sta/baseband_fpga_lte_fec_fpga_lte_fec.c.o'.
[1444/1892] Compiling C object 'drivers/a715181@@tmp_rte_pmd_octeontx_event@sta/event_octeontx_ssovf_evdev_selftest.c.o'.
[1445/1892] Compiling C object 'drivers/a715181@@tmp_rte_pmd_octeontx2_event@sta/event_octeontx2_otx2_worker.c.o'.
[1446/1892] Compiling C object 'drivers/a715181@@tmp_rte_pmd_octeontx2_event@sta/event_octeontx2_otx2_worker_dual.c.o'.
ninja: build stopped: subcommand failed




*Meson Build Failed #2:
OS: UB1604-32
Target:build-gcc-static
FAILED: drivers/a715181@@tmp_rte_rawdev_dpaa2_cmdif@sta/raw_dpaa2_cmdif_dpaa2_cmdif.c.o 
gcc -Idrivers/a715181@@tmp_rte_rawdev_dpaa2_cmdif@sta -Idrivers -I../drivers -Idrivers/raw/dpaa2_cmdif -I../drivers/raw/dpaa2_cmdif -Ilib/librte_rawdev -I../lib/librte_rawdev -I. -I../ -Iconfig -I../config -Ilib/librte_eal/common/include -I../lib/librte_eal/common/include -I../lib/librte_eal/linux/eal/include -Ilib/librte_eal/common -I../lib/librte_eal/common -Ilib/librte_eal/common/include/arch/x86 -I../lib/librte_eal/common/include/arch/x86 -Ilib/librte_eal -I../lib/librte_eal -Ilib/librte_kvargs -I../lib/librte_kvargs -Idrivers/mempool/dpaa2 -I../drivers/mempool/dpaa2 -Ilib/librte_mempool -I../lib/librte_mempool -Ilib/librte_ring -I../lib/librte_ring -Idrivers/bus/fslmc -I../drivers/bus/fslmc -I../drivers/bus/fslmc/mc -I../drivers/bus/fslmc/qbman/include -I../drivers/bus/fslmc/portal -Idrivers/common/dpaax -I../drivers/common/dpaax -Ilib/librte_eventdev -I../lib/librte_eventdev -Ilib/librte_ethdev -I../lib/librte_ethdev -Ilib/librte_net -I../lib/librte_net -Ilib/librte_mbuf -I../lib/librte_mbuf -Ilib/librte_meter -I../lib/librte_meter -Ilib/librte_hash -I../lib/librte_hash -Ilib/librte_timer -I../lib/librte_timer -Ilib/librte_cryptodev -I../lib/librte_cryptodev -Idrivers/bus/vdev -I../drivers/bus/vdev -fdiagnostics-color=always -pipe -D_FILE_OFFSET_BITS=64 -Wall -Winvalid-pch -Werror -O3 -include rte_config.h -Wunused-parameter -Wsign-compare -Wcast-qual -Wno-pointer-to-int-cast -D_GNU_SOURCE -fPIC -march=native -DALLOW_EXPERIMENTAL_API -MD -MQ 'drivers/a715181@@tmp_rte_rawdev_dpaa2_cmdif@sta/raw_dpaa2_cmdif_dpaa2_cmdif.c.o' -MF 'drivers/a715181@@tmp_rte_rawdev_dpaa2_cmdif@sta/raw_dpaa2_cmdif_dpaa2_cmdif.c.o.d' -o 'drivers/a715181@@tmp_rte_rawdev_dpaa2_cmdif@sta/raw_dpaa2_cmdif_dpaa2_cmdif.c.o' -c ../drivers/raw/dpaa2_cmdif/dpaa2_cmdif.c
../drivers/raw/dpaa2_cmdif/dpaa2_cmdif.c: In function ‘dpaa2_cmdif_enqueue_bufs’:
../drivers/raw/dpaa2_cmdif/dpaa2_cmdif.c:105:45: error: ‘DPAA2_MAX_TX_RETRY_COUNT’ undeclared (first use in this function)
  } while ((ret == -EBUSY) && (retry_count < DPAA2_MAX_TX_RETRY_COUNT));
                                             ^
../drivers/raw/dpaa2_cmdif/dpaa2_cmdif.c:105:45: note: each undeclared identifier is reported only once for each function it appears in
[1264/1698] Linking static target drivers/libtmp_rte_pmd_bbdev_turbo_sw.a.
[1265/1698] Generating rte_pmd_octeontx_event.pmd.c with a custom command.
[1266/1698] Compiling C object 'drivers/a715181@@tmp_rte_pmd_bbdev_fpga_lte_fec@sta/baseband_fpga_lte_fec_fpga_lte_fec.c.o'.
[1267/1698] Compiling C object 'drivers/a715181@@tmp_rte_rawdev_dpaa2_qdma@sta/raw_dpaa2_qdma_dpaa2_qdma.c.o'.
[1268/1698] Compiling C object 'drivers/a715181@@tmp_rte_pmd_octeontx2_event@sta/event_octeontx2_otx2_worker_dual.c.o'.
ninja: build stopped: subcommand failed




*Meson Build Failed #3:
OS: FC30-64
Target:build-gcc-static
FAILED: drivers/a715181@@tmp_rte_rawdev_dpaa2_cmdif@sta/raw_dpaa2_cmdif_dpaa2_cmdif.c.o 
gcc -Idrivers/a715181@@tmp_rte_rawdev_dpaa2_cmdif@sta -Idrivers -I../drivers -Idrivers/raw/dpaa2_cmdif -I../drivers/raw/dpaa2_cmdif -Ilib/librte_rawdev -I../lib/librte_rawdev -I. -I../ -Iconfig -I../config -Ilib/librte_eal/common/include -I../lib/librte_eal/common/include -I../lib/librte_eal/linux/eal/include -Ilib/librte_eal/common -I../lib/librte_eal/common -Ilib/librte_eal/common/include/arch/x86 -I../lib/librte_eal/common/include/arch/x86 -Ilib/librte_eal -I../lib/librte_eal -Ilib/librte_kvargs -I../lib/librte_kvargs -Idrivers/mempool/dpaa2 -I../drivers/mempool/dpaa2 -Ilib/librte_mempool -I../lib/librte_mempool -Ilib/librte_ring -I../lib/librte_ring -Idrivers/bus/fslmc -I../drivers/bus/fslmc -I../drivers/bus/fslmc/mc -I../drivers/bus/fslmc/qbman/include -I../drivers/bus/fslmc/portal -Idrivers/common/dpaax -I../drivers/common/dpaax -Ilib/librte_eventdev -I../lib/librte_eventdev -Ilib/librte_ethdev -I../lib/librte_ethdev -Ilib/librte_net -I../lib/librte_net -Ilib/librte_mbuf -I../lib/librte_mbuf -Ilib/librte_meter -I../lib/librte_meter -Ilib/librte_hash -I../lib/librte_hash -Ilib/librte_timer -I../lib/librte_timer -Ilib/librte_cryptodev -I../lib/librte_cryptodev -Idrivers/bus/vdev -I../drivers/bus/vdev -fdiagnostics-color=always -pipe -D_FILE_OFFSET_BITS=64 -Wall -Winvalid-pch -Werror -O3 -include rte_config.h -Wunused-parameter -Wsign-compare -Wcast-qual -Wno-address-of-packed-member -D_GNU_SOURCE -fPIC -march=native -mno-avx512f -Wno-format-truncation -DALLOW_EXPERIMENTAL_API -MD -MQ 'drivers/a715181@@tmp_rte_rawdev_dpaa2_cmdif@sta/raw_dpaa2_cmdif_dpaa2_cmdif.c.o' -MF 'drivers/a715181@@tmp_rte_rawdev_dpaa2_cmdif@sta/raw_dpaa2_cmdif_dpaa2_cmdif.c.o.d' -o 'drivers/a715181@@tmp_rte_rawdev_dpaa2_cmdif@sta/raw_dpaa2_cmdif_dpaa2_cmdif.c.o' -c ../drivers/raw/dpaa2_cmdif/dpaa2_cmdif.c
../drivers/raw/dpaa2_cmdif/dpaa2_cmdif.c: In function ‘dpaa2_cmdif_enqueue_bufs’:
../drivers/raw/dpaa2_cmdif/dpaa2_cmdif.c:105:45: error: ‘DPAA2_MAX_TX_RETRY_COUNT’ undeclared (first use in this function)
  105 |  } while ((ret == -EBUSY) && (retry_count < DPAA2_MAX_TX_RETRY_COUNT));
      |                                             ^~~~~~~~~~~~~~~~~~~~~~~~
../drivers/raw/dpaa2_cmdif/dpaa2_cmdif.c:105:45: note: each undeclared identifier is reported only once for each function it appears in
[1403/1845] Compiling C object 'drivers/a715181@@tmp_rte_pmd_bbdev_null@sta/baseband_null_bbdev_null.c.o'.
[1404/1845] Compiling C object 'drivers/a715181@@tmp_rte_pmd_bbdev_turbo_sw@sta/baseband_turbo_sw_bbdev_turbo_software.c.o'.
[1405/1845] Compiling C object 'drivers/a715181@@tmp_rte_pmd_octeontx_event@sta/event_octeontx_ssovf_evdev_selftest.c.o'.
[1406/1845] Compiling C object 'drivers/a715181@@tmp_rte_pmd_bbdev_fpga_lte_fec@sta/baseband_fpga_lte_fec_fpga_lte_fec.c.o'.
[1407/1845] Compiling C object 'drivers/a715181@@tmp_rte_rawdev_dpaa2_qdma@sta/raw_dpaa2_qdma_dpaa2_qdma.c.o'.
[1408/1845] Compiling C object 'drivers/a715181@@tmp_rte_pmd_octeontx2_event@sta/event_octeontx2_otx2_worker.c.o'.
[1409/1845] Compiling C object 'drivers/a715181@@tmp_rte_pmd_octeontx2_event@sta/event_octeontx2_otx2_worker_dual.c.o'.
ninja: build stopped: subcommand failed




*Meson Build Failed #4:
OS: UB1804-64
Target:build-gcc-static
FAILED: drivers/a715181@@tmp_rte_rawdev_dpaa2_cmdif@sta/raw_dpaa2_cmdif_dpaa2_cmdif.c.o 
gcc -Idrivers/a715181@@tmp_rte_rawdev_dpaa2_cmdif@sta -Idrivers -I../drivers -Idrivers/raw/dpaa2_cmdif -I../drivers/raw/dpaa2_cmdif -Ilib/librte_rawdev -I../lib/librte_rawdev -I. -I../ -Iconfig -I../config -Ilib/librte_eal/common/include -I../lib/librte_eal/common/include -I../lib/librte_eal/linux/eal/include -Ilib/librte_eal/common -I../lib/librte_eal/common -Ilib/librte_eal/common/include/arch/x86 -I../lib/librte_eal/common/include/arch/x86 -Ilib/librte_eal -I../lib/librte_eal -Ilib/librte_kvargs -I../lib/librte_kvargs -Idrivers/mempool/dpaa2 -I../drivers/mempool/dpaa2 -Ilib/librte_mempool -I../lib/librte_mempool -Ilib/librte_ring -I../lib/librte_ring -Idrivers/bus/fslmc -I../drivers/bus/fslmc -I../drivers/bus/fslmc/mc -I../drivers/bus/fslmc/qbman/include -I../drivers/bus/fslmc/portal -Idrivers/common/dpaax -I../drivers/common/dpaax -Ilib/librte_eventdev -I../lib/librte_eventdev -Ilib/librte_ethdev -I../lib/librte_ethdev -Ilib/librte_net -I../lib/librte_net -Ilib/librte_mbuf -I../lib/librte_mbuf -Ilib/librte_meter -I../lib/librte_meter -Ilib/librte_hash -I../lib/librte_hash -Ilib/librte_timer -I../lib/librte_timer -Ilib/librte_cryptodev -I../lib/librte_cryptodev -Idrivers/bus/vdev -I../drivers/bus/vdev -fdiagnostics-color=always -pipe -D_FILE_OFFSET_BITS=64 -Wall -Winvalid-pch -Werror -O3 -include rte_config.h -Wunused-parameter -Wsign-compare -Wcast-qual -D_GNU_SOURCE -fPIC -march=native -mno-avx512f -Wno-format-truncation -DALLOW_EXPERIMENTAL_API -MD -MQ 'drivers/a715181@@tmp_rte_rawdev_dpaa2_cmdif@sta/raw_dpaa2_cmdif_dpaa2_cmdif.c.o' -MF 'drivers/a715181@@tmp_rte_rawdev_dpaa2_cmdif@sta/raw_dpaa2_cmdif_dpaa2_cmdif.c.o.d' -o 'drivers/a715181@@tmp_rte_rawdev_dpaa2_cmdif@sta/raw_dpaa2_cmdif_dpaa2_cmdif.c.o' -c ../drivers/raw/dpaa2_cmdif/dpaa2_cmdif.c
../drivers/raw/dpaa2_cmdif/dpaa2_cmdif.c: In function ‘dpaa2_cmdif_enqueue_bufs’:
../drivers/raw/dpaa2_cmdif/dpaa2_cmdif.c:105:45: error: ‘DPAA2_MAX_TX_RETRY_COUNT’ undeclared (first use in this function)
  } while ((ret == -EBUSY) && (retry_count < DPAA2_MAX_TX_RETRY_COUNT));
                                             ^~~~~~~~~~~~~~~~~~~~~~~~
../drivers/raw/dpaa2_cmdif/dpaa2_cmdif.c:105:45: note: each undeclared identifier is reported only once for each function it appears in
[1431/1852] Compiling C object 'drivers/a715181@@tmp_rte_pmd_bbdev_fpga_lte_fec@sta/baseband_fpga_lte_fec_fpga_lte_fec.c.o'.
[1432/1852] Compiling C object 'drivers/raw/ifpga/base/422485f@@ifpga_rawdev_base@sta/ifpga_enumerate.c.o'.
[1433/1852] Compiling C object 'drivers/a715181@@tmp_rte_rawdev_dpaa2_qdma@sta/raw_dpaa2_qdma_dpaa2_qdma.c.o'.
[1434/1852] Compiling C object 'drivers/a715181@@tmp_rte_pmd_octeontx2_event@sta/event_octeontx2_otx2_worker.c.o'.
[1435/1852] Compiling C object 'drivers/a715181@@tmp_rte_pmd_octeontx2_event@sta/event_octeontx2_otx2_worker_dual.c.o'.
ninja: build stopped: subcommand failed



DPDK STV team

^ permalink raw reply	[flat|nested] only message in thread

only message in thread, other threads:[~2019-10-17 16:43 UTC | newest]

Thread overview: (only message) (download: mbox.gz / follow: Atom feed)
-- links below jump to the message on this page --
2019-10-17 16:43 [dpdk-test-report] |FAILURE| pw61390[6/9, v2] raw/dpaa2_cmdif: add retry and timeout in packet enqueue API sys_stv

automatic DPDK test reports

This inbox may be cloned and mirrored by anyone:

	git clone --mirror https://inbox.dpdk.org/test-report/0 test-report/git/0.git

	# If you have public-inbox 1.1+ installed, you may
	# initialize and index your mirror using the following commands:
	public-inbox-init -V2 test-report test-report/ https://inbox.dpdk.org/test-report \
		test-report@dpdk.org
	public-inbox-index test-report

Example config snippet for mirrors.
Newsgroup available over NNTP:
	nntp://inbox.dpdk.org/inbox.dpdk.test-report


AGPL code for this site: git clone https://public-inbox.org/public-inbox.git