automatic DPDK test reports
 help / color / mirror / Atom feed
* [dpdk-test-report]  |FAILURE| pw61415[v4, 05/15] net/mlx5: prepare txq to work with different types
@ 2019-10-17 19:09 sys_stv
  0 siblings, 0 replies; only message in thread
From: sys_stv @ 2019-10-17 19:09 UTC (permalink / raw)
  To: test-report

[-- Attachment #1: Type: text/plain, Size: 68314 bytes --]

Test-Label: Intel-compilation
Test-Status: FAILURE
http://dpdk.org/patch/61415

_Compilation issues_

Submitter: Ori Kam <orika@mellanox.com>
Date: 2019-10-17 15:32:07
Reply_mail: 1571326337-42692-6-git-send-email-orika@mellanox.com
DPDK git baseline: Repo:dpdk-next-net, CommitID: 9accd4e54aa9e3b405e8243511aadd69c1c0b94d

Makefile build Summary: 22 Builds Done, 0 Successful, 22 Failures

Meson build Summary: 7 Builds Done, 2 Successful, 5 Failures

               +==============================================+===========+==========+
               |                   Makefile                   |   Meson   | Document |
+--------------+------+-------+------+------------+-----------+-----------+----------+
| os           | gcc  | clang | icc  | gcc+shared | gcc+debug | gcc/clang | pdf/html |
+--------------+------+-------+------+------------+-----------+-----------+----------+
| RHEL76-64    | FAIL |       |      |            |           |           |          |
| CENTOS76-64  | FAIL | FAIL  | FAIL | FAIL       | FAIL      |           |          |
| UB1804-64    | FAIL | FAIL  | FAIL |            |           | FAIL      | pass     |
| UB1604-32    | FAIL |       |      |            |           | FAIL      |          |
| UB1904-64    | FAIL |       |      |            |           |           |          |
| UB1604-64    | FAIL | FAIL  |      |            |           |           |          |
| FC30-64      | FAIL | FAIL  |      |            |           | FAIL      |          |
| WIN10-64     |      |       |      |            |           | pass      |          |
| FreeBSD12-64 | FAIL | FAIL  |      | FAIL       | FAIL      | FAIL      |          |
| RHEL80-64    | FAIL |       |      |            |           |           |          |
| SUSE15-64    | FAIL | FAIL  |      |            |           | FAIL      |          |
+--------------+------+-------+------+------------+-----------+-----------+----------+

Test environment and configuration as below:

** Makefile build **


OS: RHEL76-64
	Kernel Version: 3.10.0-957.el7.x86_64
	CPU info: Intel(R) Xeon(R) CPU E5-2699 v4 @ 2.20GHz
	GCC Version: gcc (GCC) 4.8.5 20150623 (Red Hat 4.8.5-36)
	Clang Version: NA
	x86_64-native-linuxapp-gcc


OS: CENTOS76-64
	Kernel Version: 3.10.0-957.27.2.el7.x86_64
	CPU info: Intel(R) Xeon(R) CPU E5-2699 v4 @ 2.20GHz
	GCC Version: gcc (GCC) 4.8.5 20150623 (Red Hat 4.8.5-36)
	Clang Version: 3.4.2 (tags/RELEASE_34/dot2-final)
	x86_64-native-linuxapp-clang
	x86_64-native-linuxapp-gcc
	x86_64-native-linuxapp-gcc+debug
	x86_64-native-linuxapp-gcc+shared
	x86_64-native-linuxapp-icc


OS: UB1804-64
	Kernel Version: 4.15.0-20-generic
	CPU info: Intel(R) Xeon(R) CPU E5-2699 v3 @ 2.30GHz
	GCC Version: gcc (Ubuntu 7.3.0-16ubuntu3) 7.3.0
	Clang Version: 6.0.0-1ubuntu2 (tags/RELEASE_600/final)
	x86_64-native-linuxapp-clang
	x86_64-native-linuxapp-icc
	x86_64-native-linuxapp-gcc


OS: UB1904-64
	Kernel Version: 5.0.0-13-generic
	CPU info: Intel(R) Xeon(R) CPU E5-2699 v3 @ 2.30GHz
	GCC Version: gcc (Ubuntu 8.3.0-6ubuntu1) 8.3.0
	Clang Version: 8.0.0-3 (tags/RELEASE_800/final)
	x86_64-native-linuxapp-gcc


OS: UB1604-32
	Kernel Version: 4.4.0-131-generic
	CPU info: Intel(R) Xeon(R) CPU E5-2699 v3 @ 2.30GHz
	GCC Version: gcc (Ubuntu 5.4.0-6ubuntu1~16.04.11) 5.4.0 20160609
	Clang Version: 3.8.0-2ubuntu4 (tags/RELEASE_380/final)
	i686-native-linuxapp-gcc


OS: UB1604-64
	Kernel Version: 4.4.0-47-generic
	CPU info: Intel(R) Xeon(R) CPU E5-2699 v3 @ 2.30GHz
	GCC Version: gcc (Ubuntu 5.4.0-6ubuntu1~16.04.10) 5.4.0 20160609
	Clang Version: 3.8.0-2ubuntu4 (tags/RELEASE_380/final)
	x86_64-native-linuxapp-clang
	x86_64-native-linuxapp-gcc


OS: FC30-64
	Kernel Version: 5.1.7-300.fc30.x86_64
	CPU info: Intel(R) Xeon(R) CPU E5-2699 v4 @ 2.20GHz
	GCC Version: gcc (GCC) 9.1.1 20190503 (Red Hat 9.1.1-1)
	Clang Version: 8.0.0 (Fedora 8.0.0-1.fc30)
	x86_64-native-linuxapp-gcc
	x86_64-native-linuxapp-clang


OS: FreeBSD12-64
	Kernel Version: 12.0-RC3
	CPU info: Intel(R) Xeon(R) CPU E5-2699 v4 @ 2.20GHz (2194.98-MHz K8-class CPU)
	GCC Version: gcc (FreeBSD Ports Collection) 7.3.0
	Clang Version: 6.0.1 (tags/RELEASE_601/final 335540) (based on LLVM 6.0.1)
	x86_64-native-bsdapp-gcc+debug
	x86_64-native-bsdapp-gcc+shared
	x86_64-native-bsdapp-clang
	x86_64-native-bsdapp-gcc


OS: RHEL80-64
	Kernel Version: 4.18.0-80.el8.x86_64
	CPU info: Intel(R) Xeon(R) CPU E5-2699 v4 @ 2.20GHz
	GCC Version: gcc (GCC) 8.2.1 20180905 (Red Hat 8.2.1-3)
	Clang Version: 6.0.1 (tags/RELEASE_601/final)
	x86_64-native-linuxapp-gcc


OS: SUSE15-64
	Kernel Version: 4.12.14-lp150.11-default
	CPU info: Intel(R) Xeon(R) CPU E5-2699 v4 @ 2.20GHz
	GCC Version: gcc (SUSE Linux) 7.3.1 20180323 [gcc-7-branch revision 258812]
	Clang Version: 5.0.1 (tags/RELEASE_501/final 312548)
	x86_64-native-linuxapp-gcc
	x86_64-native-linuxapp-clang


** Meson build **


OS: UB1804-64
	Kernel Version: 4.15.0-20-generic
	CPU info: Intel(R) Xeon(R) CPU E5-2699 v4 @ 2.20GHz
	GCC Version: gcc (Ubuntu 7.3.0-27ubuntu1~18.04) 7.3.0
	Clang Version: 6.0.0-1ubuntu2 (tags/RELEASE_600/final)
	x86_64-native-linuxapp-doc
	build-gcc-static
	build-gcc-shared
	build-clang-static
	build-clang-shared
	build-x86-default


OS: UB1604-32
	Kernel Version: 4.4.0-131-generic
	CPU info: Intel(R) Xeon(R) CPU E5-2699 v4 @ 2.20GHz
	GCC Version: gcc (Ubuntu 5.4.0-6ubuntu1~16.04.11) 5.4.0 20160609
	Clang Version: 3.8.0-2ubuntu4 (tags/RELEASE_380/final)
	build-gcc-static
	build-gcc-shared
	build-clang-static
	build-clang-shared
	build-x86-default


OS: FC30-64
	Kernel Version: 5.0.9-301.fc30.x86_64
	CPU info: Intel(R) Xeon(R) CPU E5-2699 v4 @ 2.20GHz
	GCC Version: gcc (GCC) 9.1.1 20190503 (Red Hat 9.1.1-1)
	Clang Version: 8.0.0 (Fedora 8.0.0-1.fc30)
	build-gcc-static
	build-gcc-shared
	build-clang-static
	build-clang-shared
	build-x86-default


OS: WIN10-64
	Kernel Version: N/A
	CPU info: N/A
	GCC Version: N/A
	Clang Version: Clang 8.0.0
	x86_64-windows-clang


OS: FreeBSD12-64
	Kernel Version: 12.0-RC3
	CPU info: Intel(R) Xeon(R) CPU E5-2699 v4 @ 2.20GHz (2194.97-MHz K8-class CPU)
	GCC Version: gcc (FreeBSD Ports Collection) 7.3.0
	Clang Version: 6.0.1 (tags/RELEASE_601/final 335540) (based on LLVM 6.0.1)
	build-gcc-static
	build-gcc-shared
	build-clang-static
	build-clang-shared
	build-x86-default


OS: SUSE15-64
	Kernel Version: 4.12.14-lp150.11-default
	CPU info: Intel(R) Xeon(R) CPU E5-2699 v4 @ 2.20GHz
	GCC Version: gcc (SUSE Linux) 7.3.1 20180323 [gcc-7-branch revision 258812]
	Clang Version: 5.0.1 (tags/RELEASE_501/final 312548)
	build-gcc-static
	build-gcc-shared
	build-clang-static
	build-clang-shared
	build-x86-default


*Make Build Failed #1:
OS: UB1604-64
Target: x86_64-native-linuxapp-clang
                                       ^
/tmp/UB1604-64_K4.4.0_Clang3.8.0/x86_64-native-linuxapp-clang/9a878ab9c54e49d3baf3bb2bfa072c88/dpdk/app/test-pmd/testpmd.c:2281:12: warning: implicit declaration of function 'rte_eth_rx_hairpin_queue_setup' is invalid in C99 [-Wimplicit-function-declaration]
                                diag = rte_eth_rx_hairpin_queue_setup
                                       ^
3 warnings and 3 errors generated.
/tmp/UB1604-64_K4.4.0_Clang3.8.0/x86_64-native-linuxapp-clang/9a878ab9c54e49d3baf3bb2bfa072c88/dpdk/mk/internal/rte.compile-pre.mk:114: recipe for target 'testpmd.o' failed
make[5]: *** [testpmd.o] Error 1
/tmp/UB1604-64_K4.4.0_Clang3.8.0/x86_64-native-linuxapp-clang/9a878ab9c54e49d3baf3bb2bfa072c88/dpdk/mk/rte.subdir.mk:35: recipe for target 'test-pmd' failed
make[4]: *** [test-pmd] Error 2
make[4]: *** Waiting for unfinished jobs....
  CC test_bbdev_perf.o
  CC config.o
  LD testacl
  LD dpdk-pdump
--
  CC test_ipsec.o
  MKRES test_resource_c.res.o
  LD test
  INSTALL-APP test
  INSTALL-MAP test.map
/tmp/UB1604-64_K4.4.0_Clang3.8.0/x86_64-native-linuxapp-clang/9a878ab9c54e49d3baf3bb2bfa072c88/dpdk/mk/rte.sdkbuild.mk:46: recipe for target 'app' failed
make[3]: *** [app] Error 2
/tmp/UB1604-64_K4.4.0_Clang3.8.0/x86_64-native-linuxapp-clang/9a878ab9c54e49d3baf3bb2bfa072c88/dpdk/mk/rte.sdkroot.mk:98: recipe for target 'all' failed
make[2]: *** [all] Error 2
/tmp/UB1604-64_K4.4.0_Clang3.8.0/x86_64-native-linuxapp-clang/9a878ab9c54e49d3baf3bb2bfa072c88/dpdk/mk/rte.sdkinstall.mk:60: recipe for target 'pre_install' failed
make[1]: *** [pre_install] Error 2
/tmp/UB1604-64_K4.4.0_Clang3.8.0/x86_64-native-linuxapp-clang/9a878ab9c54e49d3baf3bb2bfa072c88/dpdk/mk/rte.sdkroot.mk:77: recipe for target 'install' failed
make: *** [install] Error 2


*Make Build Failed #2:
OS: UB1604-32
Target: i686-native-linuxapp-gcc
/tmp/UB1604-32_K4.4.0_GCC5.4.0/i686-native-linuxapp-gcc/9a878ab9c54e49d3baf3bb2bfa072c88/dpdk/app/test-pmd/testpmd.c:2115:30: warning: unused variable ‘hairpin_conf’ [-Wunused-variable]
  struct rte_eth_hairpin_conf hairpin_conf = {
                              ^
/tmp/UB1604-32_K4.4.0_GCC5.4.0/i686-native-linuxapp-gcc/9a878ab9c54e49d3baf3bb2bfa072c88/dpdk/app/test-pmd/testpmd.c: At top level:
cc1: warning: unrecognized command line option ‘-Wno-address-of-packed-member’
/tmp/UB1604-32_K4.4.0_GCC5.4.0/i686-native-linuxapp-gcc/9a878ab9c54e49d3baf3bb2bfa072c88/dpdk/mk/internal/rte.compile-pre.mk:114: recipe for target 'testpmd.o' failed
make[5]: *** [testpmd.o] Error 1
/tmp/UB1604-32_K4.4.0_GCC5.4.0/i686-native-linuxapp-gcc/9a878ab9c54e49d3baf3bb2bfa072c88/dpdk/mk/rte.subdir.mk:35: recipe for target 'test-pmd' failed
make[4]: *** [test-pmd] Error 2
make[4]: *** Waiting for unfinished jobs....
  CC test.o
  CC config.o
  LD testacl
  CC resource.o
--
  CC test_ipsec.o
  MKRES test_resource_c.res.o
  LD test
  INSTALL-MAP test.map
  INSTALL-APP test
/tmp/UB1604-32_K4.4.0_GCC5.4.0/i686-native-linuxapp-gcc/9a878ab9c54e49d3baf3bb2bfa072c88/dpdk/mk/rte.sdkbuild.mk:46: recipe for target 'app' failed
make[3]: *** [app] Error 2
/tmp/UB1604-32_K4.4.0_GCC5.4.0/i686-native-linuxapp-gcc/9a878ab9c54e49d3baf3bb2bfa072c88/dpdk/mk/rte.sdkroot.mk:98: recipe for target 'all' failed
make[2]: *** [all] Error 2
/tmp/UB1604-32_K4.4.0_GCC5.4.0/i686-native-linuxapp-gcc/9a878ab9c54e49d3baf3bb2bfa072c88/dpdk/mk/rte.sdkinstall.mk:60: recipe for target 'pre_install' failed
make[1]: *** [pre_install] Error 2
/tmp/UB1604-32_K4.4.0_GCC5.4.0/i686-native-linuxapp-gcc/9a878ab9c54e49d3baf3bb2bfa072c88/dpdk/mk/rte.sdkroot.mk:77: recipe for target 'install' failed
make: *** [install] Error 2


*Make Build Failed #3:
OS: UB1904-64
Target: x86_64-native-linuxapp-gcc
/tmp/UB1904-64_K4.18.0_GCC8.3.0/x86_64-native-linuxapp-gcc/9a878ab9c54e49d3baf3bb2bfa072c88/dpdk/app/test-pmd/testpmd.c:2115:30: warning: unused variable ‘hairpin_conf’ [-Wunused-variable]
  struct rte_eth_hairpin_conf hairpin_conf = {
                              ^~~~~~~~~~~~
/tmp/UB1904-64_K4.18.0_GCC8.3.0/x86_64-native-linuxapp-gcc/9a878ab9c54e49d3baf3bb2bfa072c88/dpdk/app/test-pmd/testpmd.c: At top level:
cc1: warning: unrecognized command line option ‘-Wno-address-of-packed-member’
make[5]: *** [/tmp/UB1904-64_K4.18.0_GCC8.3.0/x86_64-native-linuxapp-gcc/9a878ab9c54e49d3baf3bb2bfa072c88/dpdk/mk/internal/rte.compile-pre.mk:116: testpmd.o] Error 1
make[4]: *** [/tmp/UB1904-64_K4.18.0_GCC8.3.0/x86_64-native-linuxapp-gcc/9a878ab9c54e49d3baf3bb2bfa072c88/dpdk/mk/rte.subdir.mk:35: test-pmd] Error 2
make[4]: *** Waiting for unfinished jobs....
  CC test_bbdev_perf.o
  CC config.o
  CC comp_perf_options_parse.o
  CC test.o
--
  CC test_ipsec.o
  MKRES test_resource_c.res.o
  LD test
  INSTALL-APP test
  INSTALL-MAP test.map
make[3]: *** [/tmp/UB1904-64_K4.18.0_GCC8.3.0/x86_64-native-linuxapp-gcc/9a878ab9c54e49d3baf3bb2bfa072c88/dpdk/mk/rte.sdkbuild.mk:48: app] Error 2
make[2]: *** [/tmp/UB1904-64_K4.18.0_GCC8.3.0/x86_64-native-linuxapp-gcc/9a878ab9c54e49d3baf3bb2bfa072c88/dpdk/mk/rte.sdkroot.mk:99: all] Error 2
make[1]: *** [/tmp/UB1904-64_K4.18.0_GCC8.3.0/x86_64-native-linuxapp-gcc/9a878ab9c54e49d3baf3bb2bfa072c88/dpdk/mk/rte.sdkinstall.mk:61: pre_install] Error 2
make: *** [/tmp/UB1904-64_K4.18.0_GCC8.3.0/x86_64-native-linuxapp-gcc/9a878ab9c54e49d3baf3bb2bfa072c88/dpdk/mk/rte.sdkroot.mk:77: install] Error 2


*Make Build Failed #4:
OS: UB1804-64
Target: x86_64-native-linuxapp-clang
/tmp/UB1804-64_K4.15.0_Clang6.0.0/x86_64-native-linuxapp-clang/9a878ab9c54e49d3baf3bb2bfa072c88/dpdk/app/test-pmd/testpmd.c:2281:12: warning: implicit declaration of function 'rte_eth_rx_hairpin_queue_setup' is invalid in C99 [-Wimplicit-function-declaration]
                                diag = rte_eth_rx_hairpin_queue_setup
                                       ^
/tmp/UB1804-64_K4.15.0_Clang6.0.0/x86_64-native-linuxapp-clang/9a878ab9c54e49d3baf3bb2bfa072c88/dpdk/app/test-pmd/testpmd.c:2281:12: warning: this function declaration is not a prototype [-Wstrict-prototypes]
7 warnings and 3 errors generated.
/tmp/UB1804-64_K4.15.0_Clang6.0.0/x86_64-native-linuxapp-clang/9a878ab9c54e49d3baf3bb2bfa072c88/dpdk/mk/internal/rte.compile-pre.mk:114: recipe for target 'testpmd.o' failed
make[5]: *** [testpmd.o] Error 1
/tmp/UB1804-64_K4.15.0_Clang6.0.0/x86_64-native-linuxapp-clang/9a878ab9c54e49d3baf3bb2bfa072c88/dpdk/mk/rte.subdir.mk:35: recipe for target 'test-pmd' failed
make[4]: *** [test-pmd] Error 2
make[4]: *** Waiting for unfinished jobs....
  CC test.o
  LD cmdline_test
  CC test_bbdev.o
  LD testacl
--
  CC test_ipsec.o
  MKRES test_resource_c.res.o
  LD test
  INSTALL-APP test
  INSTALL-MAP test.map
/tmp/UB1804-64_K4.15.0_Clang6.0.0/x86_64-native-linuxapp-clang/9a878ab9c54e49d3baf3bb2bfa072c88/dpdk/mk/rte.sdkbuild.mk:46: recipe for target 'app' failed
make[3]: *** [app] Error 2
/tmp/UB1804-64_K4.15.0_Clang6.0.0/x86_64-native-linuxapp-clang/9a878ab9c54e49d3baf3bb2bfa072c88/dpdk/mk/rte.sdkroot.mk:98: recipe for target 'all' failed
make[2]: *** [all] Error 2
/tmp/UB1804-64_K4.15.0_Clang6.0.0/x86_64-native-linuxapp-clang/9a878ab9c54e49d3baf3bb2bfa072c88/dpdk/mk/rte.sdkinstall.mk:60: recipe for target 'pre_install' failed
make[1]: *** [pre_install] Error 2
/tmp/UB1804-64_K4.15.0_Clang6.0.0/x86_64-native-linuxapp-clang/9a878ab9c54e49d3baf3bb2bfa072c88/dpdk/mk/rte.sdkroot.mk:77: recipe for target 'install' failed
make: *** [install] Error 2


*Make Build Failed #5:
OS: UB1804-64
Target: x86_64-native-linuxapp-icc
/tmp/UB1804-64_K4.15.0_ICC19.0.0/x86_64-native-linuxapp-icc/9a878ab9c54e49d3baf3bb2bfa072c88/dpdk/app/test-pmd/testpmd.c(2281): warning #266: function "rte_eth_rx_hairpin_queue_setup" declared implicitly
  				diag = rte_eth_rx_hairpin_queue_setup
  				       ^

compilation aborted for /tmp/UB1804-64_K4.15.0_ICC19.0.0/x86_64-native-linuxapp-icc/9a878ab9c54e49d3baf3bb2bfa072c88/dpdk/app/test-pmd/testpmd.c (code 2)
/tmp/UB1804-64_K4.15.0_ICC19.0.0/x86_64-native-linuxapp-icc/9a878ab9c54e49d3baf3bb2bfa072c88/dpdk/mk/internal/rte.compile-pre.mk:114: recipe for target 'testpmd.o' failed
make[5]: *** [testpmd.o] Error 2
/tmp/UB1804-64_K4.15.0_ICC19.0.0/x86_64-native-linuxapp-icc/9a878ab9c54e49d3baf3bb2bfa072c88/dpdk/mk/rte.subdir.mk:35: recipe for target 'test-pmd' failed
make[4]: *** [test-pmd] Error 2
make[4]: *** Waiting for unfinished jobs....
  CC test.o
  CC main.o
  CC commands.o
  CC test_bbdev.o
--
  CC test_ipsec.o
  MKRES test_resource_c.res.o
  LD test
  INSTALL-MAP test.map
  INSTALL-APP test
/tmp/UB1804-64_K4.15.0_ICC19.0.0/x86_64-native-linuxapp-icc/9a878ab9c54e49d3baf3bb2bfa072c88/dpdk/mk/rte.sdkbuild.mk:46: recipe for target 'app' failed
make[3]: *** [app] Error 2
/tmp/UB1804-64_K4.15.0_ICC19.0.0/x86_64-native-linuxapp-icc/9a878ab9c54e49d3baf3bb2bfa072c88/dpdk/mk/rte.sdkroot.mk:98: recipe for target 'all' failed
make[2]: *** [all] Error 2
/tmp/UB1804-64_K4.15.0_ICC19.0.0/x86_64-native-linuxapp-icc/9a878ab9c54e49d3baf3bb2bfa072c88/dpdk/mk/rte.sdkinstall.mk:60: recipe for target 'pre_install' failed
make[1]: *** [pre_install] Error 2
/tmp/UB1804-64_K4.15.0_ICC19.0.0/x86_64-native-linuxapp-icc/9a878ab9c54e49d3baf3bb2bfa072c88/dpdk/mk/rte.sdkroot.mk:77: recipe for target 'install' failed
make: *** [install] Error 2


*Make Build Failed #6:
OS: FC30-64
Target: x86_64-native-linuxapp-gcc
      |                             ^~~
/tmp/FC30-64_K4.20_GCC9.1.1/x86_64-native-linuxapp-gcc/9a878ab9c54e49d3baf3bb2bfa072c88/dpdk/app/test-pmd/testpmd.c:2115:30: warning: unused variable ‘hairpin_conf’ [-Wunused-variable]
 2115 |  struct rte_eth_hairpin_conf hairpin_conf = {
      |                              ^~~~~~~~~~~~
  LD dpdk-pdump
make[5]: *** [/tmp/FC30-64_K4.20_GCC9.1.1/x86_64-native-linuxapp-gcc/9a878ab9c54e49d3baf3bb2bfa072c88/dpdk/mk/internal/rte.compile-pre.mk:116: testpmd.o] Error 1
make[4]: *** [/tmp/FC30-64_K4.20_GCC9.1.1/x86_64-native-linuxapp-gcc/9a878ab9c54e49d3baf3bb2bfa072c88/dpdk/mk/rte.subdir.mk:37: test-pmd] Error 2
make[4]: *** Waiting for unfinished jobs....
  CC test.o
  CC comp_perf_options_parse.o
  CC comp_perf_test_verify.o
  CC resource.o
--
  CC test_ipsec.o
  MKRES test_resource_c.res.o
  LD test
  INSTALL-APP test
  INSTALL-MAP test.map
make[3]: *** [/tmp/FC30-64_K4.20_GCC9.1.1/x86_64-native-linuxapp-gcc/9a878ab9c54e49d3baf3bb2bfa072c88/dpdk/mk/rte.sdkbuild.mk:48: app] Error 2
make[2]: *** [/tmp/FC30-64_K4.20_GCC9.1.1/x86_64-native-linuxapp-gcc/9a878ab9c54e49d3baf3bb2bfa072c88/dpdk/mk/rte.sdkroot.mk:99: all] Error 2
make[1]: *** [/tmp/FC30-64_K4.20_GCC9.1.1/x86_64-native-linuxapp-gcc/9a878ab9c54e49d3baf3bb2bfa072c88/dpdk/mk/rte.sdkinstall.mk:61: pre_install] Error 2
make: *** [/tmp/FC30-64_K4.20_GCC9.1.1/x86_64-native-linuxapp-gcc/9a878ab9c54e49d3baf3bb2bfa072c88/dpdk/mk/rte.sdkroot.mk:77: install] Error 2


*Make Build Failed #7:
OS: SUSE15-64
Target: x86_64-native-linuxapp-gcc
/tmp/SUSE15-64_K4.12.14_GCC7.3.1/x86_64-native-linuxapp-gcc/9a878ab9c54e49d3baf3bb2bfa072c88/dpdk/app/test-pmd/testpmd.c:2115:30: warning: unused variable ‘hairpin_conf’ [-Wunused-variable]
  struct rte_eth_hairpin_conf hairpin_conf = {
                              ^~~~~~~~~~~~
/tmp/SUSE15-64_K4.12.14_GCC7.3.1/x86_64-native-linuxapp-gcc/9a878ab9c54e49d3baf3bb2bfa072c88/dpdk/app/test-pmd/testpmd.c: At top level:
cc1: warning: unrecognized command line option ‘-Wno-address-of-packed-member’
make[5]: *** [/tmp/SUSE15-64_K4.12.14_GCC7.3.1/x86_64-native-linuxapp-gcc/9a878ab9c54e49d3baf3bb2bfa072c88/dpdk/mk/internal/rte.compile-pre.mk:116: testpmd.o] Error 1
make[4]: *** [/tmp/SUSE15-64_K4.12.14_GCC7.3.1/x86_64-native-linuxapp-gcc/9a878ab9c54e49d3baf3bb2bfa072c88/dpdk/mk/rte.subdir.mk:37: test-pmd] Error 2
make[4]: *** Waiting for unfinished jobs....
  CC comp_perf_options_parse.o
  CC config.o
  LD dpdk-pdump
  CC test_bbdev.o
--
  CC test_ipsec.o
  MKRES test_resource_c.res.o
  LD test
  INSTALL-APP test
  INSTALL-MAP test.map
make[3]: *** [/tmp/SUSE15-64_K4.12.14_GCC7.3.1/x86_64-native-linuxapp-gcc/9a878ab9c54e49d3baf3bb2bfa072c88/dpdk/mk/rte.sdkbuild.mk:48: app] Error 2
make[2]: *** [/tmp/SUSE15-64_K4.12.14_GCC7.3.1/x86_64-native-linuxapp-gcc/9a878ab9c54e49d3baf3bb2bfa072c88/dpdk/mk/rte.sdkroot.mk:99: all] Error 2
make[1]: *** [/tmp/SUSE15-64_K4.12.14_GCC7.3.1/x86_64-native-linuxapp-gcc/9a878ab9c54e49d3baf3bb2bfa072c88/dpdk/mk/rte.sdkinstall.mk:61: pre_install] Error 2
make: *** [/tmp/SUSE15-64_K4.12.14_GCC7.3.1/x86_64-native-linuxapp-gcc/9a878ab9c54e49d3baf3bb2bfa072c88/dpdk/mk/rte.sdkroot.mk:77: install] Error 2


*Make Build Failed #8:
OS: RHEL80-64
Target: x86_64-native-linuxapp-gcc
  struct rte_eth_hairpin_conf hairpin_conf = {
                              ^~~~~~~~~~~~
  LD cmdline_test
/tmp/RHEL80-64_K3.10.0_GCC8.2.1/x86_64-native-linuxapp-gcc/9a878ab9c54e49d3baf3bb2bfa072c88/dpdk/app/test-pmd/testpmd.c: At top level:
cc1: warning: unrecognized command line option ‘-Wno-address-of-packed-member’
make[5]: *** [/tmp/RHEL80-64_K3.10.0_GCC8.2.1/x86_64-native-linuxapp-gcc/9a878ab9c54e49d3baf3bb2bfa072c88/dpdk/mk/internal/rte.compile-pre.mk:114: testpmd.o] Error 1
make[4]: *** [/tmp/RHEL80-64_K3.10.0_GCC8.2.1/x86_64-native-linuxapp-gcc/9a878ab9c54e49d3baf3bb2bfa072c88/dpdk/mk/rte.subdir.mk:37: test-pmd] Error 2
make[4]: *** Waiting for unfinished jobs....
  CC cperf_ops.o
  CC test.o
  LD dpdk-pdump
  INSTALL-APP dpdk-procinfo
--
  CC test_ipsec.o
  MKRES test_resource_c.res.o
  LD test
  INSTALL-MAP test.map
  INSTALL-APP test
make[3]: *** [/tmp/RHEL80-64_K3.10.0_GCC8.2.1/x86_64-native-linuxapp-gcc/9a878ab9c54e49d3baf3bb2bfa072c88/dpdk/mk/rte.sdkbuild.mk:48: app] Error 2
make[2]: *** [/tmp/RHEL80-64_K3.10.0_GCC8.2.1/x86_64-native-linuxapp-gcc/9a878ab9c54e49d3baf3bb2bfa072c88/dpdk/mk/rte.sdkroot.mk:99: all] Error 2
make[1]: *** [/tmp/RHEL80-64_K3.10.0_GCC8.2.1/x86_64-native-linuxapp-gcc/9a878ab9c54e49d3baf3bb2bfa072c88/dpdk/mk/rte.sdkinstall.mk:61: pre_install] Error 2
make: *** [/tmp/RHEL80-64_K3.10.0_GCC8.2.1/x86_64-native-linuxapp-gcc/9a878ab9c54e49d3baf3bb2bfa072c88/dpdk/mk/rte.sdkroot.mk:77: install] Error 2


*Make Build Failed #9:
OS: RHEL76-64
Target: x86_64-native-linuxapp-gcc
  struct rte_eth_hairpin_conf hairpin_conf = {
                              ^
  CC cmdline_test.o
/tmp/RHEL76-64_K3.10.0_GCC4.8.5/x86_64-native-linuxapp-gcc/9a878ab9c54e49d3baf3bb2bfa072c88/dpdk/app/test-pmd/testpmd.c: At top level:
cc1: warning: unrecognized command line option "-Wno-address-of-packed-member" [enabled by default]
make[5]: *** [testpmd.o] Error 1
make[4]: *** [test-pmd] Error 2
make[4]: *** Waiting for unfinished jobs....
  CC commands.o
  CC main.o
  CC test_bbdev.o
  LD dpdk-procinfo
--
  CC test_ipsec.o
  MKRES test_resource_c.res.o
  LD test
  INSTALL-APP test
  INSTALL-MAP test.map
make[3]: *** [app] Error 2
make[2]: *** [all] Error 2
make[1]: *** [pre_install] Error 2
make: *** [install] Error 2


*Make Build Failed #10:
OS: FC30-64
Target: x86_64-native-linuxapp-clang
                                diag = rte_eth_rx_hairpin_queue_setup
                                       ^
/tmp/FC30-64_K4.20_Clang8.0.0/x86_64-native-linuxapp-clang/9a878ab9c54e49d3baf3bb2bfa072c88/dpdk/app/test-pmd/testpmd.c:2281:12: warning: this function declaration is not a prototype [-Wstrict-prototypes]
7  CC test.o
 warnings and 3 errors generated.
make[5]: *** [/tmp/FC30-64_K4.20_Clang8.0.0/x86_64-native-linuxapp-clang/9a878ab9c54e49d3baf3bb2bfa072c88/dpdk/mk/internal/rte.compile-pre.mk:116: testpmd.o] Error 1
make[4]: *** [/tmp/FC30-64_K4.20_Clang8.0.0/x86_64-native-linuxapp-clang/9a878ab9c54e49d3baf3bb2bfa072c88/dpdk/mk/rte.subdir.mk:35: test-pmd] Error 2
make[4]: *** Waiting for unfinished jobs....
  CC test_bbdev_perf.o
  CC cperf_ops.o
  INSTALL-APP cmdline_test
  INSTALL-MAP cmdline_test.map
--
  CC test_ipsec.o
  MKRES test_resource_c.res.o
  LD test
  INSTALL-APP test
  INSTALL-MAP test.map
make[3]: *** [/tmp/FC30-64_K4.20_Clang8.0.0/x86_64-native-linuxapp-clang/9a878ab9c54e49d3baf3bb2bfa072c88/dpdk/mk/rte.sdkbuild.mk:48: app] Error 2
make[2]: *** [/tmp/FC30-64_K4.20_Clang8.0.0/x86_64-native-linuxapp-clang/9a878ab9c54e49d3baf3bb2bfa072c88/dpdk/mk/rte.sdkroot.mk:99: all] Error 2
make[1]: *** [/tmp/FC30-64_K4.20_Clang8.0.0/x86_64-native-linuxapp-clang/9a878ab9c54e49d3baf3bb2bfa072c88/dpdk/mk/rte.sdkinstall.mk:61: pre_install] Error 2
make: *** [/tmp/FC30-64_K4.20_Clang8.0.0/x86_64-native-linuxapp-clang/9a878ab9c54e49d3baf3bb2bfa072c88/dpdk/mk/rte.sdkroot.mk:77: install] Error 2


*Make Build Failed #11:
OS: SUSE15-64
Target: x86_64-native-linuxapp-clang
/tmp/SUSE15-64_K4.12.14_Clang5.0.1/x86_64-native-linuxapp-clang/9a878ab9c54e49d3baf3bb2bfa072c88/dpdk/app/test-pmd/testpmd.c:2281:12: warning: implicit declaration of function 'rte_eth_rx_hairpin_queue_setup' is invalid in C99 [-Wimplicit-function-declaration]
                                diag = rte_eth_rx_hairpin_queue_setup
                                       ^
/tmp/SUSE15-64_K4.12.14_Clang5.0.1/x86_64-native-linuxapp-clang/9a878ab9c54e49d3baf3bb2bfa072c88/dpdk/app/test-pmd/testpmd.c:2281:12: warning: this function declaration is not a prototype [-Wstrict-prototypes]
6 warnings and 3 errors generated.
make[5]: *** [/tmp/SUSE15-64_K4.12.14_Clang5.0.1/x86_64-native-linuxapp-clang/9a878ab9c54e49d3baf3bb2bfa072c88/dpdk/mk/internal/rte.compile-pre.mk:116: testpmd.o] Error 1
make[4]: *** [/tmp/SUSE15-64_K4.12.14_Clang5.0.1/x86_64-native-linuxapp-clang/9a878ab9c54e49d3baf3bb2bfa072c88/dpdk/mk/rte.subdir.mk:37: test-pmd] Error 2
make[4]: *** Waiting for unfinished jobs....
  CC test.o
  LD dpdk-procinfo
  LD dpdk-pdump
  CC config.o
--
  CC test_ipsec.o
  MKRES test_resource_c.res.o
  LD test
  INSTALL-APP test
  INSTALL-MAP test.map
make[3]: *** [/tmp/SUSE15-64_K4.12.14_Clang5.0.1/x86_64-native-linuxapp-clang/9a878ab9c54e49d3baf3bb2bfa072c88/dpdk/mk/rte.sdkbuild.mk:48: app] Error 2
make[2]: *** [/tmp/SUSE15-64_K4.12.14_Clang5.0.1/x86_64-native-linuxapp-clang/9a878ab9c54e49d3baf3bb2bfa072c88/dpdk/mk/rte.sdkroot.mk:99: all] Error 2
make[1]: *** [/tmp/SUSE15-64_K4.12.14_Clang5.0.1/x86_64-native-linuxapp-clang/9a878ab9c54e49d3baf3bb2bfa072c88/dpdk/mk/rte.sdkinstall.mk:61: pre_install] Error 2
make: *** [/tmp/SUSE15-64_K4.12.14_Clang5.0.1/x86_64-native-linuxapp-clang/9a878ab9c54e49d3baf3bb2bfa072c88/dpdk/mk/rte.sdkroot.mk:77: install] Error 2


*Make Build Failed #12:
OS: UB1604-64
Target: x86_64-native-linuxapp-gcc
/tmp/UB1604-64_K4.4.0_GCC5.4.0/x86_64-native-linuxapp-gcc/9a878ab9c54e49d3baf3bb2bfa072c88/dpdk/app/test-pmd/testpmd.c:2115:30: warning: unused variable ‘hairpin_conf’ [-Wunused-variable]
  struct rte_eth_hairpin_conf hairpin_conf = {
                              ^
/tmp/UB1604-64_K4.4.0_GCC5.4.0/x86_64-native-linuxapp-gcc/9a878ab9c54e49d3baf3bb2bfa072c88/dpdk/app/test-pmd/testpmd.c: At top level:
cc1: warning: unrecognized command line option ‘-Wno-address-of-packed-member’
/tmp/UB1604-64_K4.4.0_GCC5.4.0/x86_64-native-linuxapp-gcc/9a878ab9c54e49d3baf3bb2bfa072c88/dpdk/mk/internal/rte.compile-pre.mk:114: recipe for target 'testpmd.o' failed
make[5]: *** [testpmd.o] Error 1
/tmp/UB1604-64_K4.4.0_GCC5.4.0/x86_64-native-linuxapp-gcc/9a878ab9c54e49d3baf3bb2bfa072c88/dpdk/mk/rte.subdir.mk:35: recipe for target 'test-pmd' failed
make[4]: *** [test-pmd] Error 2
make[4]: *** Waiting for unfinished jobs....
  CC test_bbdev_perf.o
  CC config.o
  LD testacl
  LD dpdk-procinfo
--
  CC test_ipsec.o
  MKRES test_resource_c.res.o
  LD test
  INSTALL-APP test
  INSTALL-MAP test.map
/tmp/UB1604-64_K4.4.0_GCC5.4.0/x86_64-native-linuxapp-gcc/9a878ab9c54e49d3baf3bb2bfa072c88/dpdk/mk/rte.sdkbuild.mk:46: recipe for target 'app' failed
make[3]: *** [app] Error 2
/tmp/UB1604-64_K4.4.0_GCC5.4.0/x86_64-native-linuxapp-gcc/9a878ab9c54e49d3baf3bb2bfa072c88/dpdk/mk/rte.sdkroot.mk:98: recipe for target 'all' failed
make[2]: *** [all] Error 2
/tmp/UB1604-64_K4.4.0_GCC5.4.0/x86_64-native-linuxapp-gcc/9a878ab9c54e49d3baf3bb2bfa072c88/dpdk/mk/rte.sdkinstall.mk:60: recipe for target 'pre_install' failed
make[1]: *** [pre_install] Error 2
/tmp/UB1604-64_K4.4.0_GCC5.4.0/x86_64-native-linuxapp-gcc/9a878ab9c54e49d3baf3bb2bfa072c88/dpdk/mk/rte.sdkroot.mk:77: recipe for target 'install' failed
make: *** [install] Error 2


*Make Build Failed #13:
OS: UB1804-64
Target: x86_64-native-linuxapp-gcc
                              ^~~~~~~~~~~~
  LD dpdk-pdump
  CC comp_perf_options_parse.o
/tmp/UB1804-64_K4.15.0_GCC7.3.0/x86_64-native-linuxapp-gcc/9a878ab9c54e49d3baf3bb2bfa072c88/dpdk/app/test-pmd/testpmd.c: At top level:
cc1: warning: unrecognized command line option ‘-Wno-address-of-packed-member’
/tmp/UB1804-64_K4.15.0_GCC7.3.0/x86_64-native-linuxapp-gcc/9a878ab9c54e49d3baf3bb2bfa072c88/dpdk/mk/internal/rte.compile-pre.mk:114: recipe for target 'testpmd.o' failed
make[5]: *** [testpmd.o] Error 1
/tmp/UB1804-64_K4.15.0_GCC7.3.0/x86_64-native-linuxapp-gcc/9a878ab9c54e49d3baf3bb2bfa072c88/dpdk/mk/rte.subdir.mk:35: recipe for target 'test-pmd' failed
make[4]: *** [test-pmd] Error 2
make[4]: *** Waiting for unfinished jobs....
  CC comp_perf_test_verify.o
  CC test.o
  CC cperf_ops.o
  CC resource.o
--
  CC test_ipsec.o
  MKRES test_resource_c.res.o
  LD test
  INSTALL-APP test
  INSTALL-MAP test.map
/tmp/UB1804-64_K4.15.0_GCC7.3.0/x86_64-native-linuxapp-gcc/9a878ab9c54e49d3baf3bb2bfa072c88/dpdk/mk/rte.sdkbuild.mk:46: recipe for target 'app' failed
make[3]: *** [app] Error 2
/tmp/UB1804-64_K4.15.0_GCC7.3.0/x86_64-native-linuxapp-gcc/9a878ab9c54e49d3baf3bb2bfa072c88/dpdk/mk/rte.sdkroot.mk:98: recipe for target 'all' failed
make[2]: *** [all] Error 2
/tmp/UB1804-64_K4.15.0_GCC7.3.0/x86_64-native-linuxapp-gcc/9a878ab9c54e49d3baf3bb2bfa072c88/dpdk/mk/rte.sdkinstall.mk:60: recipe for target 'pre_install' failed
make[1]: *** [pre_install] Error 2
/tmp/UB1804-64_K4.15.0_GCC7.3.0/x86_64-native-linuxapp-gcc/9a878ab9c54e49d3baf3bb2bfa072c88/dpdk/mk/rte.sdkroot.mk:77: recipe for target 'install' failed
make: *** [install] Error 2


*Make Build Failed #14:
OS: CENTOS76-64
Target: x86_64-native-linuxapp-clang
/tmp/CENTOS76-64_K3.10.0_Clang3.4.2/x86_64-native-linuxapp-clang/9a878ab9c54e49d3baf3bb2bfa072c88/dpdk/app/test-pmd/testpmd.c:2281:12: warning: implicit declaration of function 'rte_eth_rx_hairpin_queue_setup' is invalid in C99 [-Wimplicit-function-declaration]
                                diag = rte_eth_rx_hairpin_queue_setup
                                       ^
  LD testacl
3 warnings and 3 errors generated.
make[5]: *** [testpmd.o] Error 1
make[4]: *** [test-pmd] Error 2
make[4]: *** Waiting for unfinished jobs....
  CC cperf_ops.o
  LD dpdk-procinfo
  LD cmdline_test
  CC comp_perf_options_parse.o
--
  CC test_ipsec.o
  MKRES test_resource_c.res.o
  LD test
  INSTALL-APP test
  INSTALL-MAP test.map
make[3]: *** [app] Error 2
make[2]: *** [all] Error 2
make[1]: *** [pre_install] Error 2
make: *** [install] Error 2


*Make Build Failed #15:
OS: FreeBSD12-64
Target: x86_64-native-bsdapp-gcc+debug
/tmp/FreeBSD12-64_K19.02_GCC7.3.0/x86_64-native-bsdapp-gcc+debug/9a878ab9c54e49d3baf3bb2bfa072c88/dpdk/app/test-pmd/testpmd.c:2115:30: warning: unused variable 'hairpin_conf' [-Wunused-variable]
  struct rte_eth_hairpin_conf hairpin_conf = {
                              ^~~~~~~~~~~~
/tmp/FreeBSD12-64_K19.02_GCC7.3.0/x86_64-native-bsdapp-gcc+debug/9a878ab9c54e49d3baf3bb2bfa072c88/dpdk/app/test-pmd/testpmd.c: At top level:
cc1: warning: unrecognized command line option '-Wno-address-of-packed-member'
gmake[5]: *** [/tmp/FreeBSD12-64_K19.02_GCC7.3.0/x86_64-native-bsdapp-gcc+debug/9a878ab9c54e49d3baf3bb2bfa072c88/dpdk/mk/internal/rte.compile-pre.mk:116: testpmd.o] Error 1
  LD dpdk-pdump
  LD testacl
  CC test_bbdev.o
gmake[4]: *** [/tmp/FreeBSD12-64_K19.02_GCC7.3.0/x86_64-native-bsdapp-gcc+debug/9a878ab9c54e49d3baf3bb2bfa072c88/dpdk/mk/rte.subdir.mk:37: test-pmd] Error 2
gmake[4]: *** Waiting for unfinished jobs....
  CC commands.o
  CC evt_options.o
  CC init.o
  CC cperf_ops.o
--
  CC test_ipsec.o
  MKRES test_resource_c.res.o
  LD test
  INSTALL-APP test
  INSTALL-MAP test.map
gmake[3]: *** [/tmp/FreeBSD12-64_K19.02_GCC7.3.0/x86_64-native-bsdapp-gcc+debug/9a878ab9c54e49d3baf3bb2bfa072c88/dpdk/mk/rte.sdkbuild.mk:48: app] Error 2
gmake[2]: *** [/tmp/FreeBSD12-64_K19.02_GCC7.3.0/x86_64-native-bsdapp-gcc+debug/9a878ab9c54e49d3baf3bb2bfa072c88/dpdk/mk/rte.sdkroot.mk:99: all] Error 2
gmake[1]: *** [/tmp/FreeBSD12-64_K19.02_GCC7.3.0/x86_64-native-bsdapp-gcc+debug/9a878ab9c54e49d3baf3bb2bfa072c88/dpdk/mk/rte.sdkinstall.mk:61: pre_install] Error 2
gmake: *** [/tmp/FreeBSD12-64_K19.02_GCC7.3.0/x86_64-native-bsdapp-gcc+debug/9a878ab9c54e49d3baf3bb2bfa072c88/dpdk/mk/rte.sdkroot.mk:77: install] Error 2


*Make Build Failed #16:
OS: FreeBSD12-64
Target: x86_64-native-bsdapp-gcc+shared
                              ^~~~~~~~~~~~
  LD dpdk-pdump
  CC evt_main.o
/tmp/FreeBSD12-64_K19.02_GCC7.3.0/x86_64-native-bsdapp-gcc+shared/9a878ab9c54e49d3baf3bb2bfa072c88/dpdk/app/test-pmd/testpmd.c: At top level:
cc1: warning: unrecognized command line option '-Wno-address-of-packed-member'
gmake[5]: *** [/tmp/FreeBSD12-64_K19.02_GCC7.3.0/x86_64-native-bsdapp-gcc+shared/9a878ab9c54e49d3baf3bb2bfa072c88/dpdk/mk/internal/rte.compile-pre.mk:116: testpmd.o] Error 1
gmake[4]: *** [/tmp/FreeBSD12-64_K19.02_GCC7.3.0/x86_64-native-bsdapp-gcc+shared/9a878ab9c54e49d3baf3bb2bfa072c88/dpdk/mk/rte.subdir.mk:37: test-pmd] Error 2
gmake[4]: *** Waiting for unfinished jobs....
  CC cperf_ops.o
  INSTALL-APP dpdk-pdump
  INSTALL-MAP dpdk-pdump.map
  CC config.o
--
  CC test_ipsec.o
  MKRES test_resource_c.res.o
  LD test
  INSTALL-APP test
  INSTALL-MAP test.map
gmake[3]: *** [/tmp/FreeBSD12-64_K19.02_GCC7.3.0/x86_64-native-bsdapp-gcc+shared/9a878ab9c54e49d3baf3bb2bfa072c88/dpdk/mk/rte.sdkbuild.mk:48: app] Error 2
gmake[2]: *** [/tmp/FreeBSD12-64_K19.02_GCC7.3.0/x86_64-native-bsdapp-gcc+shared/9a878ab9c54e49d3baf3bb2bfa072c88/dpdk/mk/rte.sdkroot.mk:99: all] Error 2
gmake[1]: *** [/tmp/FreeBSD12-64_K19.02_GCC7.3.0/x86_64-native-bsdapp-gcc+shared/9a878ab9c54e49d3baf3bb2bfa072c88/dpdk/mk/rte.sdkinstall.mk:61: pre_install] Error 2
gmake: *** [/tmp/FreeBSD12-64_K19.02_GCC7.3.0/x86_64-native-bsdapp-gcc+shared/9a878ab9c54e49d3baf3bb2bfa072c88/dpdk/mk/rte.sdkroot.mk:77: install] Error 2


*Make Build Failed #17:
OS: CENTOS76-64
Target: x86_64-native-linuxapp-gcc
/tmp/CENTOS76-64_K3.10.0_GCC4.8.5/x86_64-native-linuxapp-gcc/9a878ab9c54e49d3baf3bb2bfa072c88/dpdk/app/test-pmd/testpmd.c:2115:30: warning: unused variable ‘hairpin_conf’ [-Wunused-variable]
  struct rte_eth_hairpin_conf hairpin_conf = {
                              ^
/tmp/CENTOS76-64_K3.10.0_GCC4.8.5/x86_64-native-linuxapp-gcc/9a878ab9c54e49d3baf3bb2bfa072c88/dpdk/app/test-pmd/testpmd.c: At top level:
cc1: warning: unrecognized command line option "-Wno-address-of-packed-member" [enabled by default]
make[5]: *** [testpmd.o] Error 1
make[4]: *** [test-pmd] Error 2
make[4]: *** Waiting for unfinished jobs....
  CC main.o
  CC config.o
  LD testacl
  CC commands.o
--
  CC test_ipsec.o
  MKRES test_resource_c.res.o
  LD test
  INSTALL-APP test
  INSTALL-MAP test.map
make[3]: *** [app] Error 2
make[2]: *** [all] Error 2
make[1]: *** [pre_install] Error 2
make: *** [install] Error 2


*Make Build Failed #18:
OS: CENTOS76-64
Target: x86_64-native-linuxapp-gcc+debug
                              ^
  CC main.o
/tmp/CENTOS76-64_K3.10.0_GCC4.8.5/x86_64-native-linuxapp-gcc+debug/9a878ab9c54e49d3baf3bb2bfa072c88/dpdk/app/test-pmd/testpmd.c: At top level:
cc1: warning: unrecognized command line option "-Wno-address-of-packed-member" [enabled by default]
  CC commands.o
make[5]: *** [testpmd.o] Error 1
make[4]: *** [test-pmd] Error 2
make[4]: *** Waiting for unfinished jobs....
  CC comp_perf_options_parse.o
  CC commands.o
  LD testacl
  CC config.o
--
  CC test_ipsec.o
  MKRES test_resource_c.res.o
  LD test
  INSTALL-APP test
  INSTALL-MAP test.map
make[3]: *** [app] Error 2
make[2]: *** [all] Error 2
make[1]: *** [pre_install] Error 2
make: *** [install] Error 2


*Make Build Failed #19:
OS: FreeBSD12-64
Target: x86_64-native-bsdapp-clang
                                diag = rte_eth_rx_hairpin_queue_setup
                                       ^
/tmp/FreeBSD12-64_K19.02_Clang6.0.1/x86_64-native-bsdapp-clang/9a878ab9c54e49d3baf3bb2bfa072c88/dpdk/app/test-pmd/testpmd.c:2281:12: warning: this function declaration is not a prototype [-Wstrict-prototypes]
7 warnings and 3 errors generated.
  INSTALL-MAP cmdline_test.map
gmake[5]: *** [/tmp/FreeBSD12-64_K19.02_Clang6.0.1/x86_64-native-bsdapp-clang/9a878ab9c54e49d3baf3bb2bfa072c88/dpdk/mk/internal/rte.compile-pre.mk:116: testpmd.o] Error 1
gmake[4]: *** [/tmp/FreeBSD12-64_K19.02_Clang6.0.1/x86_64-native-bsdapp-clang/9a878ab9c54e49d3baf3bb2bfa072c88/dpdk/mk/rte.subdir.mk:37: test-pmd] Error 2
gmake[4]: *** Waiting for unfinished jobs....
  CC cperf_options_parsing.o
  CC cperf_test_vectors.o
  CC test_bbdev_perf.o
  CC cperf_test_throughput.o
--
  CC test_ipsec.o
  MKRES test_resource_c.res.o
  LD test
  INSTALL-APP test
  INSTALL-MAP test.map
gmake[3]: *** [/tmp/FreeBSD12-64_K19.02_Clang6.0.1/x86_64-native-bsdapp-clang/9a878ab9c54e49d3baf3bb2bfa072c88/dpdk/mk/rte.sdkbuild.mk:48: app] Error 2
gmake[2]: *** [/tmp/FreeBSD12-64_K19.02_Clang6.0.1/x86_64-native-bsdapp-clang/9a878ab9c54e49d3baf3bb2bfa072c88/dpdk/mk/rte.sdkroot.mk:99: all] Error 2
gmake[1]: *** [/tmp/FreeBSD12-64_K19.02_Clang6.0.1/x86_64-native-bsdapp-clang/9a878ab9c54e49d3baf3bb2bfa072c88/dpdk/mk/rte.sdkinstall.mk:61: pre_install] Error 2
gmake: *** [/tmp/FreeBSD12-64_K19.02_Clang6.0.1/x86_64-native-bsdapp-clang/9a878ab9c54e49d3baf3bb2bfa072c88/dpdk/mk/rte.sdkroot.mk:77: install] Error 2


*Make Build Failed #20:
OS: CENTOS76-64
Target: x86_64-native-linuxapp-gcc+shared
  struct rte_eth_hairpin_conf hairpin_conf = {
                              ^
  CC commands.o
/tmp/CENTOS76-64_K3.10.0_GCC4.8.5/x86_64-native-linuxapp-gcc+shared/9a878ab9c54e49d3baf3bb2bfa072c88/dpdk/app/test-pmd/testpmd.c: At top level:
cc1: warning: unrecognized command line option "-Wno-address-of-packed-member" [enabled by default]
make[5]: *** [testpmd.o] Error 1
  CC main.o
make[4]: *** [test-pmd] Error 2
make[4]: *** Waiting for unfinished jobs....
  CC test.o
  CC cmdline_test.o
  CC main.o
  CC test_bbdev.o
--
  CC test_ipsec.o
  MKRES test_resource_c.res.o
  LD test
  INSTALL-APP test
  INSTALL-MAP test.map
make[3]: *** [app] Error 2
make[2]: *** [all] Error 2
make[1]: *** [pre_install] Error 2
make: *** [install] Error 2


*Make Build Failed #21:
OS: FreeBSD12-64
Target: x86_64-native-bsdapp-gcc
 2119 |  struct rte_eth_hairpin_cap cap;
      |                             ^~~
/tmp/FreeBSD12-64_K19.02_GCC7.3.0/x86_64-native-bsdapp-gcc/9a878ab9c54e49d3baf3bb2bfa072c88/dpdk/app/test-pmd/testpmd.c:2115:30: warning: unused variable 'hairpin_conf' [-Wunused-variable]
 2115 |  struct rte_eth_hairpin_conf hairpin_conf = {
      |                              ^~~~~~~~~~~~
gmake[5]: *** [/tmp/FreeBSD12-64_K19.02_GCC7.3.0/x86_64-native-bsdapp-gcc/9a878ab9c54e49d3baf3bb2bfa072c88/dpdk/mk/internal/rte.compile-pre.mk:116: testpmd.o] Error 1
gmake[4]: *** [/tmp/FreeBSD12-64_K19.02_GCC7.3.0/x86_64-native-bsdapp-gcc/9a878ab9c54e49d3baf3bb2bfa072c88/dpdk/mk/rte.subdir.mk:37: test-pmd] Error 2
gmake[4]: *** Waiting for unfinished jobs....
  CC test_bbdev_perf.o
  CC cperf_ops.o
  LD dpdk-pdump
  INSTALL-APP cmdline_test
--
  CC test_ipsec.o
  MKRES test_resource_c.res.o
  LD test
  INSTALL-APP test
  INSTALL-MAP test.map
gmake[3]: *** [/tmp/FreeBSD12-64_K19.02_GCC7.3.0/x86_64-native-bsdapp-gcc/9a878ab9c54e49d3baf3bb2bfa072c88/dpdk/mk/rte.sdkbuild.mk:48: app] Error 2
gmake[2]: *** [/tmp/FreeBSD12-64_K19.02_GCC7.3.0/x86_64-native-bsdapp-gcc/9a878ab9c54e49d3baf3bb2bfa072c88/dpdk/mk/rte.sdkroot.mk:99: all] Error 2
gmake[1]: *** [/tmp/FreeBSD12-64_K19.02_GCC7.3.0/x86_64-native-bsdapp-gcc/9a878ab9c54e49d3baf3bb2bfa072c88/dpdk/mk/rte.sdkinstall.mk:61: pre_install] Error 2
gmake: *** [/tmp/FreeBSD12-64_K19.02_GCC7.3.0/x86_64-native-bsdapp-gcc/9a878ab9c54e49d3baf3bb2bfa072c88/dpdk/mk/rte.sdkroot.mk:77: install] Error 2


*Make Build Failed #22:
OS: CENTOS76-64
Target: x86_64-native-linuxapp-icc
/tmp/CENTOS76-64_K3.10.0_ICC19.0.0/x86_64-native-linuxapp-icc/9a878ab9c54e49d3baf3bb2bfa072c88/dpdk/app/test-pmd/testpmd.c(2119): error: incomplete type is not allowed
  	struct rte_eth_hairpin_cap cap;
  	                           ^

compilation aborted for /tmp/CENTOS76-64_K3.10.0_ICC19.0.0/x86_64-native-linuxapp-icc/9a878ab9c54e49d3baf3bb2bfa072c88/dpdk/app/test-pmd/testpmd.c (code 2)
make[5]: *** [testpmd.o] Error 2
make[4]: *** [test-pmd] Error 2
make[4]: *** Waiting for unfinished jobs....
  CC comp_perf_test_verify.o
  LD cmdline_test
  CC test.o
  CC config.o
--
  CC test_ipsec.o
  MKRES test_resource_c.res.o
  LD test
  INSTALL-APP test
  INSTALL-MAP test.map
make[3]: *** [app] Error 2
make[2]: *** [all] Error 2
make[1]: *** [pre_install] Error 2
make: *** [install] Error 2

*Meson Build Failed #1:
OS: SUSE15-64
Target:build-gcc-static
FAILED: app/a172ced@@dpdk-testpmd@exe/test-pmd_testpmd.c.o 
gcc -Iapp/a172ced@@dpdk-testpmd@exe -Iapp -I../app -Ilib/librte_ethdev -I../lib/librte_ethdev -I. -I../ -Iconfig -I../config -Ilib/librte_eal/common/include -I../lib/librte_eal/common/include -I../lib/librte_eal/linux/eal/include -Ilib/librte_eal/common -I../lib/librte_eal/common -Ilib/librte_eal/common/include/arch/x86 -I../lib/librte_eal/common/include/arch/x86 -Ilib/librte_eal -I../lib/librte_eal -Ilib/librte_kvargs -I../lib/librte_kvargs -Ilib/librte_net -I../lib/librte_net -Ilib/librte_mbuf -I../lib/librte_mbuf -Ilib/librte_mempool -I../lib/librte_mempool -Ilib/librte_ring -I../lib/librte_ring -Ilib/librte_meter -I../lib/librte_meter -Ilib/librte_gro -I../lib/librte_gro -Ilib/librte_gso -I../lib/librte_gso -Ilib/librte_cmdline -I../lib/librte_cmdline -Ilib/librte_metrics -I../lib/librte_metrics -Idrivers/bus/pci -I../drivers/bus/pci -I../drivers/bus/pci/linux -Ilib/librte_pci -I../lib/librte_pci -Ilib/librte_pdump -I../lib/librte_pdump -Idrivers/net/bnxt -I../drivers/net/bnxt -Idrivers/bus/vdev -I../drivers/bus/vdev -Idrivers/net/i40e -I../drivers/net/i40e -Idrivers/net/i40e/base -I../drivers/net/i40e/base -Ilib/librte_hash -I../lib/librte_hash -Idrivers/net/ixgbe -I../drivers/net/ixgbe -Idrivers/net/ixgbe/base -I../drivers/net/ixgbe/base -Ilib/librte_security -I../lib/librte_security -Ilib/librte_cryptodev -I../lib/librte_cryptodev -Idrivers/net/softnic -I../drivers/net/softnic -Ilib/librte_pipeline -I../lib/librte_pipeline -Ilib/librte_port -I../lib/librte_port -Ilib/librte_sched -I../lib/librte_sched -Ilib/librte_ip_frag -I../lib/librte_ip_frag -Ilib/librte_kni -I../lib/librte_kni -Ilib/librte_table -I../lib/librte_table -Ilib/librte_lpm -I../lib/librte_lpm -Ilib/librte_acl -I../lib/librte_acl -Idrivers/bus/dpaa -I../drivers/bus/dpaa -I../drivers/bus/dpaa/include -I../drivers/bus/dpaa/base/qbman -Idrivers/common/dpaax -I../drivers/common/dpaax -Ilib/librte_eventdev -I../lib/librte_eventdev -Ilib/librte_timer -I../lib/librte_timer -Idrivers/mempool/dpaa -I../drivers/mempool/dpaa -Idrivers/net/dpaa -I../drivers/net/dpaa -Ilib/librte_bpf -I../lib/librte_bpf -fdiagnostics-color=always -pipe -D_FILE_OFFSET_BITS=64 -Wall -Winvalid-pch -Werror -O3 -include rte_config.h -Wunused-parameter -Wsign-compare -Wcast-qual -D_GNU_SOURCE -march=native -Wno-deprecated-declarations -DALLOW_EXPERIMENTAL_API -MD -MQ 'app/a172ced@@dpdk-testpmd@exe/test-pmd_testpmd.c.o' -MF 'app/a172ced@@dpdk-testpmd@exe/test-pmd_testpmd.c.o.d' -o 'app/a172ced@@dpdk-testpmd@exe/test-pmd_testpmd.c.o' -c ../app/test-pmd/testpmd.c
../app/test-pmd/testpmd.c: In function ‘get_allowed_max_nb_hairpinq’:
../app/test-pmd/testpmd.c:1117:29: error: storage size of ‘cap’ isn’t known
  struct rte_eth_hairpin_cap cap;
                             ^~~
../app/test-pmd/testpmd.c:1120:7: error: implicit declaration of function ‘rte_eth_dev_hairpin_capability_get’; did you mean ‘rte_eth_dev_rss_hash_conf_get’? [-Werror=implicit-function-declaration]
   if (rte_eth_dev_hairpin_capability_get(pi, &cap) != 0) {
       ^~~~~~~~~~~~~~~~~~~~~~~~~~~~~~~~~~
       rte_eth_dev_rss_hash_conf_get
../app/test-pmd/testpmd.c:1117:29: error: unused variable ‘cap’ [-Werror=unused-variable]
  struct rte_eth_hairpin_cap cap;
                             ^~~
../app/test-pmd/testpmd.c: In function ‘start_port’:
../app/test-pmd/testpmd.c:2115:9: error: variable ‘hairpin_conf’ has initializer but incomplete type
  struct rte_eth_hairpin_conf hairpin_conf = {
         ^~~~~~~~~~~~~~~~~~~~
../app/test-pmd/testpmd.c:2116:4: error: ‘struct rte_eth_hairpin_conf’ has no member named ‘peer_n’
   .peer_n = 1,
    ^~~~~~
../app/test-pmd/testpmd.c:2116:13: error: excess elements in struct initializer [-Werror]
   .peer_n = 1,
             ^
../app/test-pmd/testpmd.c:2116:13: note: (near initialization for ‘hairpin_conf’)
../app/test-pmd/testpmd.c:2115:30: error: storage size of ‘hairpin_conf’ isn’t known
  struct rte_eth_hairpin_conf hairpin_conf = {
                              ^~~~~~~~~~~~
../app/test-pmd/testpmd.c:2119:29: error: storage size of ‘cap’ isn’t known
  struct rte_eth_hairpin_cap cap;
                             ^~~
../app/test-pmd/testpmd.c:2259:12: error: implicit declaration of function ‘rte_eth_tx_hairpin_queue_setup’; did you mean ‘rte_eth_tx_queue_setup’? [-Werror=implicit-function-declaration]
     diag = rte_eth_tx_hairpin_queue_setup
            ^~~~~~~~~~~~~~~~~~~~~~~~~~~~~~
            rte_eth_tx_queue_setup
../app/test-pmd/testpmd.c:2281:12: error: implicit declaration of function ‘rte_eth_rx_hairpin_queue_setup’; did you mean ‘rte_eth_rx_queue_setup’? [-Werror=implicit-function-declaration]
     diag = rte_eth_rx_hairpin_queue_setup
            ^~~~~~~~~~~~~~~~~~~~~~~~~~~~~~
            rte_eth_rx_queue_setup
../app/test-pmd/testpmd.c:2119:29: error: unused variable ‘cap’ [-Werror=unused-variable]
  struct rte_eth_hairpin_cap cap;
                             ^~~
../app/test-pmd/testpmd.c:2115:30: error: unused variable ‘hairpin_conf’ [-Werror=unused-variable]
  struct rte_eth_hairpin_conf hairpin_conf = {
                              ^~~~~~~~~~~~
cc1: all warnings being treated as errors
[1622/1905] Compiling C object 'app/a172ced@@dpdk-testpmd@exe/test-pmd_util.c.o'.
[1623/1905] Compiling C object 'app/a172ced@@dpdk-testpmd@exe/test-pmd_bpf_cmd.c.o'.
[1624/1905] Compiling C object 'app/a172ced@@dpdk-testpmd@exe/test-pmd_softnicfwd.c.o'.
[1625/1905] Compiling C object 'drivers/a715181@@tmp_rte_pmd_octeontx2_event@sta/event_octeontx2_otx2_worker_dual.c.o'.
[1626/1905] Compiling C object 'app/a172ced@@dpdk-testpmd@exe/test-pmd_cmdline.c.o'.
[1627/1905] Compiling C object 'app/a172ced@@dpdk-testpmd@exe/test-pmd_txonly.c.o'.
[1628/1905] Compiling C object 'app/test/3062f5d@@dpdk-test@exe/sample_packet_forward.c.o'.
ninja: build stopped: subcommand failed




*Meson Build Failed #2:
OS: UB1604-32
Target:build-gcc-static
FAILED: app/a172ced@@dpdk-testpmd@exe/test-pmd_testpmd.c.o 
gcc -Iapp/a172ced@@dpdk-testpmd@exe -Iapp -I../app -Ilib/librte_ethdev -I../lib/librte_ethdev -I. -I../ -Iconfig -I../config -Ilib/librte_eal/common/include -I../lib/librte_eal/common/include -I../lib/librte_eal/linux/eal/include -Ilib/librte_eal/common -I../lib/librte_eal/common -Ilib/librte_eal/common/include/arch/x86 -I../lib/librte_eal/common/include/arch/x86 -Ilib/librte_eal -I../lib/librte_eal -Ilib/librte_kvargs -I../lib/librte_kvargs -Ilib/librte_net -I../lib/librte_net -Ilib/librte_mbuf -I../lib/librte_mbuf -Ilib/librte_mempool -I../lib/librte_mempool -Ilib/librte_ring -I../lib/librte_ring -Ilib/librte_meter -I../lib/librte_meter -Ilib/librte_gro -I../lib/librte_gro -Ilib/librte_gso -I../lib/librte_gso -Ilib/librte_cmdline -I../lib/librte_cmdline -Ilib/librte_metrics -I../lib/librte_metrics -Idrivers/bus/pci -I../drivers/bus/pci -I../drivers/bus/pci/linux -Ilib/librte_pci -I../lib/librte_pci -Ilib/librte_pdump -I../lib/librte_pdump -Idrivers/net/bnxt -I../drivers/net/bnxt -Idrivers/bus/vdev -I../drivers/bus/vdev -Idrivers/net/i40e -I../drivers/net/i40e -Idrivers/net/i40e/base -I../drivers/net/i40e/base -Ilib/librte_hash -I../lib/librte_hash -Idrivers/net/ixgbe -I../drivers/net/ixgbe -Idrivers/net/ixgbe/base -I../drivers/net/ixgbe/base -Ilib/librte_security -I../lib/librte_security -Ilib/librte_cryptodev -I../lib/librte_cryptodev -Idrivers/net/softnic -I../drivers/net/softnic -Ilib/librte_pipeline -I../lib/librte_pipeline -Ilib/librte_port -I../lib/librte_port -Ilib/librte_sched -I../lib/librte_sched -Ilib/librte_ip_frag -I../lib/librte_ip_frag -Ilib/librte_table -I../lib/librte_table -Ilib/librte_lpm -I../lib/librte_lpm -Ilib/librte_acl -I../lib/librte_acl -Idrivers/bus/dpaa -I../drivers/bus/dpaa -I../drivers/bus/dpaa/include -I../drivers/bus/dpaa/base/qbman -Idrivers/common/dpaax -I../drivers/common/dpaax -Ilib/librte_eventdev -I../lib/librte_eventdev -Ilib/librte_timer -I../lib/librte_timer -Idrivers/mempool/dpaa -I../drivers/mempool/dpaa -Idrivers/net/dpaa -I../drivers/net/dpaa -Ilib/librte_bpf -I../lib/librte_bpf -fdiagnostics-color=always -pipe -D_FILE_OFFSET_BITS=64 -Wall -Winvalid-pch -Werror -O3 -include rte_config.h -Wunused-parameter -Wsign-compare -Wcast-qual -Wno-pointer-to-int-cast -D_GNU_SOURCE -march=native -Wno-deprecated-declarations -DALLOW_EXPERIMENTAL_API -MD -MQ 'app/a172ced@@dpdk-testpmd@exe/test-pmd_testpmd.c.o' -MF 'app/a172ced@@dpdk-testpmd@exe/test-pmd_testpmd.c.o.d' -o 'app/a172ced@@dpdk-testpmd@exe/test-pmd_testpmd.c.o' -c ../app/test-pmd/testpmd.c
../app/test-pmd/testpmd.c: In function ‘get_allowed_max_nb_hairpinq’:
../app/test-pmd/testpmd.c:1117:29: error: storage size of ‘cap’ isn’t known
  struct rte_eth_hairpin_cap cap;
                             ^
../app/test-pmd/testpmd.c:1120:7: error: implicit declaration of function ‘rte_eth_dev_hairpin_capability_get’ [-Werror=implicit-function-declaration]
   if (rte_eth_dev_hairpin_capability_get(pi, &cap) != 0) {
       ^
../app/test-pmd/testpmd.c:1117:29: error: unused variable ‘cap’ [-Werror=unused-variable]
  struct rte_eth_hairpin_cap cap;
                             ^
../app/test-pmd/testpmd.c: In function ‘start_port’:
../app/test-pmd/testpmd.c:2115:9: error: variable ‘hairpin_conf’ has initializer but incomplete type
  struct rte_eth_hairpin_conf hairpin_conf = {
         ^
../app/test-pmd/testpmd.c:2116:3: error: unknown field ‘peer_n’ specified in initializer
   .peer_n = 1,
   ^
../app/test-pmd/testpmd.c:2116:13: error: excess elements in struct initializer [-Werror]
   .peer_n = 1,
             ^
../app/test-pmd/testpmd.c:2116:13: note: (near initialization for ‘hairpin_conf’)
../app/test-pmd/testpmd.c:2115:30: error: storage size of ‘hairpin_conf’ isn’t known
  struct rte_eth_hairpin_conf hairpin_conf = {
                              ^
../app/test-pmd/testpmd.c:2119:29: error: storage size of ‘cap’ isn’t known
  struct rte_eth_hairpin_cap cap;
                             ^
../app/test-pmd/testpmd.c:2259:12: error: implicit declaration of function ‘rte_eth_tx_hairpin_queue_setup’ [-Werror=implicit-function-declaration]
     diag = rte_eth_tx_hairpin_queue_setup
            ^
../app/test-pmd/testpmd.c:2281:12: error: implicit declaration of function ‘rte_eth_rx_hairpin_queue_setup’ [-Werror=implicit-function-declaration]
     diag = rte_eth_rx_hairpin_queue_setup
            ^
../app/test-pmd/testpmd.c:2119:29: error: unused variable ‘cap’ [-Werror=unused-variable]
  struct rte_eth_hairpin_cap cap;
                             ^
../app/test-pmd/testpmd.c:2115:30: error: unused variable ‘hairpin_conf’ [-Werror=unused-variable]
  struct rte_eth_hairpin_conf hairpin_conf = {
                              ^
cc1: all warnings being treated as errors
[1429/1711] Linking target app/dpdk-test-pipeline.
[1430/1711] Compiling C object 'app/a172ced@@dpdk-testpmd@exe/test-pmd_rxonly.c.o'.
[1431/1711] Compiling C object 'app/a172ced@@dpdk-testpmd@exe/test-pmd_txonly.c.o'.
[1432/1711] Compiling C object 'app/a172ced@@dpdk-testpmd@exe/test-pmd_cmdline.c.o'.
[1433/1711] Compiling C object 'app/a172ced@@dpdk-testpmd@exe/test-pmd_cmdline_flow.c.o'.
ninja: build stopped: subcommand failed




*Meson Build Failed #3:
OS: FC30-64
Target:build-gcc-static
FAILED: app/a172ced@@dpdk-testpmd@exe/test-pmd_testpmd.c.o 
gcc -Iapp/a172ced@@dpdk-testpmd@exe -Iapp -I../app -Ilib/librte_ethdev -I../lib/librte_ethdev -I. -I../ -Iconfig -I../config -Ilib/librte_eal/common/include -I../lib/librte_eal/common/include -I../lib/librte_eal/linux/eal/include -Ilib/librte_eal/common -I../lib/librte_eal/common -Ilib/librte_eal/common/include/arch/x86 -I../lib/librte_eal/common/include/arch/x86 -Ilib/librte_eal -I../lib/librte_eal -Ilib/librte_kvargs -I../lib/librte_kvargs -Ilib/librte_net -I../lib/librte_net -Ilib/librte_mbuf -I../lib/librte_mbuf -Ilib/librte_mempool -I../lib/librte_mempool -Ilib/librte_ring -I../lib/librte_ring -Ilib/librte_meter -I../lib/librte_meter -Ilib/librte_gro -I../lib/librte_gro -Ilib/librte_gso -I../lib/librte_gso -Ilib/librte_cmdline -I../lib/librte_cmdline -Ilib/librte_metrics -I../lib/librte_metrics -Idrivers/bus/pci -I../drivers/bus/pci -I../drivers/bus/pci/linux -Ilib/librte_pci -I../lib/librte_pci -Ilib/librte_pdump -I../lib/librte_pdump -Idrivers/net/bnxt -I../drivers/net/bnxt -Idrivers/bus/vdev -I../drivers/bus/vdev -Idrivers/net/i40e -I../drivers/net/i40e -Idrivers/net/i40e/base -I../drivers/net/i40e/base -Ilib/librte_hash -I../lib/librte_hash -Idrivers/net/ixgbe -I../drivers/net/ixgbe -Idrivers/net/ixgbe/base -I../drivers/net/ixgbe/base -Ilib/librte_security -I../lib/librte_security -Ilib/librte_cryptodev -I../lib/librte_cryptodev -Idrivers/net/softnic -I../drivers/net/softnic -Ilib/librte_pipeline -I../lib/librte_pipeline -Ilib/librte_port -I../lib/librte_port -Ilib/librte_sched -I../lib/librte_sched -Ilib/librte_ip_frag -I../lib/librte_ip_frag -Ilib/librte_kni -I../lib/librte_kni -Ilib/librte_table -I../lib/librte_table -Ilib/librte_lpm -I../lib/librte_lpm -Ilib/librte_acl -I../lib/librte_acl -Idrivers/bus/dpaa -I../drivers/bus/dpaa -I../drivers/bus/dpaa/include -I../drivers/bus/dpaa/base/qbman -Idrivers/common/dpaax -I../drivers/common/dpaax -Ilib/librte_eventdev -I../lib/librte_eventdev -Ilib/librte_timer -I../lib/librte_timer -Idrivers/mempool/dpaa -I../drivers/mempool/dpaa -Idrivers/net/dpaa -I../drivers/net/dpaa -Ilib/librte_bpf -I../lib/librte_bpf -fdiagnostics-color=always -pipe -D_FILE_OFFSET_BITS=64 -Wall -Winvalid-pch -Werror -O3 -include rte_config.h -Wunused-parameter -Wsign-compare -Wcast-qual -Wno-address-of-packed-member -D_GNU_SOURCE -march=native -mno-avx512f -Wno-deprecated-declarations -DALLOW_EXPERIMENTAL_API -MD -MQ 'app/a172ced@@dpdk-testpmd@exe/test-pmd_testpmd.c.o' -MF 'app/a172ced@@dpdk-testpmd@exe/test-pmd_testpmd.c.o.d' -o 'app/a172ced@@dpdk-testpmd@exe/test-pmd_testpmd.c.o' -c ../app/test-pmd/testpmd.c
../app/test-pmd/testpmd.c: In function ‘get_allowed_max_nb_hairpinq’:
../app/test-pmd/testpmd.c:1117:29: error: storage size of ‘cap’ isn’t known
 1117 |  struct rte_eth_hairpin_cap cap;
      |                             ^~~
../app/test-pmd/testpmd.c:1120:7: error: implicit declaration of function ‘rte_eth_dev_hairpin_capability_get’ [-Werror=implicit-function-declaration]
 1120 |   if (rte_eth_dev_hairpin_capability_get(pi, &cap) != 0) {
      |       ^~~~~~~~~~~~~~~~~~~~~~~~~~~~~~~~~~
../app/test-pmd/testpmd.c:1117:29: error: unused variable ‘cap’ [-Werror=unused-variable]
 1117 |  struct rte_eth_hairpin_cap cap;
      |                             ^~~
../app/test-pmd/testpmd.c: In function ‘start_port’:
../app/test-pmd/testpmd.c:2115:9: error: variable ‘hairpin_conf’ has initializer but incomplete type
 2115 |  struct rte_eth_hairpin_conf hairpin_conf = {
      |         ^~~~~~~~~~~~~~~~~~~~
../app/test-pmd/testpmd.c:2116:4: error: ‘struct rte_eth_hairpin_conf’ has no member named ‘peer_n’
 2116 |   .peer_n = 1,
      |    ^~~~~~
../app/test-pmd/testpmd.c:2116:13: error: excess elements in struct initializer [-Werror]
 2116 |   .peer_n = 1,
      |             ^
../app/test-pmd/testpmd.c:2116:13: note: (near initialization for ‘hairpin_conf’)
../app/test-pmd/testpmd.c:2115:30: error: storage size of ‘hairpin_conf’ isn’t known
 2115 |  struct rte_eth_hairpin_conf hairpin_conf = {
      |                              ^~~~~~~~~~~~
../app/test-pmd/testpmd.c:2119:29: error: storage size of ‘cap’ isn’t known
 2119 |  struct rte_eth_hairpin_cap cap;
      |                             ^~~
../app/test-pmd/testpmd.c:2259:12: error: implicit declaration of function ‘rte_eth_tx_hairpin_queue_setup’; did you mean ‘rte_eth_tx_queue_setup’? [-Werror=implicit-function-declaration]
 2259 |     diag = rte_eth_tx_hairpin_queue_setup
      |            ^~~~~~~~~~~~~~~~~~~~~~~~~~~~~~
      |            rte_eth_tx_queue_setup
../app/test-pmd/testpmd.c:2281:12: error: implicit declaration of function ‘rte_eth_rx_hairpin_queue_setup’; did you mean ‘rte_eth_rx_queue_setup’? [-Werror=implicit-function-declaration]
 2281 |     diag = rte_eth_rx_hairpin_queue_setup
      |            ^~~~~~~~~~~~~~~~~~~~~~~~~~~~~~
      |            rte_eth_rx_queue_setup
../app/test-pmd/testpmd.c:2119:29: error: unused variable ‘cap’ [-Werror=unused-variable]
 2119 |  struct rte_eth_hairpin_cap cap;
      |                             ^~~
../app/test-pmd/testpmd.c:2115:30: error: unused variable ‘hairpin_conf’ [-Werror=unused-variable]
 2115 |  struct rte_eth_hairpin_conf hairpin_conf = {
      |                              ^~~~~~~~~~~~
cc1: all warnings being treated as errors
[1531/1858] Compiling C object 'app/a172ced@@dpdk-testpmd@exe/test-pmd_noisy_vnf.c.o'.
[1532/1858] Compiling C object 'app/a172ced@@dpdk-test-crypto-perf@exe/test-crypto-perf_cperf_test_vectors.c.o'.
[1533/1858] Compiling C object 'app/a172ced@@dpdk-test-bbdev@exe/test-bbdev_test_bbdev_perf.c.o'.
[1534/1858] Compiling C object 'app/a172ced@@dpdk-test-crypto-perf@exe/test-crypto-perf_cperf_test_verify.c.o'.
[1535/1858] Compiling C object 'app/a172ced@@dpdk-testpmd@exe/test-pmd_txonly.c.o'.
[1536/1858] Compiling C object 'drivers/a715181@@tmp_rte_pmd_octeontx2_event@sta/event_octeontx2_otx2_worker_dual.c.o'.
[1537/1858] Compiling C object 'drivers/a715181@@tmp_rte_pmd_octeontx2_event@sta/event_octeontx2_otx2_worker.c.o'.
ninja: build stopped: subcommand failed




*Meson Build Failed #4:
OS: UB1804-64
Target:build-gcc-static
FAILED: app/a172ced@@dpdk-testpmd@exe/test-pmd_testpmd.c.o 
gcc -Iapp/a172ced@@dpdk-testpmd@exe -Iapp -I../app -Ilib/librte_ethdev -I../lib/librte_ethdev -I. -I../ -Iconfig -I../config -Ilib/librte_eal/common/include -I../lib/librte_eal/common/include -I../lib/librte_eal/linux/eal/include -Ilib/librte_eal/common -I../lib/librte_eal/common -Ilib/librte_eal/common/include/arch/x86 -I../lib/librte_eal/common/include/arch/x86 -Ilib/librte_eal -I../lib/librte_eal -Ilib/librte_kvargs -I../lib/librte_kvargs -Ilib/librte_net -I../lib/librte_net -Ilib/librte_mbuf -I../lib/librte_mbuf -Ilib/librte_mempool -I../lib/librte_mempool -Ilib/librte_ring -I../lib/librte_ring -Ilib/librte_meter -I../lib/librte_meter -Ilib/librte_gro -I../lib/librte_gro -Ilib/librte_gso -I../lib/librte_gso -Ilib/librte_cmdline -I../lib/librte_cmdline -Ilib/librte_metrics -I../lib/librte_metrics -Idrivers/bus/pci -I../drivers/bus/pci -I../drivers/bus/pci/linux -Ilib/librte_pci -I../lib/librte_pci -Ilib/librte_pdump -I../lib/librte_pdump -Idrivers/net/bnxt -I../drivers/net/bnxt -Idrivers/bus/vdev -I../drivers/bus/vdev -Idrivers/net/i40e -I../drivers/net/i40e -Idrivers/net/i40e/base -I../drivers/net/i40e/base -Ilib/librte_hash -I../lib/librte_hash -Idrivers/net/ixgbe -I../drivers/net/ixgbe -Idrivers/net/ixgbe/base -I../drivers/net/ixgbe/base -Ilib/librte_security -I../lib/librte_security -Ilib/librte_cryptodev -I../lib/librte_cryptodev -Idrivers/net/softnic -I../drivers/net/softnic -Ilib/librte_pipeline -I../lib/librte_pipeline -Ilib/librte_port -I../lib/librte_port -Ilib/librte_sched -I../lib/librte_sched -Ilib/librte_ip_frag -I../lib/librte_ip_frag -Ilib/librte_kni -I../lib/librte_kni -Ilib/librte_table -I../lib/librte_table -Ilib/librte_lpm -I../lib/librte_lpm -Ilib/librte_acl -I../lib/librte_acl -Idrivers/bus/dpaa -I../drivers/bus/dpaa -I../drivers/bus/dpaa/include -I../drivers/bus/dpaa/base/qbman -Idrivers/common/dpaax -I../drivers/common/dpaax -Ilib/librte_eventdev -I../lib/librte_eventdev -Ilib/librte_timer -I../lib/librte_timer -Idrivers/mempool/dpaa -I../drivers/mempool/dpaa -Idrivers/net/dpaa -I../drivers/net/dpaa -Ilib/librte_bpf -I../lib/librte_bpf -fdiagnostics-color=always -pipe -D_FILE_OFFSET_BITS=64 -Wall -Winvalid-pch -Werror -O3 -include rte_config.h -Wunused-parameter -Wsign-compare -Wcast-qual -D_GNU_SOURCE -march=native -mno-avx512f -Wno-deprecated-declarations -DALLOW_EXPERIMENTAL_API -MD -MQ 'app/a172ced@@dpdk-testpmd@exe/test-pmd_testpmd.c.o' -MF 'app/a172ced@@dpdk-testpmd@exe/test-pmd_testpmd.c.o.d' -o 'app/a172ced@@dpdk-testpmd@exe/test-pmd_testpmd.c.o' -c ../app/test-pmd/testpmd.c
../app/test-pmd/testpmd.c: In function ‘get_allowed_max_nb_hairpinq’:
../app/test-pmd/testpmd.c:1117:29: error: storage size of ‘cap’ isn’t known
  struct rte_eth_hairpin_cap cap;
                             ^~~
../app/test-pmd/testpmd.c:1120:7: error: implicit declaration of function ‘rte_eth_dev_hairpin_capability_get’; did you mean ‘rte_eth_dev_rss_hash_conf_get’? [-Werror=implicit-function-declaration]
   if (rte_eth_dev_hairpin_capability_get(pi, &cap) != 0) {
       ^~~~~~~~~~~~~~~~~~~~~~~~~~~~~~~~~~
       rte_eth_dev_rss_hash_conf_get
../app/test-pmd/testpmd.c:1117:29: error: unused variable ‘cap’ [-Werror=unused-variable]
  struct rte_eth_hairpin_cap cap;
                             ^~~
../app/test-pmd/testpmd.c: In function ‘start_port’:
../app/test-pmd/testpmd.c:2115:9: error: variable ‘hairpin_conf’ has initializer but incomplete type
  struct rte_eth_hairpin_conf hairpin_conf = {
         ^~~~~~~~~~~~~~~~~~~~
../app/test-pmd/testpmd.c:2116:4: error: ‘struct rte_eth_hairpin_conf’ has no member named ‘peer_n’
   .peer_n = 1,
    ^~~~~~
../app/test-pmd/testpmd.c:2116:13: error: excess elements in struct initializer [-Werror]
   .peer_n = 1,
             ^
../app/test-pmd/testpmd.c:2116:13: note: (near initialization for ‘hairpin_conf’)
../app/test-pmd/testpmd.c:2115:30: error: storage size of ‘hairpin_conf’ isn’t known
  struct rte_eth_hairpin_conf hairpin_conf = {
                              ^~~~~~~~~~~~
../app/test-pmd/testpmd.c:2119:29: error: storage size of ‘cap’ isn’t known
  struct rte_eth_hairpin_cap cap;
                             ^~~
../app/test-pmd/testpmd.c:2259:12: error: implicit declaration of function ‘rte_eth_tx_hairpin_queue_setup’; did you mean ‘rte_eth_tx_queue_setup’? [-Werror=implicit-function-declaration]
     diag = rte_eth_tx_hairpin_queue_setup
            ^~~~~~~~~~~~~~~~~~~~~~~~~~~~~~
            rte_eth_tx_queue_setup
../app/test-pmd/testpmd.c:2281:12: error: implicit declaration of function ‘rte_eth_rx_hairpin_queue_setup’; did you mean ‘rte_eth_rx_queue_setup’? [-Werror=implicit-function-declaration]
     diag = rte_eth_rx_hairpin_queue_setup
            ^~~~~~~~~~~~~~~~~~~~~~~~~~~~~~
            rte_eth_rx_queue_setup
../app/test-pmd/testpmd.c:2119:29: error: unused variable ‘cap’ [-Werror=unused-variable]
  struct rte_eth_hairpin_cap cap;
                             ^~~
../app/test-pmd/testpmd.c:2115:30: error: unused variable ‘hairpin_conf’ [-Werror=unused-variable]
  struct rte_eth_hairpin_conf hairpin_conf = {
                              ^~~~~~~~~~~~
cc1: all warnings being treated as errors
[1518/1865] Compiling C object 'app/a172ced@@dpdk-test-acl@exe/test-acl_main.c.o'.
[1519/1865] Compiling C object 'app/a172ced@@dpdk-test-compress-perf@exe/test-compress-perf_main.c.o'.
[1520/1865] Compiling C object 'drivers/a715181@@tmp_rte_pmd_octeontx2_event@sta/event_octeontx2_otx2_worker.c.o'.
[1521/1865] Compiling C object 'app/a172ced@@dpdk-test-bbdev@exe/test-bbdev_test_bbdev_perf.c.o'.
[1522/1865] Compiling C object 'drivers/a715181@@tmp_rte_pmd_octeontx2_event@sta/event_octeontx2_otx2_worker_dual.c.o'.
ninja: build stopped: subcommand failed




*Meson Build Failed #5:
OS: FreeBSD12-64
Target:build-gcc-static
FAILED: app/a172ced@@dpdk-testpmd@exe/test-pmd_testpmd.c.o 
ccache gcc -Iapp/a172ced@@dpdk-testpmd@exe -Iapp -I../app -Ilib/librte_telemetry -I../lib/librte_telemetry -I. -I../ -Iconfig -I../config -Ilib/librte_eal/common/include -I../lib/librte_eal/common/include -I../lib/librte_eal/freebsd/eal/include -Ilib/librte_eal/common -I../lib/librte_eal/common -Ilib/librte_eal/common/include/arch/x86 -I../lib/librte_eal/common/include/arch/x86 -Ilib/librte_eal -I../lib/librte_eal -Ilib/librte_kvargs -I../lib/librte_kvargs -Ilib/librte_metrics -I../lib/librte_metrics -Ilib/librte_ethdev -I../lib/librte_ethdev -Ilib/librte_net -I../lib/librte_net -Ilib/librte_mbuf -I../lib/librte_mbuf -Ilib/librte_mempool -I../lib/librte_mempool -Ilib/librte_ring -I../lib/librte_ring -Ilib/librte_meter -I../lib/librte_meter -Ilib/librte_gro -I../lib/librte_gro -Ilib/librte_gso -I../lib/librte_gso -Ilib/librte_cmdline -I../lib/librte_cmdline -Idrivers/bus/pci -I../drivers/bus/pci -I../drivers/bus/pci/bsd -Ilib/librte_pci -I../lib/librte_pci -Ilib/librte_pdump -I../lib/librte_pdump -Idrivers/net/bnxt -I../drivers/net/bnxt -Idrivers/bus/vdev -I../drivers/bus/vdev -Idrivers/net/i40e -I../drivers/net/i40e -Idrivers/net/i40e/base -I../drivers/net/i40e/base -Ilib/librte_hash -I../lib/librte_hash -Idrivers/net/ixgbe -I../drivers/net/ixgbe -Idrivers/net/ixgbe/base -I../drivers/net/ixgbe/base -Ilib/librte_security -I../lib/librte_security -Ilib/librte_cryptodev -I../lib/librte_cryptodev -Ilib/librte_bpf -I../lib/librte_bpf -I/usr/local/include -fdiagnostics-color=always -pipe -D_FILE_OFFSET_BITS=64 -Wall -Winvalid-pch -Werror -O3 -include rte_config.h -Wunused-parameter -Wsign-compare -Wcast-qual -D_GNU_SOURCE -D__BSD_VISIBLE -march=native -Wno-deprecated-declarations -DALLOW_EXPERIMENTAL_API -MD -MQ 'app/a172ced@@dpdk-testpmd@exe/test-pmd_testpmd.c.o' -MF 'app/a172ced@@dpdk-testpmd@exe/test-pmd_testpmd.c.o.d' -o 'app/a172ced@@dpdk-testpmd@exe/test-pmd_testpmd.c.o' -c ../app/test-pmd/testpmd.c
../app/test-pmd/testpmd.c: In function 'get_allowed_max_nb_hairpinq':
../app/test-pmd/testpmd.c:1117:29: error: storage size of 'cap' isn't known
  struct rte_eth_hairpin_cap cap;
                             ^~~
../app/test-pmd/testpmd.c:1120:7: error: implicit declaration of function 'rte_eth_dev_hairpin_capability_get'; did you mean 'rte_eth_dev_rss_hash_conf_get'? [-Werror=implicit-function-declaration]
   if (rte_eth_dev_hairpin_capability_get(pi, &cap) != 0) {
       ^~~~~~~~~~~~~~~~~~~~~~~~~~~~~~~~~~
       rte_eth_dev_rss_hash_conf_get
../app/test-pmd/testpmd.c:1117:29: error: unused variable 'cap' [-Werror=unused-variable]
  struct rte_eth_hairpin_cap cap;
                             ^~~
../app/test-pmd/testpmd.c: In function 'start_port':
../app/test-pmd/testpmd.c:2115:9: error: variable 'hairpin_conf' has initializer but incomplete type
  struct rte_eth_hairpin_conf hairpin_conf = {
         ^~~~~~~~~~~~~~~~~~~~
../app/test-pmd/testpmd.c:2116:4: error: 'struct rte_eth_hairpin_conf' has no member named 'peer_n'
   .peer_n = 1,
    ^~~~~~
../app/test-pmd/testpmd.c:2116:13: error: excess elements in struct initializer [-Werror]
   .peer_n = 1,
             ^
../app/test-pmd/testpmd.c:2116:13: note: (near initialization for 'hairpin_conf')
../app/test-pmd/testpmd.c:2115:30: error: storage size of 'hairpin_conf' isn't known
  struct rte_eth_hairpin_conf hairpin_conf = {
                              ^~~~~~~~~~~~
../app/test-pmd/testpmd.c:2119:29: error: storage size of 'cap' isn't known
  struct rte_eth_hairpin_cap cap;
                             ^~~
../app/test-pmd/testpmd.c:2259:12: error: implicit declaration of function 'rte_eth_tx_hairpin_queue_setup'; did you mean 'rte_eth_tx_queue_setup'? [-Werror=implicit-function-declaration]
     diag = rte_eth_tx_hairpin_queue_setup
            ^~~~~~~~~~~~~~~~~~~~~~~~~~~~~~
            rte_eth_tx_queue_setup
../app/test-pmd/testpmd.c:2281:12: error: implicit declaration of function 'rte_eth_rx_hairpin_queue_setup'; did you mean 'rte_eth_rx_queue_setup'? [-Werror=implicit-function-declaration]
     diag = rte_eth_rx_hairpin_queue_setup
            ^~~~~~~~~~~~~~~~~~~~~~~~~~~~~~
            rte_eth_rx_queue_setup
../app/test-pmd/testpmd.c:2119:29: error: unused variable 'cap' [-Werror=unused-variable]
  struct rte_eth_hairpin_cap cap;
                             ^~~
../app/test-pmd/testpmd.c:2115:30: error: unused variable 'hairpin_conf' [-Werror=unused-variable]
  struct rte_eth_hairpin_conf hairpin_conf = {
                              ^~~~~~~~~~~~
cc1: all warnings being treated as errors
[1185/1442] Compiling C object 'app/a172ced@@dpdk-testpmd@exe/test-pmd_noisy_vnf.c.o'.
[1186/1442] Compiling C object 'app/a172ced@@dpdk-testpmd@exe/test-pmd_parameters.c.o'.
[1187/1442] Compiling C object 'app/a172ced@@dpdk-testpmd@exe/test-pmd_rxonly.c.o'.
[1188/1442] Compiling C object 'app/a172ced@@dpdk-testpmd@exe/test-pmd_txonly.c.o'.
[1189/1442] Compiling C object 'drivers/a715181@@tmp_rte_pmd_octeontx2_event@sta/event_octeontx2_otx2_worker_dual.c.o'.
ninja: build stopped: subcommand failed



DPDK STV team

^ permalink raw reply	[flat|nested] only message in thread

only message in thread, other threads:[~2019-10-17 19:09 UTC | newest]

Thread overview: (only message) (download: mbox.gz / follow: Atom feed)
-- links below jump to the message on this page --
2019-10-17 19:09 [dpdk-test-report] |FAILURE| pw61415[v4, 05/15] net/mlx5: prepare txq to work with different types sys_stv

automatic DPDK test reports

This inbox may be cloned and mirrored by anyone:

	git clone --mirror https://inbox.dpdk.org/test-report/0 test-report/git/0.git

	# If you have public-inbox 1.1+ installed, you may
	# initialize and index your mirror using the following commands:
	public-inbox-init -V2 test-report test-report/ https://inbox.dpdk.org/test-report \
		test-report@dpdk.org
	public-inbox-index test-report

Example config snippet for mirrors.
Newsgroup available over NNTP:
	nntp://inbox.dpdk.org/inbox.dpdk.test-report


AGPL code for this site: git clone https://public-inbox.org/public-inbox.git