automatic DPDK test reports
 help / color / mirror / Atom feed
* [dpdk-test-report] |FAILURE| pw61445[v2] app/test: add tests for atomic exchanges
@ 2019-10-17 23:21 sys_stv
  0 siblings, 0 replies; only message in thread
From: sys_stv @ 2019-10-17 23:21 UTC (permalink / raw)
  To: test-report

[-- Attachment #1: Type: text/plain, Size: 52167 bytes --]

Test-Label: Intel-compilation
Test-Status: FAILURE
http://dpdk.org/patch/61445

_Compilation issues_

Submitter: David Christensen <drc@linux.vnet.ibm.com>
Date: 2019-10-17 22:39:03
Reply_mail: 20191017223903.70437-1-drc@linux.vnet.ibm.com
DPDK git baseline: Repo:dpdk, CommitID: ad4305d0d5ed103cf5217eb120168ff8f285466c

Makefile build Summary: 22 Builds Done, 0 Successful, 22 Failures

Meson build Summary: 7 Builds Done, 2 Successful, 5 Failures

               +==============================================+===========+==========+
               |                   Makefile                   |   Meson   | Document |
+--------------+------+-------+------+------------+-----------+-----------+----------+
| os           | gcc  | clang | icc  | gcc+shared | gcc+debug | gcc/clang | pdf/html |
+--------------+------+-------+------+------------+-----------+-----------+----------+
| RHEL76-64    | FAIL |       |      |            |           |           |          |
| CENTOS76-64  | FAIL | FAIL  | FAIL | FAIL       | FAIL      |           |          |
| UB1804-64    | FAIL | FAIL  | FAIL |            |           | FAIL      | pass     |
| UB1604-32    | FAIL |       |      |            |           | FAIL      |          |
| UB1904-64    | FAIL |       |      |            |           |           |          |
| UB1604-64    | FAIL | FAIL  |      |            |           |           |          |
| FC30-64      | FAIL | FAIL  |      |            |           | FAIL      |          |
| WIN10-64     |      |       |      |            |           | pass      |          |
| FreeBSD12-64 | FAIL | FAIL  |      | FAIL       | FAIL      | FAIL      |          |
| RHEL80-64    | FAIL |       |      |            |           |           |          |
| SUSE15-64    | FAIL | FAIL  |      |            |           | FAIL      |          |
+--------------+------+-------+------+------------+-----------+-----------+----------+

Test environment and configuration as below:

** Makefile build **


OS: RHEL76-64
	Kernel Version: 3.10.0-957.el7.x86_64
	CPU info: Intel(R) Xeon(R) CPU E5-2699 v4 @ 2.20GHz
	GCC Version: gcc (GCC) 4.8.5 20150623 (Red Hat 4.8.5-36)
	Clang Version: NA
	x86_64-native-linuxapp-gcc


OS: CENTOS76-64
	Kernel Version: 3.10.0-957.27.2.el7.x86_64
	CPU info: Intel(R) Xeon(R) CPU E5-2699 v4 @ 2.20GHz
	GCC Version: gcc (GCC) 4.8.5 20150623 (Red Hat 4.8.5-36)
	Clang Version: 3.4.2 (tags/RELEASE_34/dot2-final)
	x86_64-native-linuxapp-clang
	x86_64-native-linuxapp-gcc+debug
	x86_64-native-linuxapp-gcc
	x86_64-native-linuxapp-gcc+shared
	x86_64-native-linuxapp-icc


OS: UB1804-64
	Kernel Version: 4.15.0-20-generic
	CPU info: Intel(R) Xeon(R) CPU E5-2699 v3 @ 2.30GHz
	GCC Version: gcc (Ubuntu 7.3.0-16ubuntu3) 7.3.0
	Clang Version: 6.0.0-1ubuntu2 (tags/RELEASE_600/final)
	x86_64-native-linuxapp-clang
	x86_64-native-linuxapp-icc
	x86_64-native-linuxapp-gcc


OS: UB1904-64
	Kernel Version: 5.0.0-13-generic
	CPU info: Intel(R) Xeon(R) CPU E5-2699 v3 @ 2.30GHz
	GCC Version: gcc (Ubuntu 8.3.0-6ubuntu1) 8.3.0
	Clang Version: 8.0.0-3 (tags/RELEASE_800/final)
	x86_64-native-linuxapp-gcc


OS: UB1604-32
	Kernel Version: 4.4.0-131-generic
	CPU info: Intel(R) Xeon(R) CPU E5-2699 v3 @ 2.30GHz
	GCC Version: gcc (Ubuntu 5.4.0-6ubuntu1~16.04.11) 5.4.0 20160609
	Clang Version: 3.8.0-2ubuntu4 (tags/RELEASE_380/final)
	i686-native-linuxapp-gcc


OS: UB1604-64
	Kernel Version: 4.4.0-47-generic
	CPU info: Intel(R) Xeon(R) CPU E5-2699 v3 @ 2.30GHz
	GCC Version: gcc (Ubuntu 5.4.0-6ubuntu1~16.04.10) 5.4.0 20160609
	Clang Version: 3.8.0-2ubuntu4 (tags/RELEASE_380/final)
	x86_64-native-linuxapp-clang
	x86_64-native-linuxapp-gcc


OS: FC30-64
	Kernel Version: 5.1.7-300.fc30.x86_64
	CPU info: Intel(R) Xeon(R) CPU E5-2699 v4 @ 2.20GHz
	GCC Version: gcc (GCC) 9.1.1 20190503 (Red Hat 9.1.1-1)
	Clang Version: 8.0.0 (Fedora 8.0.0-1.fc30)
	x86_64-native-linuxapp-gcc
	x86_64-native-linuxapp-clang


OS: FreeBSD12-64
	Kernel Version: 12.0-RC3
	CPU info: Intel(R) Xeon(R) CPU E5-2699 v4 @ 2.20GHz (2194.97-MHz K8-class CPU)
	GCC Version: gcc (FreeBSD Ports Collection) 7.3.0
	Clang Version: 6.0.1 (tags/RELEASE_601/final 335540) (based on LLVM 6.0.1)
	x86_64-native-bsdapp-gcc+shared
	x86_64-native-bsdapp-gcc+debug
	x86_64-native-bsdapp-clang
	x86_64-native-bsdapp-gcc


OS: RHEL80-64
	Kernel Version: 4.18.0-80.el8.x86_64
	CPU info: Intel(R) Xeon(R) CPU E5-2699 v4 @ 2.20GHz
	GCC Version: gcc (GCC) 8.2.1 20180905 (Red Hat 8.2.1-3)
	Clang Version: 6.0.1 (tags/RELEASE_601/final)
	x86_64-native-linuxapp-gcc


OS: SUSE15-64
	Kernel Version: 4.12.14-lp150.11-default
	CPU info: Intel(R) Xeon(R) CPU E5-2699 v4 @ 2.20GHz
	GCC Version: gcc (SUSE Linux) 7.3.1 20180323 [gcc-7-branch revision 258812]
	Clang Version: 5.0.1 (tags/RELEASE_501/final 312548)
	x86_64-native-linuxapp-gcc
	x86_64-native-linuxapp-clang


** Meson build **


OS: UB1804-64
	Kernel Version: 4.15.0-20-generic
	CPU info: Intel(R) Xeon(R) CPU E5-2699 v4 @ 2.20GHz
	GCC Version: gcc (Ubuntu 7.3.0-27ubuntu1~18.04) 7.3.0
	Clang Version: 6.0.0-1ubuntu2 (tags/RELEASE_600/final)
	x86_64-native-linuxapp-doc
	build-gcc-static
	build-gcc-shared
	build-clang-static
	build-clang-shared
	build-x86-default


OS: UB1604-32
	Kernel Version: 4.4.0-131-generic
	CPU info: Intel(R) Xeon(R) CPU E5-2699 v4 @ 2.20GHz
	GCC Version: gcc (Ubuntu 5.4.0-6ubuntu1~16.04.11) 5.4.0 20160609
	Clang Version: 3.8.0-2ubuntu4 (tags/RELEASE_380/final)
	build-gcc-static
	build-gcc-shared
	build-clang-static
	build-clang-shared
	build-x86-default


OS: FC30-64
	Kernel Version: 5.0.9-301.fc30.x86_64
	CPU info: Intel(R) Xeon(R) CPU E5-2699 v4 @ 2.20GHz
	GCC Version: gcc (GCC) 9.1.1 20190503 (Red Hat 9.1.1-1)
	Clang Version: 8.0.0 (Fedora 8.0.0-1.fc30)
	build-gcc-static
	build-gcc-shared
	build-clang-static
	build-clang-shared
	build-x86-default


OS: WIN10-64
	Kernel Version: N/A
	CPU info: N/A
	GCC Version: N/A
	Clang Version: Clang 8.0.0
	x86_64-windows-clang


OS: FreeBSD12-64
	Kernel Version: 12.0-RC3
	CPU info: Intel(R) Xeon(R) CPU E5-2699 v4 @ 2.20GHz (2194.97-MHz K8-class CPU)
	GCC Version: gcc (FreeBSD Ports Collection) 7.3.0
	Clang Version: 6.0.1 (tags/RELEASE_601/final 335540) (based on LLVM 6.0.1)
	build-gcc-static
	build-gcc-shared
	build-clang-static
	build-clang-shared
	build-x86-default


OS: SUSE15-64
	Kernel Version: 4.12.14-lp150.11-default
	CPU info: Intel(R) Xeon(R) CPU E5-2699 v4 @ 2.20GHz
	GCC Version: gcc (SUSE Linux) 7.3.1 20180323 [gcc-7-branch revision 258812]
	Clang Version: 5.0.1 (tags/RELEASE_501/final 312548)
	build-gcc-static
	build-gcc-shared
	build-clang-static
	build-clang-shared
	build-x86-default


*Make Build Failed #1:
OS: UB1604-64
Target: x86_64-native-linuxapp-clang
  CC test_ipsec.o
  MKRES test_resource_c.res.o
  LD test
test_atomic.o: In function `test_atomic_exchange':
/tmp/UB1604-64_K4.4.0_Clang3.8.0/x86_64-native-linuxapp-clang/4996765d99ea4e58993bb6efb827d52e/dpdk/app/test/test_atomic.c:(.text+0xdb7): undefined reference to `te_atomic64_inc'
clang: error: linker command failed with exit code 1 (use -v to see invocation)
/tmp/UB1604-64_K4.4.0_Clang3.8.0/x86_64-native-linuxapp-clang/4996765d99ea4e58993bb6efb827d52e/dpdk/mk/rte.app.mk:428: recipe for target 'test' failed
make[5]: *** [test] Error 1
/tmp/UB1604-64_K4.4.0_Clang3.8.0/x86_64-native-linuxapp-clang/4996765d99ea4e58993bb6efb827d52e/dpdk/mk/rte.subdir.mk:35: recipe for target 'test' failed
make[4]: *** [test] Error 2
/tmp/UB1604-64_K4.4.0_Clang3.8.0/x86_64-native-linuxapp-clang/4996765d99ea4e58993bb6efb827d52e/dpdk/mk/rte.sdkbuild.mk:46: recipe for target 'app' failed
make[3]: *** [app] Error 2
/tmp/UB1604-64_K4.4.0_Clang3.8.0/x86_64-native-linuxapp-clang/4996765d99ea4e58993bb6efb827d52e/dpdk/mk/rte.sdkroot.mk:98: recipe for target 'all' failed
make[2]: *** [all] Error 2
/tmp/UB1604-64_K4.4.0_Clang3.8.0/x86_64-native-linuxapp-clang/4996765d99ea4e58993bb6efb827d52e/dpdk/mk/rte.sdkinstall.mk:60: recipe for target 'pre_install' failed
make[1]: *** [pre_install] Error 2
/tmp/UB1604-64_K4.4.0_Clang3.8.0/x86_64-native-linuxapp-clang/4996765d99ea4e58993bb6efb827d52e/dpdk/mk/rte.sdkroot.mk:77: recipe for target 'install' failed
make: *** [install] Error 2


*Make Build Failed #2:
OS: UB1604-32
Target: i686-native-linuxapp-gcc
  MKRES test_resource_c.res.o
  LD test
test_atomic.o: In function `test_atomic_exchange':
test_atomic.c:(.text+0x314): undefined reference to `te_atomic64_inc'
collect2: error: ld returned 1 exit status
/tmp/UB1604-32_K4.4.0_GCC5.4.0/i686-native-linuxapp-gcc/4996765d99ea4e58993bb6efb827d52e/dpdk/mk/rte.app.mk:428: recipe for target 'test' failed
make[5]: *** [test] Error 1
/tmp/UB1604-32_K4.4.0_GCC5.4.0/i686-native-linuxapp-gcc/4996765d99ea4e58993bb6efb827d52e/dpdk/mk/rte.subdir.mk:35: recipe for target 'test' failed
make[4]: *** [test] Error 2
/tmp/UB1604-32_K4.4.0_GCC5.4.0/i686-native-linuxapp-gcc/4996765d99ea4e58993bb6efb827d52e/dpdk/mk/rte.sdkbuild.mk:46: recipe for target 'app' failed
make[3]: *** [app] Error 2
/tmp/UB1604-32_K4.4.0_GCC5.4.0/i686-native-linuxapp-gcc/4996765d99ea4e58993bb6efb827d52e/dpdk/mk/rte.sdkroot.mk:98: recipe for target 'all' failed
make[2]: *** [all] Error 2
/tmp/UB1604-32_K4.4.0_GCC5.4.0/i686-native-linuxapp-gcc/4996765d99ea4e58993bb6efb827d52e/dpdk/mk/rte.sdkinstall.mk:60: recipe for target 'pre_install' failed
make[1]: *** [pre_install] Error 2
/tmp/UB1604-32_K4.4.0_GCC5.4.0/i686-native-linuxapp-gcc/4996765d99ea4e58993bb6efb827d52e/dpdk/mk/rte.sdkroot.mk:77: recipe for target 'install' failed
make: *** [install] Error 2


*Make Build Failed #3:
OS: UB1904-64
Target: x86_64-native-linuxapp-gcc
  MKRES test_resource_c.res.o
  LD test
/usr/local/bin/ld: test_atomic.o: in function `test_atomic_exchange':
test_atomic.c:(.text+0x2d3): undefined reference to `te_atomic64_inc'
collect2: error: ld returned 1 exit status
make[5]: *** [/tmp/UB1904-64_K4.18.0_GCC8.3.0/x86_64-native-linuxapp-gcc/4996765d99ea4e58993bb6efb827d52e/dpdk/mk/rte.app.mk:430: test] Error 1
make[4]: *** [/tmp/UB1904-64_K4.18.0_GCC8.3.0/x86_64-native-linuxapp-gcc/4996765d99ea4e58993bb6efb827d52e/dpdk/mk/rte.subdir.mk:35: test] Error 2
make[3]: *** [/tmp/UB1904-64_K4.18.0_GCC8.3.0/x86_64-native-linuxapp-gcc/4996765d99ea4e58993bb6efb827d52e/dpdk/mk/rte.sdkbuild.mk:48: app] Error 2
make[2]: *** [/tmp/UB1904-64_K4.18.0_GCC8.3.0/x86_64-native-linuxapp-gcc/4996765d99ea4e58993bb6efb827d52e/dpdk/mk/rte.sdkroot.mk:99: all] Error 2
make[1]: *** [/tmp/UB1904-64_K4.18.0_GCC8.3.0/x86_64-native-linuxapp-gcc/4996765d99ea4e58993bb6efb827d52e/dpdk/mk/rte.sdkinstall.mk:61: pre_install] Error 2
make: *** [/tmp/UB1904-64_K4.18.0_GCC8.3.0/x86_64-native-linuxapp-gcc/4996765d99ea4e58993bb6efb827d52e/dpdk/mk/rte.sdkroot.mk:77: install] Error 2


*Make Build Failed #4:
OS: UB1804-64
Target: x86_64-native-linuxapp-clang
  CC test_rcu_qsbr_perf.o
  MKRES test_resource_c.res.o
  LD test
test_atomic.o: In function `test_atomic_exchange':
test_atomic.c:(.text+0xd5e): undefined reference to `te_atomic64_inc'
clang: error: linker command failed with exit code 1 (use -v to see invocation)
/tmp/UB1804-64_K4.15.0_Clang6.0.0/x86_64-native-linuxapp-clang/4996765d99ea4e58993bb6efb827d52e/dpdk/mk/rte.app.mk:428: recipe for target 'test' failed
make[5]: *** [test] Error 1
/tmp/UB1804-64_K4.15.0_Clang6.0.0/x86_64-native-linuxapp-clang/4996765d99ea4e58993bb6efb827d52e/dpdk/mk/rte.subdir.mk:35: recipe for target 'test' failed
make[4]: *** [test] Error 2
/tmp/UB1804-64_K4.15.0_Clang6.0.0/x86_64-native-linuxapp-clang/4996765d99ea4e58993bb6efb827d52e/dpdk/mk/rte.sdkbuild.mk:46: recipe for target 'app' failed
make[3]: *** [app] Error 2
/tmp/UB1804-64_K4.15.0_Clang6.0.0/x86_64-native-linuxapp-clang/4996765d99ea4e58993bb6efb827d52e/dpdk/mk/rte.sdkroot.mk:98: recipe for target 'all' failed
make[2]: *** [all] Error 2
/tmp/UB1804-64_K4.15.0_Clang6.0.0/x86_64-native-linuxapp-clang/4996765d99ea4e58993bb6efb827d52e/dpdk/mk/rte.sdkinstall.mk:60: recipe for target 'pre_install' failed
make[1]: *** [pre_install] Error 2
/tmp/UB1804-64_K4.15.0_Clang6.0.0/x86_64-native-linuxapp-clang/4996765d99ea4e58993bb6efb827d52e/dpdk/mk/rte.sdkroot.mk:77: recipe for target 'install' failed
make: *** [install] Error 2


*Make Build Failed #5:
OS: UB1804-64
Target: x86_64-native-linuxapp-icc
  CC test_ipsec.o
  MKRES test_resource_c.res.o
  LD test
ld: test_atomic.o: in function `test_atomic_exchange':
test_atomic.c:(.text+0x545): undefined reference to `te_atomic64_inc'
/tmp/UB1804-64_K4.15.0_ICC19.0.0/x86_64-native-linuxapp-icc/4996765d99ea4e58993bb6efb827d52e/dpdk/mk/rte.app.mk:428: recipe for target 'test' failed
make[5]: *** [test] Error 1
/tmp/UB1804-64_K4.15.0_ICC19.0.0/x86_64-native-linuxapp-icc/4996765d99ea4e58993bb6efb827d52e/dpdk/mk/rte.subdir.mk:35: recipe for target 'test' failed
make[4]: *** [test] Error 2
/tmp/UB1804-64_K4.15.0_ICC19.0.0/x86_64-native-linuxapp-icc/4996765d99ea4e58993bb6efb827d52e/dpdk/mk/rte.sdkbuild.mk:46: recipe for target 'app' failed
make[3]: *** [app] Error 2
/tmp/UB1804-64_K4.15.0_ICC19.0.0/x86_64-native-linuxapp-icc/4996765d99ea4e58993bb6efb827d52e/dpdk/mk/rte.sdkroot.mk:98: recipe for target 'all' failed
make[2]: *** [all] Error 2
/tmp/UB1804-64_K4.15.0_ICC19.0.0/x86_64-native-linuxapp-icc/4996765d99ea4e58993bb6efb827d52e/dpdk/mk/rte.sdkinstall.mk:60: recipe for target 'pre_install' failed
make[1]: *** [pre_install] Error 2
/tmp/UB1804-64_K4.15.0_ICC19.0.0/x86_64-native-linuxapp-icc/4996765d99ea4e58993bb6efb827d52e/dpdk/mk/rte.sdkroot.mk:77: recipe for target 'install' failed
make: *** [install] Error 2


*Make Build Failed #6:
OS: FC30-64
Target: x86_64-native-linuxapp-gcc
  MKRES test_resource_c.res.o
  LD test
/usr/local/bin/ld: test_atomic.o: in function `test_atomic_exchange':
test_atomic.c:(.text+0x2e2): undefined reference to `te_atomic64_inc'
collect2: error: ld returned 1 exit status
make[5]: *** [/tmp/FC30-64_K4.20_GCC9.1.1/x86_64-native-linuxapp-gcc/4996765d99ea4e58993bb6efb827d52e/dpdk/mk/rte.app.mk:430: test] Error 1
make[4]: *** [/tmp/FC30-64_K4.20_GCC9.1.1/x86_64-native-linuxapp-gcc/4996765d99ea4e58993bb6efb827d52e/dpdk/mk/rte.subdir.mk:35: test] Error 2
make[3]: *** [/tmp/FC30-64_K4.20_GCC9.1.1/x86_64-native-linuxapp-gcc/4996765d99ea4e58993bb6efb827d52e/dpdk/mk/rte.sdkbuild.mk:48: app] Error 2
make[2]: *** [/tmp/FC30-64_K4.20_GCC9.1.1/x86_64-native-linuxapp-gcc/4996765d99ea4e58993bb6efb827d52e/dpdk/mk/rte.sdkroot.mk:99: all] Error 2
make[1]: *** [/tmp/FC30-64_K4.20_GCC9.1.1/x86_64-native-linuxapp-gcc/4996765d99ea4e58993bb6efb827d52e/dpdk/mk/rte.sdkinstall.mk:61: pre_install] Error 2
make: *** [/tmp/FC30-64_K4.20_GCC9.1.1/x86_64-native-linuxapp-gcc/4996765d99ea4e58993bb6efb827d52e/dpdk/mk/rte.sdkroot.mk:77: install] Error 2


*Make Build Failed #7:
OS: SUSE15-64
Target: x86_64-native-linuxapp-gcc
  MKRES test_resource_c.res.o
  LD test
test_atomic.o: In function `test_atomic_exchange':
test_atomic.c:(.text+0x2ed): undefined reference to `te_atomic64_inc'
collect2: error: ld returned 1 exit status
make[5]: *** [/tmp/SUSE15-64_K4.12.14_GCC7.3.1/x86_64-native-linuxapp-gcc/4996765d99ea4e58993bb6efb827d52e/dpdk/mk/rte.app.mk:430: test] Error 1
make[4]: *** [/tmp/SUSE15-64_K4.12.14_GCC7.3.1/x86_64-native-linuxapp-gcc/4996765d99ea4e58993bb6efb827d52e/dpdk/mk/rte.subdir.mk:35: test] Error 2
make[3]: *** [/tmp/SUSE15-64_K4.12.14_GCC7.3.1/x86_64-native-linuxapp-gcc/4996765d99ea4e58993bb6efb827d52e/dpdk/mk/rte.sdkbuild.mk:48: app] Error 2
make[2]: *** [/tmp/SUSE15-64_K4.12.14_GCC7.3.1/x86_64-native-linuxapp-gcc/4996765d99ea4e58993bb6efb827d52e/dpdk/mk/rte.sdkroot.mk:99: all] Error 2
make[1]: *** [/tmp/SUSE15-64_K4.12.14_GCC7.3.1/x86_64-native-linuxapp-gcc/4996765d99ea4e58993bb6efb827d52e/dpdk/mk/rte.sdkinstall.mk:61: pre_install] Error 2
make: *** [/tmp/SUSE15-64_K4.12.14_GCC7.3.1/x86_64-native-linuxapp-gcc/4996765d99ea4e58993bb6efb827d52e/dpdk/mk/rte.sdkroot.mk:77: install] Error 2


*Make Build Failed #8:
OS: RHEL80-64
Target: x86_64-native-linuxapp-gcc
  MKRES test_resource_c.res.o
  LD test
/usr/local/bin/ld: test_atomic.o: in function `test_atomic_exchange':
test_atomic.c:(.text+0x2ed): undefined reference to `te_atomic64_inc'
collect2: error: ld returned 1 exit status
make[5]: *** [/tmp/RHEL80-64_K3.10.0_GCC8.2.1/x86_64-native-linuxapp-gcc/4996765d99ea4e58993bb6efb827d52e/dpdk/mk/rte.app.mk:430: test] Error 1
make[4]: *** [/tmp/RHEL80-64_K3.10.0_GCC8.2.1/x86_64-native-linuxapp-gcc/4996765d99ea4e58993bb6efb827d52e/dpdk/mk/rte.subdir.mk:35: test] Error 2
make[3]: *** [/tmp/RHEL80-64_K3.10.0_GCC8.2.1/x86_64-native-linuxapp-gcc/4996765d99ea4e58993bb6efb827d52e/dpdk/mk/rte.sdkbuild.mk:48: app] Error 2
make[2]: *** [/tmp/RHEL80-64_K3.10.0_GCC8.2.1/x86_64-native-linuxapp-gcc/4996765d99ea4e58993bb6efb827d52e/dpdk/mk/rte.sdkroot.mk:99: all] Error 2
make[1]: *** [/tmp/RHEL80-64_K3.10.0_GCC8.2.1/x86_64-native-linuxapp-gcc/4996765d99ea4e58993bb6efb827d52e/dpdk/mk/rte.sdkinstall.mk:61: pre_install] Error 2
make: *** [/tmp/RHEL80-64_K3.10.0_GCC8.2.1/x86_64-native-linuxapp-gcc/4996765d99ea4e58993bb6efb827d52e/dpdk/mk/rte.sdkroot.mk:77: install] Error 2


*Make Build Failed #9:
OS: RHEL76-64
Target: x86_64-native-linuxapp-gcc
    te_atomic64_inc(&count);
    ^
/tmp/RHEL76-64_K3.10.0_GCC4.8.5/x86_64-native-linuxapp-gcc/4996765d99ea4e58993bb6efb827d52e/dpdk/app/test/test_atomic.c:349:4: warning: nested extern declaration of ‘te_atomic64_inc’ [-Wnested-externs]
/tmp/RHEL76-64_K3.10.0_GCC4.8.5/x86_64-native-linuxapp-gcc/4996765d99ea4e58993bb6efb827d52e/dpdk/app/test/test_atomic.c: At top level:
cc1: warning: unrecognized command line option "-Wno-address-of-packed-member" [enabled by default]
make[5]: *** [test_atomic.o] Error 1
make[5]: *** Waiting for unfinished jobs....
  CC test_barrier.o
  CC pipeline_acl.o
  CC cperf_test_verify.o
  LD dpdk-test-compress-perf
make[4]: *** [test] Error 2
make[4]: *** Waiting for unfinished jobs....
  CC cperf_test_vector_parsing.o
  CC cperf_test_common.o
  LD testpipeline
  CC cmdline_mtr.o
--
  LD testpmd
  INSTALL-APP dpdk-test-eventdev
  INSTALL-MAP dpdk-test-eventdev.map
  INSTALL-APP testpmd
  INSTALL-MAP testpmd.map
make[3]: *** [app] Error 2
make[2]: *** [all] Error 2
make[1]: *** [pre_install] Error 2
make: *** [install] Error 2


*Make Build Failed #10:
OS: FC30-64
Target: x86_64-native-linuxapp-clang
  CC test_ipsec.o
  MKRES test_resource_c.res.o
  LD test
/usr/bin/ld: test_atomic.o: in function `test_atomic_exchange':
test_atomic.c:(.text+0xd4d): undefined reference to `te_atomic64_inc'
clang-8: error: linker command failed with exit code 1 (use -v to see invocation)
make[5]: *** [/tmp/FC30-64_K4.20_Clang8.0.0/x86_64-native-linuxapp-clang/4996765d99ea4e58993bb6efb827d52e/dpdk/mk/rte.app.mk:430: test] Error 1
make[4]: *** [/tmp/FC30-64_K4.20_Clang8.0.0/x86_64-native-linuxapp-clang/4996765d99ea4e58993bb6efb827d52e/dpdk/mk/rte.subdir.mk:35: test] Error 2
make[3]: *** [/tmp/FC30-64_K4.20_Clang8.0.0/x86_64-native-linuxapp-clang/4996765d99ea4e58993bb6efb827d52e/dpdk/mk/rte.sdkbuild.mk:48: app] Error 2
make[2]: *** [/tmp/FC30-64_K4.20_Clang8.0.0/x86_64-native-linuxapp-clang/4996765d99ea4e58993bb6efb827d52e/dpdk/mk/rte.sdkroot.mk:99: all] Error 2
make[1]: *** [/tmp/FC30-64_K4.20_Clang8.0.0/x86_64-native-linuxapp-clang/4996765d99ea4e58993bb6efb827d52e/dpdk/mk/rte.sdkinstall.mk:61: pre_install] Error 2
make: *** [/tmp/FC30-64_K4.20_Clang8.0.0/x86_64-native-linuxapp-clang/4996765d99ea4e58993bb6efb827d52e/dpdk/mk/rte.sdkroot.mk:77: install] Error 2


*Make Build Failed #11:
OS: SUSE15-64
Target: x86_64-native-linuxapp-clang
  CC test_ipsec.o
  MKRES test_resource_c.res.o
  LD test
test_atomic.o: In function `test_atomic_exchange':
/tmp/SUSE15-64_K4.12.14_Clang5.0.1/x86_64-native-linuxapp-clang/4996765d99ea4e58993bb6efb827d52e/dpdk/app/test/test_atomic.c:(.text+0xd6e): undefined reference to `te_atomic64_inc'
clang-5.0.1: error: linker command failed with exit code 1 (use -v to see invocation)
make[5]: *** [/tmp/SUSE15-64_K4.12.14_Clang5.0.1/x86_64-native-linuxapp-clang/4996765d99ea4e58993bb6efb827d52e/dpdk/mk/rte.app.mk:430: test] Error 1
make[4]: *** [/tmp/SUSE15-64_K4.12.14_Clang5.0.1/x86_64-native-linuxapp-clang/4996765d99ea4e58993bb6efb827d52e/dpdk/mk/rte.subdir.mk:35: test] Error 2
make[3]: *** [/tmp/SUSE15-64_K4.12.14_Clang5.0.1/x86_64-native-linuxapp-clang/4996765d99ea4e58993bb6efb827d52e/dpdk/mk/rte.sdkbuild.mk:48: app] Error 2
make[2]: *** [/tmp/SUSE15-64_K4.12.14_Clang5.0.1/x86_64-native-linuxapp-clang/4996765d99ea4e58993bb6efb827d52e/dpdk/mk/rte.sdkroot.mk:99: all] Error 2
make[1]: *** [/tmp/SUSE15-64_K4.12.14_Clang5.0.1/x86_64-native-linuxapp-clang/4996765d99ea4e58993bb6efb827d52e/dpdk/mk/rte.sdkinstall.mk:61: pre_install] Error 2
make: *** [/tmp/SUSE15-64_K4.12.14_Clang5.0.1/x86_64-native-linuxapp-clang/4996765d99ea4e58993bb6efb827d52e/dpdk/mk/rte.sdkroot.mk:77: install] Error 2


*Make Build Failed #12:
OS: UB1604-64
Target: x86_64-native-linuxapp-gcc
  MKRES test_resource_c.res.o
  LD test
test_atomic.o: In function `test_atomic_exchange':
test_atomic.c:(.text+0x30d): undefined reference to `te_atomic64_inc'
collect2: error: ld returned 1 exit status
/tmp/UB1604-64_K4.4.0_GCC5.4.0/x86_64-native-linuxapp-gcc/4996765d99ea4e58993bb6efb827d52e/dpdk/mk/rte.app.mk:428: recipe for target 'test' failed
make[5]: *** [test] Error 1
/tmp/UB1604-64_K4.4.0_GCC5.4.0/x86_64-native-linuxapp-gcc/4996765d99ea4e58993bb6efb827d52e/dpdk/mk/rte.subdir.mk:35: recipe for target 'test' failed
make[4]: *** [test] Error 2
/tmp/UB1604-64_K4.4.0_GCC5.4.0/x86_64-native-linuxapp-gcc/4996765d99ea4e58993bb6efb827d52e/dpdk/mk/rte.sdkbuild.mk:46: recipe for target 'app' failed
make[3]: *** [app] Error 2
/tmp/UB1604-64_K4.4.0_GCC5.4.0/x86_64-native-linuxapp-gcc/4996765d99ea4e58993bb6efb827d52e/dpdk/mk/rte.sdkroot.mk:98: recipe for target 'all' failed
make[2]: *** [all] Error 2
/tmp/UB1604-64_K4.4.0_GCC5.4.0/x86_64-native-linuxapp-gcc/4996765d99ea4e58993bb6efb827d52e/dpdk/mk/rte.sdkinstall.mk:60: recipe for target 'pre_install' failed
make[1]: *** [pre_install] Error 2
/tmp/UB1604-64_K4.4.0_GCC5.4.0/x86_64-native-linuxapp-gcc/4996765d99ea4e58993bb6efb827d52e/dpdk/mk/rte.sdkroot.mk:77: recipe for target 'install' failed
make: *** [install] Error 2


*Make Build Failed #13:
OS: UB1804-64
Target: x86_64-native-linuxapp-gcc
  MKRES test_resource_c.res.o
  LD test
test_atomic.o: In function `test_atomic_exchange':
test_atomic.c:(.text+0x2d3): undefined reference to `te_atomic64_inc'
collect2: error: ld returned 1 exit status
/tmp/UB1804-64_K4.15.0_GCC7.3.0/x86_64-native-linuxapp-gcc/4996765d99ea4e58993bb6efb827d52e/dpdk/mk/rte.app.mk:428: recipe for target 'test' failed
make[5]: *** [test] Error 1
/tmp/UB1804-64_K4.15.0_GCC7.3.0/x86_64-native-linuxapp-gcc/4996765d99ea4e58993bb6efb827d52e/dpdk/mk/rte.subdir.mk:35: recipe for target 'test' failed
make[4]: *** [test] Error 2
/tmp/UB1804-64_K4.15.0_GCC7.3.0/x86_64-native-linuxapp-gcc/4996765d99ea4e58993bb6efb827d52e/dpdk/mk/rte.sdkbuild.mk:46: recipe for target 'app' failed
make[3]: *** [app] Error 2
/tmp/UB1804-64_K4.15.0_GCC7.3.0/x86_64-native-linuxapp-gcc/4996765d99ea4e58993bb6efb827d52e/dpdk/mk/rte.sdkroot.mk:98: recipe for target 'all' failed
make[2]: *** [all] Error 2
/tmp/UB1804-64_K4.15.0_GCC7.3.0/x86_64-native-linuxapp-gcc/4996765d99ea4e58993bb6efb827d52e/dpdk/mk/rte.sdkinstall.mk:60: recipe for target 'pre_install' failed
make[1]: *** [pre_install] Error 2
/tmp/UB1804-64_K4.15.0_GCC7.3.0/x86_64-native-linuxapp-gcc/4996765d99ea4e58993bb6efb827d52e/dpdk/mk/rte.sdkroot.mk:77: recipe for target 'install' failed
make: *** [install] Error 2


*Make Build Failed #14:
OS: CENTOS76-64
Target: x86_64-native-linuxapp-clang
  CC test_ipsec.o
  MKRES test_resource_c.res.o
  LD test
test_atomic.o: In function `test_atomic_exchange':
/tmp/CENTOS76-64_K3.10.0_Clang3.4.2/x86_64-native-linuxapp-clang/4996765d99ea4e58993bb6efb827d52e/dpdk/app/test/test_atomic.c:(.text+0xb10): undefined reference to `te_atomic64_inc'
clang: error: linker command failed with exit code 1 (use -v to see invocation)
make[5]: *** [test] Error 1
make[4]: *** [test] Error 2
make[3]: *** [app] Error 2
make[2]: *** [all] Error 2
make[1]: *** [pre_install] Error 2
make: *** [install] Error 2


*Make Build Failed #15:
OS: CENTOS76-64
Target: x86_64-native-linuxapp-gcc+debug
    te_atomic64_inc(&count);
    ^
/tmp/CENTOS76-64_K3.10.0_GCC4.8.5/x86_64-native-linuxapp-gcc+debug/4996765d99ea4e58993bb6efb827d52e/dpdk/app/test/test_atomic.c:349:4: warning: nested extern declaration of ‘te_atomic64_inc’ [-Wnested-externs]
/tmp/CENTOS76-64_K3.10.0_GCC4.8.5/x86_64-native-linuxapp-gcc+debug/4996765d99ea4e58993bb6efb827d52e/dpdk/app/test/test_atomic.c: At top level:
cc1: warning: unrecognized command line option "-Wno-address-of-packed-member" [enabled by default]
make[5]: *** [test_atomic.o] Error 1
make[4]: *** [test] Error 2
make[4]: *** Waiting for unfinished jobs....
  CC test_bbdev_vector.o
  LD dpdk-test-crypto-perf
  CC cmdline_mtr.o
  CC test_order_queue.o
--
  INSTALL-MAP testbbdev.map
  CC softnicfwd.o
  LD testpmd
  INSTALL-APP testpmd
  INSTALL-MAP testpmd.map
make[3]: *** [app] Error 2
make[2]: *** [all] Error 2
make[1]: *** [pre_install] Error 2
make: *** [install] Error 2


*Make Build Failed #16:
OS: FreeBSD12-64
Target: x86_64-native-bsdapp-gcc+shared
  MKRES test_resource_c.res.o
  LD test
test_atomic.o: In function `test_atomic_exchange':
test_atomic.c:(.text+0x2d9): undefined reference to `te_atomic64_inc'
collect2: error: ld returned 1 exit status
gmake[5]: *** [/tmp/FreeBSD12-64_K19.02_GCC7.3.0/x86_64-native-bsdapp-gcc+shared/4996765d99ea4e58993bb6efb827d52e/dpdk/mk/rte.app.mk:430: test] Error 1
gmake[4]: *** [/tmp/FreeBSD12-64_K19.02_GCC7.3.0/x86_64-native-bsdapp-gcc+shared/4996765d99ea4e58993bb6efb827d52e/dpdk/mk/rte.subdir.mk:35: test] Error 2
gmake[3]: *** [/tmp/FreeBSD12-64_K19.02_GCC7.3.0/x86_64-native-bsdapp-gcc+shared/4996765d99ea4e58993bb6efb827d52e/dpdk/mk/rte.sdkbuild.mk:48: app] Error 2
gmake[2]: *** [/tmp/FreeBSD12-64_K19.02_GCC7.3.0/x86_64-native-bsdapp-gcc+shared/4996765d99ea4e58993bb6efb827d52e/dpdk/mk/rte.sdkroot.mk:99: all] Error 2
gmake[1]: *** [/tmp/FreeBSD12-64_K19.02_GCC7.3.0/x86_64-native-bsdapp-gcc+shared/4996765d99ea4e58993bb6efb827d52e/dpdk/mk/rte.sdkinstall.mk:61: pre_install] Error 2
gmake: *** [/tmp/FreeBSD12-64_K19.02_GCC7.3.0/x86_64-native-bsdapp-gcc+shared/4996765d99ea4e58993bb6efb827d52e/dpdk/mk/rte.sdkroot.mk:77: install] Error 2


*Make Build Failed #17:
OS: FreeBSD12-64
Target: x86_64-native-bsdapp-gcc+debug
  MKRES test_resource_c.res.o
  LD test
test_atomic.o: In function `test_atomic_exchange':
test_atomic.c:(.text+0x2ed): undefined reference to `te_atomic64_inc'
collect2: error: ld returned 1 exit status
gmake[5]: *** [/tmp/FreeBSD12-64_K19.02_GCC7.3.0/x86_64-native-bsdapp-gcc+debug/4996765d99ea4e58993bb6efb827d52e/dpdk/mk/rte.app.mk:430: test] Error 1
gmake[4]: *** [/tmp/FreeBSD12-64_K19.02_GCC7.3.0/x86_64-native-bsdapp-gcc+debug/4996765d99ea4e58993bb6efb827d52e/dpdk/mk/rte.subdir.mk:35: test] Error 2
gmake[3]: *** [/tmp/FreeBSD12-64_K19.02_GCC7.3.0/x86_64-native-bsdapp-gcc+debug/4996765d99ea4e58993bb6efb827d52e/dpdk/mk/rte.sdkbuild.mk:48: app] Error 2
gmake[2]: *** [/tmp/FreeBSD12-64_K19.02_GCC7.3.0/x86_64-native-bsdapp-gcc+debug/4996765d99ea4e58993bb6efb827d52e/dpdk/mk/rte.sdkroot.mk:99: all] Error 2
gmake[1]: *** [/tmp/FreeBSD12-64_K19.02_GCC7.3.0/x86_64-native-bsdapp-gcc+debug/4996765d99ea4e58993bb6efb827d52e/dpdk/mk/rte.sdkinstall.mk:61: pre_install] Error 2
gmake: *** [/tmp/FreeBSD12-64_K19.02_GCC7.3.0/x86_64-native-bsdapp-gcc+debug/4996765d99ea4e58993bb6efb827d52e/dpdk/mk/rte.sdkroot.mk:77: install] Error 2


*Make Build Failed #18:
OS: CENTOS76-64
Target: x86_64-native-linuxapp-gcc
    te_atomic64_inc(&count);
    ^
/tmp/CENTOS76-64_K3.10.0_GCC4.8.5/x86_64-native-linuxapp-gcc/4996765d99ea4e58993bb6efb827d52e/dpdk/app/test/test_atomic.c:349:4: warning: nested extern declaration of ‘te_atomic64_inc’ [-Wnested-externs]
/tmp/CENTOS76-64_K3.10.0_GCC4.8.5/x86_64-native-linuxapp-gcc/4996765d99ea4e58993bb6efb827d52e/dpdk/app/test/test_atomic.c: At top level:
cc1: warning: unrecognized command line option "-Wno-address-of-packed-member" [enabled by default]
make[5]: *** [test_atomic.o] Error 1
make[4]: *** [test] Error 2
make[4]: *** Waiting for unfinished jobs....
  CC pipeline_lpm.o
  CC cmdline.o
  CC cperf_test_common.o
  CC cmdline_flow.o
--
  INSTALL-APP dpdk-test-eventdev
  INSTALL-MAP dpdk-test-eventdev.map
  LD testpmd
  INSTALL-APP testpmd
  INSTALL-MAP testpmd.map
make[3]: *** [app] Error 2
make[2]: *** [all] Error 2
make[1]: *** [pre_install] Error 2
make: *** [install] Error 2


*Make Build Failed #19:
OS: FreeBSD12-64
Target: x86_64-native-bsdapp-clang
  MKRES test_resource_c.res.o
  LD test
/usr/bin/ld: error: undefined symbol: te_atomic64_inc
>>> referenced by test_atomic.c
>>>               test_atomic.o:(test_atomic_exchange)
clang: error: linker command failed with exit code 1 (use -v to see invocation)
gmake[5]: *** [/tmp/FreeBSD12-64_K19.02_Clang6.0.1/x86_64-native-bsdapp-clang/4996765d99ea4e58993bb6efb827d52e/dpdk/mk/rte.app.mk:430: test] Error 1
gmake[4]: *** [/tmp/FreeBSD12-64_K19.02_Clang6.0.1/x86_64-native-bsdapp-clang/4996765d99ea4e58993bb6efb827d52e/dpdk/mk/rte.subdir.mk:35: test] Error 2
gmake[3]: *** [/tmp/FreeBSD12-64_K19.02_Clang6.0.1/x86_64-native-bsdapp-clang/4996765d99ea4e58993bb6efb827d52e/dpdk/mk/rte.sdkbuild.mk:48: app] Error 2
gmake[2]: *** [/tmp/FreeBSD12-64_K19.02_Clang6.0.1/x86_64-native-bsdapp-clang/4996765d99ea4e58993bb6efb827d52e/dpdk/mk/rte.sdkroot.mk:99: all] Error 2
gmake[1]: *** [/tmp/FreeBSD12-64_K19.02_Clang6.0.1/x86_64-native-bsdapp-clang/4996765d99ea4e58993bb6efb827d52e/dpdk/mk/rte.sdkinstall.mk:61: pre_install] Error 2
gmake: *** [/tmp/FreeBSD12-64_K19.02_Clang6.0.1/x86_64-native-bsdapp-clang/4996765d99ea4e58993bb6efb827d52e/dpdk/mk/rte.sdkroot.mk:77: install] Error 2


*Make Build Failed #20:
OS: CENTOS76-64
Target: x86_64-native-linuxapp-gcc+shared
    te_atomic64_inc(&count);
    ^
/tmp/CENTOS76-64_K3.10.0_GCC4.8.5/x86_64-native-linuxapp-gcc+shared/4996765d99ea4e58993bb6efb827d52e/dpdk/app/test/test_atomic.c:349:4: warning: nested extern declaration of ‘te_atomic64_inc’ [-Wnested-externs]
/tmp/CENTOS76-64_K3.10.0_GCC4.8.5/x86_64-native-linuxapp-gcc+shared/4996765d99ea4e58993bb6efb827d52e/dpdk/app/test/test_atomic.c: At top level:
cc1: warning: unrecognized command line option "-Wno-address-of-packed-member" [enabled by default]
make[5]: *** [test_atomic.o] Error 1
  CC cmdline.o
  LD dpdk-test-compress-perf
  CC cperf_test_vectors.o
make[4]: *** [test] Error 2
make[4]: *** Waiting for unfinished jobs....
  CC pipeline_stub.o
  INSTALL-APP dpdk-test-compress-perf
  INSTALL-MAP dpdk-test-compress-perf.map
  CC pipeline_hash.o
--
  INSTALL-APP dpdk-test-eventdev
  INSTALL-MAP dpdk-test-eventdev.map
  LD testpmd
  INSTALL-APP testpmd
  INSTALL-MAP testpmd.map
make[3]: *** [app] Error 2
make[2]: *** [all] Error 2
make[1]: *** [pre_install] Error 2
make: *** [install] Error 2


*Make Build Failed #21:
OS: CENTOS76-64
Target: x86_64-native-linuxapp-icc
/tmp/CENTOS76-64_K3.10.0_ICC19.0.0/x86_64-native-linuxapp-icc/4996765d99ea4e58993bb6efb827d52e/dpdk/app/test/test_atomic.c(328): error: identifier "i" is undefined
  	for (int i = 0; i < N; i++) {
  	                ^

compilation aborted for /tmp/CENTOS76-64_K3.10.0_ICC19.0.0/x86_64-native-linuxapp-icc/4996765d99ea4e58993bb6efb827d52e/dpdk/app/test/test_atomic.c (code 2)
make[5]: *** [test_atomic.o] Error 2
make[5]: *** Waiting for unfinished jobs....
  CC cmdline_flow.o
  CC pipeline_acl.o
  CC cperf_test_latency.o
  LD dpdk-test-compress-perf
  CC cperf_test_pmd_cyclecount.o
  CC cperf_test_verify.o
make[4]: *** [test] Error 2
make[4]: *** Waiting for unfinished jobs....
  CC cmdline_mtr.o
  LD testpipeline
  CC cperf_test_vector_parsing.o
  CC cmdline_tm.o
--
  LD dpdk-test-eventdev
  INSTALL-APP testpmd
  INSTALL-MAP testpmd.map
  INSTALL-APP dpdk-test-eventdev
  INSTALL-MAP dpdk-test-eventdev.map
make[3]: *** [app] Error 2
make[2]: *** [all] Error 2
make[1]: *** [pre_install] Error 2
make: *** [install] Error 2


*Make Build Failed #22:
OS: FreeBSD12-64
Target: x86_64-native-bsdapp-gcc
  MKRES test_resource_c.res.o
  LD test
test_atomic.o: In function `test_atomic_exchange':
test_atomic.c:(.text+0x2e2): undefined reference to `te_atomic64_inc'
collect2: error: ld returned 1 exit status
gmake[5]: *** [/tmp/FreeBSD12-64_K19.02_GCC7.3.0/x86_64-native-bsdapp-gcc/4996765d99ea4e58993bb6efb827d52e/dpdk/mk/rte.app.mk:430: test] Error 1
gmake[4]: *** [/tmp/FreeBSD12-64_K19.02_GCC7.3.0/x86_64-native-bsdapp-gcc/4996765d99ea4e58993bb6efb827d52e/dpdk/mk/rte.subdir.mk:35: test] Error 2
gmake[3]: *** [/tmp/FreeBSD12-64_K19.02_GCC7.3.0/x86_64-native-bsdapp-gcc/4996765d99ea4e58993bb6efb827d52e/dpdk/mk/rte.sdkbuild.mk:48: app] Error 2
gmake[2]: *** [/tmp/FreeBSD12-64_K19.02_GCC7.3.0/x86_64-native-bsdapp-gcc/4996765d99ea4e58993bb6efb827d52e/dpdk/mk/rte.sdkroot.mk:99: all] Error 2
gmake[1]: *** [/tmp/FreeBSD12-64_K19.02_GCC7.3.0/x86_64-native-bsdapp-gcc/4996765d99ea4e58993bb6efb827d52e/dpdk/mk/rte.sdkinstall.mk:61: pre_install] Error 2
gmake: *** [/tmp/FreeBSD12-64_K19.02_GCC7.3.0/x86_64-native-bsdapp-gcc/4996765d99ea4e58993bb6efb827d52e/dpdk/mk/rte.sdkroot.mk:77: install] Error 2

*Meson Build Failed #1:
OS: SUSE15-64
Target:build-gcc-static
FAILED: app/test/3062f5d@@dpdk-test@exe/test_atomic.c.o 
gcc -Iapp/test/3062f5d@@dpdk-test@exe -Iapp/test -I../app/test -Ilib/librte_acl -I../lib/librte_acl -I. -I../ -Iconfig -I../config -Ilib/librte_eal/common/include -I../lib/librte_eal/common/include -I../lib/librte_eal/linux/eal/include -Ilib/librte_eal/common -I../lib/librte_eal/common -Ilib/librte_eal/common/include/arch/x86 -I../lib/librte_eal/common/include/arch/x86 -Ilib/librte_eal -I../lib/librte_eal -Ilib/librte_kvargs -I../lib/librte_kvargs -Ilib/librte_bitratestats -I../lib/librte_bitratestats -Ilib/librte_ethdev -I../lib/librte_ethdev -Ilib/librte_net -I../lib/librte_net -Ilib/librte_mbuf -I../lib/librte_mbuf -Ilib/librte_mempool -I../lib/librte_mempool -Ilib/librte_ring -I../lib/librte_ring -Ilib/librte_meter -I../lib/librte_meter -Ilib/librte_metrics -I../lib/librte_metrics -Ilib/librte_bpf -I../lib/librte_bpf -Ilib/librte_cfgfile -I../lib/librte_cfgfile -Ilib/librte_cmdline -I../lib/librte_cmdline -Ilib/librte_cryptodev -I../lib/librte_cryptodev -Ilib/librte_distributor -I../lib/librte_distributor -Ilib/librte_efd -I../lib/librte_efd -Ilib/librte_hash -I../lib/librte_hash -Ilib/librte_eventdev -I../lib/librte_eventdev -Ilib/librte_timer -I../lib/librte_timer -Ilib/librte_flow_classify -I../lib/librte_flow_classify -Ilib/librte_table -I../lib/librte_table -Ilib/librte_port -I../lib/librte_port -Ilib/librte_sched -I../lib/librte_sched -Ilib/librte_ip_frag -I../lib/librte_ip_frag -Ilib/librte_kni -I../lib/librte_kni -Ilib/librte_pci -I../lib/librte_pci -Ilib/librte_lpm -I../lib/librte_lpm -Ilib/librte_ipsec -I../lib/librte_ipsec -Ilib/librte_security -I../lib/librte_security -Ilib/librte_latencystats -I../lib/librte_latencystats -Ilib/librte_member -I../lib/librte_member -Ilib/librte_pipeline -I../lib/librte_pipeline -Ilib/librte_rawdev -I../lib/librte_rawdev -Ilib/librte_rcu -I../lib/librte_rcu -Ilib/librte_reorder -I../lib/librte_reorder -Ilib/librte_stack -I../lib/librte_stack -Idrivers/mempool/ring -I../drivers/mempool/ring -Idrivers/mempool/stack -I../drivers/mempool/stack -Idrivers/event/skeleton -I../drivers/event/skeleton -Idrivers/bus/pci -I../drivers/bus/pci -I../drivers/bus/pci/linux -Idrivers/bus/vdev -I../drivers/bus/vdev -Idrivers/net/bonding -I../drivers/net/bonding -Idrivers/net/ring -I../drivers/net/ring -Ilib/librte_power -I../lib/librte_power -Ilib/librte_pdump -I../lib/librte_pdump -Ilib/librte_compressdev -I../lib/librte_compressdev -fdiagnostics-color=always -pipe -D_FILE_OFFSET_BITS=64 -Wall -Winvalid-pch -Werror -O3 -include rte_config.h -Wunused-parameter -Wsign-compare -Wcast-qual -march=native -Wno-format-truncation -D_GNU_SOURCE -DALLOW_EXPERIMENTAL_API -MD -MQ 'app/test/3062f5d@@dpdk-test@exe/test_atomic.c.o' -MF 'app/test/3062f5d@@dpdk-test@exe/test_atomic.c.o.d' -o 'app/test/3062f5d@@dpdk-test@exe/test_atomic.c.o' -c ../app/test/test_atomic.c
../app/test/test_atomic.c: In function ‘test_atomic_exchange’:
../app/test/test_atomic.c:349:4: error: implicit declaration of function ‘te_atomic64_inc’; did you mean ‘rte_atomic64_inc’? [-Werror=implicit-function-declaration]
    te_atomic64_inc(&count);
    ^~~~~~~~~~~~~~~
    rte_atomic64_inc
cc1: all warnings being treated as errors
[1616/1892] Linking target drivers/librte_pmd_octeontx2_event.so.1.1.
[1617/1892] Compiling C object 'app/test/3062f5d@@dpdk-test@exe/test.c.o'.
[1618/1892] Compiling C object 'app/test/3062f5d@@dpdk-test@exe/test_bitratestats.c.o'.
[1619/1892] Compiling C object 'app/test/3062f5d@@dpdk-test@exe/test_barrier.c.o'.
[1620/1892] Compiling C object 'app/a172ced@@dpdk-testpmd@exe/test-pmd_testpmd.c.o'.
[1621/1892] Linking target examples/dpdk-l3fwd-vf.
[1622/1892] Linking target app/dpdk-pdump.
ninja: build stopped: subcommand failed




*Meson Build Failed #2:
OS: FC30-64
Target:build-gcc-static
FAILED: app/test/3062f5d@@dpdk-test@exe/test_atomic.c.o 
gcc -Iapp/test/3062f5d@@dpdk-test@exe -Iapp/test -I../app/test -Ilib/librte_acl -I../lib/librte_acl -I. -I../ -Iconfig -I../config -Ilib/librte_eal/common/include -I../lib/librte_eal/common/include -I../lib/librte_eal/linux/eal/include -Ilib/librte_eal/common -I../lib/librte_eal/common -Ilib/librte_eal/common/include/arch/x86 -I../lib/librte_eal/common/include/arch/x86 -Ilib/librte_eal -I../lib/librte_eal -Ilib/librte_kvargs -I../lib/librte_kvargs -Ilib/librte_bitratestats -I../lib/librte_bitratestats -Ilib/librte_ethdev -I../lib/librte_ethdev -Ilib/librte_net -I../lib/librte_net -Ilib/librte_mbuf -I../lib/librte_mbuf -Ilib/librte_mempool -I../lib/librte_mempool -Ilib/librte_ring -I../lib/librte_ring -Ilib/librte_meter -I../lib/librte_meter -Ilib/librte_metrics -I../lib/librte_metrics -Ilib/librte_bpf -I../lib/librte_bpf -Ilib/librte_cfgfile -I../lib/librte_cfgfile -Ilib/librte_cmdline -I../lib/librte_cmdline -Ilib/librte_cryptodev -I../lib/librte_cryptodev -Ilib/librte_distributor -I../lib/librte_distributor -Ilib/librte_efd -I../lib/librte_efd -Ilib/librte_hash -I../lib/librte_hash -Ilib/librte_eventdev -I../lib/librte_eventdev -Ilib/librte_timer -I../lib/librte_timer -Ilib/librte_flow_classify -I../lib/librte_flow_classify -Ilib/librte_table -I../lib/librte_table -Ilib/librte_port -I../lib/librte_port -Ilib/librte_sched -I../lib/librte_sched -Ilib/librte_ip_frag -I../lib/librte_ip_frag -Ilib/librte_kni -I../lib/librte_kni -Ilib/librte_pci -I../lib/librte_pci -Ilib/librte_lpm -I../lib/librte_lpm -Ilib/librte_ipsec -I../lib/librte_ipsec -Ilib/librte_security -I../lib/librte_security -Ilib/librte_latencystats -I../lib/librte_latencystats -Ilib/librte_member -I../lib/librte_member -Ilib/librte_pipeline -I../lib/librte_pipeline -Ilib/librte_rawdev -I../lib/librte_rawdev -Ilib/librte_rcu -I../lib/librte_rcu -Ilib/librte_reorder -I../lib/librte_reorder -Ilib/librte_stack -I../lib/librte_stack -Idrivers/mempool/ring -I../drivers/mempool/ring -Idrivers/mempool/stack -I../drivers/mempool/stack -Idrivers/event/skeleton -I../drivers/event/skeleton -Idrivers/bus/pci -I../drivers/bus/pci -I../drivers/bus/pci/linux -Idrivers/bus/vdev -I../drivers/bus/vdev -Idrivers/net/bonding -I../drivers/net/bonding -Idrivers/net/ring -I../drivers/net/ring -Ilib/librte_power -I../lib/librte_power -Ilib/librte_pdump -I../lib/librte_pdump -fdiagnostics-color=always -pipe -D_FILE_OFFSET_BITS=64 -Wall -Winvalid-pch -Werror -O3 -include rte_config.h -Wunused-parameter -Wsign-compare -Wcast-qual -Wno-address-of-packed-member -march=native -mno-avx512f -Wno-format-truncation -D_GNU_SOURCE -DALLOW_EXPERIMENTAL_API -MD -MQ 'app/test/3062f5d@@dpdk-test@exe/test_atomic.c.o' -MF 'app/test/3062f5d@@dpdk-test@exe/test_atomic.c.o.d' -o 'app/test/3062f5d@@dpdk-test@exe/test_atomic.c.o' -c ../app/test/test_atomic.c
../app/test/test_atomic.c: In function ‘test_atomic_exchange’:
../app/test/test_atomic.c:349:4: error: implicit declaration of function ‘te_atomic64_inc’; did you mean ‘rte_atomic64_inc’? [-Werror=implicit-function-declaration]
  349 |    te_atomic64_inc(&count);
      |    ^~~~~~~~~~~~~~~
      |    rte_atomic64_inc
cc1: all warnings being treated as errors
[1594/1845] Compiling C object 'app/test/3062f5d@@dpdk-test@exe/test_cmdline_cirbuf.c.o'.
[1595/1845] Compiling C object 'app/test/3062f5d@@dpdk-test@exe/sample_packet_forward.c.o'.
[1596/1845] Linking target app/dpdk-testpmd.
[1597/1845] Compiling C object 'app/test/3062f5d@@dpdk-test@exe/packet_burst_generator.c.o'.
[1598/1845] Compiling C object 'app/test/3062f5d@@dpdk-test@exe/test_cmdline_ipaddr.c.o'.
[1599/1845] Compiling C object 'app/test/3062f5d@@dpdk-test@exe/test_cmdline_etheraddr.c.o'.
[1600/1845] Compiling C object 'app/test/3062f5d@@dpdk-test@exe/test_acl.c.o'.
ninja: build stopped: subcommand failed




*Meson Build Failed #3:
OS: UB1604-32
Target:build-gcc-static
FAILED: app/test/3062f5d@@dpdk-test@exe/test_atomic.c.o 
gcc -Iapp/test/3062f5d@@dpdk-test@exe -Iapp/test -I../app/test -Ilib/librte_acl -I../lib/librte_acl -I. -I../ -Iconfig -I../config -Ilib/librte_eal/common/include -I../lib/librte_eal/common/include -I../lib/librte_eal/linux/eal/include -Ilib/librte_eal/common -I../lib/librte_eal/common -Ilib/librte_eal/common/include/arch/x86 -I../lib/librte_eal/common/include/arch/x86 -Ilib/librte_eal -I../lib/librte_eal -Ilib/librte_kvargs -I../lib/librte_kvargs -Ilib/librte_bitratestats -I../lib/librte_bitratestats -Ilib/librte_ethdev -I../lib/librte_ethdev -Ilib/librte_net -I../lib/librte_net -Ilib/librte_mbuf -I../lib/librte_mbuf -Ilib/librte_mempool -I../lib/librte_mempool -Ilib/librte_ring -I../lib/librte_ring -Ilib/librte_meter -I../lib/librte_meter -Ilib/librte_metrics -I../lib/librte_metrics -Ilib/librte_bpf -I../lib/librte_bpf -Ilib/librte_cfgfile -I../lib/librte_cfgfile -Ilib/librte_cmdline -I../lib/librte_cmdline -Ilib/librte_cryptodev -I../lib/librte_cryptodev -Ilib/librte_distributor -I../lib/librte_distributor -Ilib/librte_efd -I../lib/librte_efd -Ilib/librte_hash -I../lib/librte_hash -Ilib/librte_eventdev -I../lib/librte_eventdev -Ilib/librte_timer -I../lib/librte_timer -Ilib/librte_flow_classify -I../lib/librte_flow_classify -Ilib/librte_table -I../lib/librte_table -Ilib/librte_port -I../lib/librte_port -Ilib/librte_sched -I../lib/librte_sched -Ilib/librte_ip_frag -I../lib/librte_ip_frag -Ilib/librte_lpm -I../lib/librte_lpm -Ilib/librte_ipsec -I../lib/librte_ipsec -Ilib/librte_security -I../lib/librte_security -Ilib/librte_latencystats -I../lib/librte_latencystats -Ilib/librte_member -I../lib/librte_member -Ilib/librte_pipeline -I../lib/librte_pipeline -Ilib/librte_rawdev -I../lib/librte_rawdev -Ilib/librte_rcu -I../lib/librte_rcu -Ilib/librte_reorder -I../lib/librte_reorder -Ilib/librte_stack -I../lib/librte_stack -Idrivers/mempool/ring -I../drivers/mempool/ring -Idrivers/mempool/stack -I../drivers/mempool/stack -Idrivers/event/skeleton -I../drivers/event/skeleton -Idrivers/bus/pci -I../drivers/bus/pci -I../drivers/bus/pci/linux -Ilib/librte_pci -I../lib/librte_pci -Idrivers/bus/vdev -I../drivers/bus/vdev -Idrivers/net/bonding -I../drivers/net/bonding -Idrivers/net/ring -I../drivers/net/ring -Ilib/librte_power -I../lib/librte_power -Ilib/librte_pdump -I../lib/librte_pdump -fdiagnostics-color=always -pipe -D_FILE_OFFSET_BITS=64 -Wall -Winvalid-pch -Werror -O3 -include rte_config.h -Wunused-parameter -Wsign-compare -Wcast-qual -Wno-pointer-to-int-cast -march=native -D_GNU_SOURCE -DALLOW_EXPERIMENTAL_API -MD -MQ 'app/test/3062f5d@@dpdk-test@exe/test_atomic.c.o' -MF 'app/test/3062f5d@@dpdk-test@exe/test_atomic.c.o.d' -o 'app/test/3062f5d@@dpdk-test@exe/test_atomic.c.o' -c ../app/test/test_atomic.c
../app/test/test_atomic.c: In function ‘test_atomic_exchange’:
../app/test/test_atomic.c:349:4: error: implicit declaration of function ‘te_atomic64_inc’ [-Werror=implicit-function-declaration]
    te_atomic64_inc(&count);
    ^
cc1: all warnings being treated as errors
[1445/1698] Compiling C object 'app/test/3062f5d@@dpdk-test@exe/test_cmdline_num.c.o'.
[1446/1698] Compiling C object 'app/test/3062f5d@@dpdk-test@exe/test_cmdline_portlist.c.o'.
[1447/1698] Compiling C object 'app/test/3062f5d@@dpdk-test@exe/test_cmdline_cirbuf.c.o'.
[1448/1698] Compiling C object 'app/test/3062f5d@@dpdk-test@exe/test_cmdline_string.c.o'.
[1449/1698] Compiling C object 'app/test/3062f5d@@dpdk-test@exe/test_bpf.c.o'.
ninja: build stopped: subcommand failed




*Meson Build Failed #4:
OS: UB1804-64
Target:build-gcc-static
FAILED: app/test/3062f5d@@dpdk-test@exe/test_atomic.c.o 
gcc -Iapp/test/3062f5d@@dpdk-test@exe -Iapp/test -I../app/test -Ilib/librte_acl -I../lib/librte_acl -I. -I../ -Iconfig -I../config -Ilib/librte_eal/common/include -I../lib/librte_eal/common/include -I../lib/librte_eal/linux/eal/include -Ilib/librte_eal/common -I../lib/librte_eal/common -Ilib/librte_eal/common/include/arch/x86 -I../lib/librte_eal/common/include/arch/x86 -Ilib/librte_eal -I../lib/librte_eal -Ilib/librte_kvargs -I../lib/librte_kvargs -Ilib/librte_bitratestats -I../lib/librte_bitratestats -Ilib/librte_ethdev -I../lib/librte_ethdev -Ilib/librte_net -I../lib/librte_net -Ilib/librte_mbuf -I../lib/librte_mbuf -Ilib/librte_mempool -I../lib/librte_mempool -Ilib/librte_ring -I../lib/librte_ring -Ilib/librte_meter -I../lib/librte_meter -Ilib/librte_metrics -I../lib/librte_metrics -Ilib/librte_bpf -I../lib/librte_bpf -Ilib/librte_cfgfile -I../lib/librte_cfgfile -Ilib/librte_cmdline -I../lib/librte_cmdline -Ilib/librte_cryptodev -I../lib/librte_cryptodev -Ilib/librte_distributor -I../lib/librte_distributor -Ilib/librte_efd -I../lib/librte_efd -Ilib/librte_hash -I../lib/librte_hash -Ilib/librte_eventdev -I../lib/librte_eventdev -Ilib/librte_timer -I../lib/librte_timer -Ilib/librte_flow_classify -I../lib/librte_flow_classify -Ilib/librte_table -I../lib/librte_table -Ilib/librte_port -I../lib/librte_port -Ilib/librte_sched -I../lib/librte_sched -Ilib/librte_ip_frag -I../lib/librte_ip_frag -Ilib/librte_kni -I../lib/librte_kni -Ilib/librte_pci -I../lib/librte_pci -Ilib/librte_lpm -I../lib/librte_lpm -Ilib/librte_ipsec -I../lib/librte_ipsec -Ilib/librte_security -I../lib/librte_security -Ilib/librte_latencystats -I../lib/librte_latencystats -Ilib/librte_member -I../lib/librte_member -Ilib/librte_pipeline -I../lib/librte_pipeline -Ilib/librte_rawdev -I../lib/librte_rawdev -Ilib/librte_rcu -I../lib/librte_rcu -Ilib/librte_reorder -I../lib/librte_reorder -Ilib/librte_stack -I../lib/librte_stack -Idrivers/mempool/ring -I../drivers/mempool/ring -Idrivers/mempool/stack -I../drivers/mempool/stack -Idrivers/event/skeleton -I../drivers/event/skeleton -Idrivers/bus/pci -I../drivers/bus/pci -I../drivers/bus/pci/linux -Idrivers/bus/vdev -I../drivers/bus/vdev -Idrivers/net/bonding -I../drivers/net/bonding -Idrivers/net/ring -I../drivers/net/ring -Ilib/librte_power -I../lib/librte_power -Ilib/librte_pdump -I../lib/librte_pdump -Ilib/librte_compressdev -I../lib/librte_compressdev -fdiagnostics-color=always -pipe -D_FILE_OFFSET_BITS=64 -Wall -Winvalid-pch -Werror -O3 -include rte_config.h -Wunused-parameter -Wsign-compare -Wcast-qual -march=native -mno-avx512f -Wno-format-truncation -D_GNU_SOURCE -DALLOW_EXPERIMENTAL_API -MD -MQ 'app/test/3062f5d@@dpdk-test@exe/test_atomic.c.o' -MF 'app/test/3062f5d@@dpdk-test@exe/test_atomic.c.o.d' -o 'app/test/3062f5d@@dpdk-test@exe/test_atomic.c.o' -c ../app/test/test_atomic.c
../app/test/test_atomic.c: In function ‘test_atomic_exchange’:
../app/test/test_atomic.c:349:4: error: implicit declaration of function ‘te_atomic64_inc’; did you mean ‘rte_atomic64_inc’? [-Werror=implicit-function-declaration]
    te_atomic64_inc(&count);
    ^~~~~~~~~~~~~~~
    rte_atomic64_inc
cc1: all warnings being treated as errors
[1591/1852] Compiling C object 'app/a172ced@@dpdk-testpmd@exe/test-pmd_cmdline.c.o'.
[1592/1852] Compiling C object 'app/test/3062f5d@@dpdk-test@exe/test_bitratestats.c.o'.
[1593/1852] Compiling C object 'app/test/3062f5d@@dpdk-test@exe/packet_burst_generator.c.o'.
[1594/1852] Compiling C object 'app/test/3062f5d@@dpdk-test@exe/sample_packet_forward.c.o'.
[1595/1852] Compiling C object 'app/test/3062f5d@@dpdk-test@exe/test_barrier.c.o'.
ninja: build stopped: subcommand failed




*Meson Build Failed #5:
OS: FreeBSD12-64
Target:build-gcc-static
FAILED: app/test/3062f5d@@dpdk-test@exe/test_atomic.c.o 
ccache gcc -Iapp/test/3062f5d@@dpdk-test@exe -Iapp/test -I../app/test -Ilib/librte_acl -I../lib/librte_acl -I. -I../ -Iconfig -I../config -Ilib/librte_eal/common/include -I../lib/librte_eal/common/include -I../lib/librte_eal/freebsd/eal/include -Ilib/librte_eal/common -I../lib/librte_eal/common -Ilib/librte_eal/common/include/arch/x86 -I../lib/librte_eal/common/include/arch/x86 -Ilib/librte_eal -I../lib/librte_eal -Ilib/librte_kvargs -I../lib/librte_kvargs -Ilib/librte_bitratestats -I../lib/librte_bitratestats -Ilib/librte_ethdev -I../lib/librte_ethdev -Ilib/librte_net -I../lib/librte_net -Ilib/librte_mbuf -I../lib/librte_mbuf -Ilib/librte_mempool -I../lib/librte_mempool -Ilib/librte_ring -I../lib/librte_ring -Ilib/librte_meter -I../lib/librte_meter -Ilib/librte_metrics -I../lib/librte_metrics -Ilib/librte_bpf -I../lib/librte_bpf -Ilib/librte_cfgfile -I../lib/librte_cfgfile -Ilib/librte_cmdline -I../lib/librte_cmdline -Ilib/librte_cryptodev -I../lib/librte_cryptodev -Ilib/librte_distributor -I../lib/librte_distributor -Ilib/librte_efd -I../lib/librte_efd -Ilib/librte_hash -I../lib/librte_hash -Ilib/librte_eventdev -I../lib/librte_eventdev -Ilib/librte_timer -I../lib/librte_timer -Ilib/librte_flow_classify -I../lib/librte_flow_classify -Ilib/librte_table -I../lib/librte_table -Ilib/librte_port -I../lib/librte_port -Ilib/librte_sched -I../lib/librte_sched -Ilib/librte_ip_frag -I../lib/librte_ip_frag -Ilib/librte_lpm -I../lib/librte_lpm -Ilib/librte_ipsec -I../lib/librte_ipsec -Ilib/librte_security -I../lib/librte_security -Ilib/librte_latencystats -I../lib/librte_latencystats -Ilib/librte_member -I../lib/librte_member -Ilib/librte_pipeline -I../lib/librte_pipeline -Ilib/librte_rawdev -I../lib/librte_rawdev -Ilib/librte_rcu -I../lib/librte_rcu -Ilib/librte_reorder -I../lib/librte_reorder -Ilib/librte_stack -I../lib/librte_stack -Idrivers/mempool/ring -I../drivers/mempool/ring -Idrivers/mempool/stack -I../drivers/mempool/stack -Idrivers/event/skeleton -I../drivers/event/skeleton -Idrivers/bus/pci -I../drivers/bus/pci -I../drivers/bus/pci/bsd -Ilib/librte_pci -I../lib/librte_pci -Idrivers/bus/vdev -I../drivers/bus/vdev -Idrivers/net/bonding -I../drivers/net/bonding -Idrivers/net/ring -I../drivers/net/ring -Ilib/librte_pdump -I../lib/librte_pdump -Ilib/librte_compressdev -I../lib/librte_compressdev -fdiagnostics-color=always -pipe -D_FILE_OFFSET_BITS=64 -Wall -Winvalid-pch -Werror -O3 -include rte_config.h -Wunused-parameter -Wsign-compare -Wcast-qual -D__BSD_VISIBLE -march=native -Wno-format-truncation -D_GNU_SOURCE -DALLOW_EXPERIMENTAL_API -MD -MQ 'app/test/3062f5d@@dpdk-test@exe/test_atomic.c.o' -MF 'app/test/3062f5d@@dpdk-test@exe/test_atomic.c.o.d' -o 'app/test/3062f5d@@dpdk-test@exe/test_atomic.c.o' -c ../app/test/test_atomic.c
../app/test/test_atomic.c: In function 'test_atomic_exchange':
../app/test/test_atomic.c:349:4: error: implicit declaration of function 'te_atomic64_inc'; did you mean 'rte_atomic64_inc'? [-Werror=implicit-function-declaration]
    te_atomic64_inc(&count);
    ^~~~~~~~~~~~~~~
    rte_atomic64_inc
cc1: all warnings being treated as errors
[1259/1439] Compiling C object 'app/test/3062f5d@@dpdk-test@exe/test_latencystats.c.o'.
[1260/1439] Compiling C object 'app/test/3062f5d@@dpdk-test@exe/test_ipsec.c.o'.
[1261/1439] Compiling C object 'app/test/3062f5d@@dpdk-test@exe/test_link_bonding.c.o'.
[1262/1439] Compiling C object 'app/test/3062f5d@@dpdk-test@exe/test_link_bonding_mode4.c.o'.
[1263/1439] Compiling C object 'app/test/3062f5d@@dpdk-test@exe/test_link_bonding_rssconf.c.o'.
ninja: build stopped: subcommand failed



DPDK STV team

^ permalink raw reply	[flat|nested] only message in thread

only message in thread, other threads:[~2019-10-17 23:21 UTC | newest]

Thread overview: (only message) (download: mbox.gz / follow: Atom feed)
-- links below jump to the message on this page --
2019-10-17 23:21 [dpdk-test-report] |FAILURE| pw61445[v2] app/test: add tests for atomic exchanges sys_stv

automatic DPDK test reports

This inbox may be cloned and mirrored by anyone:

	git clone --mirror https://inbox.dpdk.org/test-report/0 test-report/git/0.git

	# If you have public-inbox 1.1+ installed, you may
	# initialize and index your mirror using the following commands:
	public-inbox-init -V2 test-report test-report/ https://inbox.dpdk.org/test-report \
		test-report@dpdk.org
	public-inbox-index test-report

Example config snippet for mirrors.
Newsgroup available over NNTP:
	nntp://inbox.dpdk.org/inbox.dpdk.test-report


AGPL code for this site: git clone https://public-inbox.org/public-inbox.git