automatic DPDK test reports
 help / color / mirror / Atom feed
* [dpdk-test-report] |FAILURE| pw61475[v3] app/test: add tests for atomic exchanges
@ 2019-10-18 19:05 sys_stv
  0 siblings, 0 replies; only message in thread
From: sys_stv @ 2019-10-18 19:05 UTC (permalink / raw)
  To: test-report

[-- Attachment #1: Type: text/plain, Size: 11914 bytes --]

Test-Label: Intel-compilation
Test-Status: FAILURE
http://dpdk.org/patch/61475

_Compilation issues_

Submitter: David Christensen <drc@linux.vnet.ibm.com>
Date: 2019-10-18 18:31:20
Reply_mail: 20191018183120.116065-1-drc@linux.vnet.ibm.com
DPDK git baseline: Repo:dpdk, CommitID: b36f587f010bba421a8fd0b4c383276ecb796ae3

Makefile build Summary: 22 Builds Done, 17 Successful, 5 Failures

Meson build Summary: 7 Builds Done, 7 Successful, 0 Failures

               +==============================================+===========+==========+
               |                   Makefile                   |   Meson   | Document |
+--------------+------+-------+------+------------+-----------+-----------+----------+
| os           | gcc  | clang | icc  | gcc+shared | gcc+debug | gcc/clang | pdf/html |
+--------------+------+-------+------+------------+-----------+-----------+----------+
| RHEL76-64    | FAIL |       |      |            |           |           |          |
| CENTOS76-64  | FAIL | pass  | FAIL | FAIL       | FAIL      |           |          |
| UB1804-64    | pass | pass  | pass |            |           | pass      | pass     |
| UB1604-32    | pass |       |      |            |           | pass      |          |
| UB1904-64    | pass |       |      |            |           |           |          |
| UB1604-64    | pass | pass  |      |            |           |           |          |
| FC30-64      | pass | pass  |      |            |           | pass      |          |
| WIN10-64     |      |       |      |            |           | pass      |          |
| FreeBSD12-64 | pass | pass  |      | pass       | pass      | pass      |          |
| RHEL80-64    | pass |       |      |            |           |           |          |
| SUSE15-64    | pass | pass  |      |            |           | pass      |          |
+--------------+------+-------+------+------------+-----------+-----------+----------+

Test environment and configuration as below:

** Makefile build **


OS: RHEL76-64
	Kernel Version: 3.10.0-957.el7.x86_64
	CPU info: Intel(R) Xeon(R) CPU E5-2699 v4 @ 2.20GHz
	GCC Version: gcc (GCC) 4.8.5 20150623 (Red Hat 4.8.5-36)
	Clang Version: NA
	x86_64-native-linuxapp-gcc


OS: CENTOS76-64
	Kernel Version: 3.10.0-957.27.2.el7.x86_64
	CPU info: Intel(R) Xeon(R) CPU E5-2699 v4 @ 2.20GHz
	GCC Version: gcc (GCC) 4.8.5 20150623 (Red Hat 4.8.5-36)
	Clang Version: 3.4.2 (tags/RELEASE_34/dot2-final)
	x86_64-native-linuxapp-clang
	x86_64-native-linuxapp-gcc+debug
	x86_64-native-linuxapp-gcc
	x86_64-native-linuxapp-gcc+shared
	x86_64-native-linuxapp-icc


OS: UB1804-64
	Kernel Version: 4.15.0-20-generic
	CPU info: Intel(R) Xeon(R) CPU E5-2699 v3 @ 2.30GHz
	GCC Version: gcc (Ubuntu 7.3.0-16ubuntu3) 7.3.0
	Clang Version: 6.0.0-1ubuntu2 (tags/RELEASE_600/final)
	x86_64-native-linuxapp-clang
	x86_64-native-linuxapp-icc
	x86_64-native-linuxapp-gcc


OS: UB1904-64
	Kernel Version: 5.0.0-13-generic
	CPU info: Intel(R) Xeon(R) CPU E5-2699 v3 @ 2.30GHz
	GCC Version: gcc (Ubuntu 8.3.0-6ubuntu1) 8.3.0
	Clang Version: 8.0.0-3 (tags/RELEASE_800/final)
	x86_64-native-linuxapp-gcc


OS: UB1604-32
	Kernel Version: 4.4.0-131-generic
	CPU info: Intel(R) Xeon(R) CPU E5-2699 v3 @ 2.30GHz
	GCC Version: gcc (Ubuntu 5.4.0-6ubuntu1~16.04.11) 5.4.0 20160609
	Clang Version: 3.8.0-2ubuntu4 (tags/RELEASE_380/final)
	i686-native-linuxapp-gcc


OS: UB1604-64
	Kernel Version: 4.4.0-47-generic
	CPU info: Intel(R) Xeon(R) CPU E5-2699 v3 @ 2.30GHz
	GCC Version: gcc (Ubuntu 5.4.0-6ubuntu1~16.04.10) 5.4.0 20160609
	Clang Version: 3.8.0-2ubuntu4 (tags/RELEASE_380/final)
	x86_64-native-linuxapp-clang
	x86_64-native-linuxapp-gcc


OS: FC30-64
	Kernel Version: 5.1.7-300.fc30.x86_64
	CPU info: Intel(R) Xeon(R) CPU E5-2699 v4 @ 2.20GHz
	GCC Version: gcc (GCC) 9.1.1 20190503 (Red Hat 9.1.1-1)
	Clang Version: 8.0.0 (Fedora 8.0.0-1.fc30)
	x86_64-native-linuxapp-gcc
	x86_64-native-linuxapp-clang


OS: FreeBSD12-64
	Kernel Version: 12.0-RC3
	CPU info: Intel(R) Xeon(R) CPU E5-2699 v4 @ 2.20GHz (2194.98-MHz K8-class CPU)
	GCC Version: gcc (FreeBSD Ports Collection) 7.3.0
	Clang Version: 6.0.1 (tags/RELEASE_601/final 335540) (based on LLVM 6.0.1)
	x86_64-native-bsdapp-gcc+debug
	x86_64-native-bsdapp-clang
	x86_64-native-bsdapp-gcc+shared
	x86_64-native-bsdapp-gcc


OS: RHEL80-64
	Kernel Version: 4.18.0-80.el8.x86_64
	CPU info: Intel(R) Xeon(R) CPU E5-2699 v4 @ 2.20GHz
	GCC Version: gcc (GCC) 8.2.1 20180905 (Red Hat 8.2.1-3)
	Clang Version: 6.0.1 (tags/RELEASE_601/final)
	x86_64-native-linuxapp-gcc


OS: SUSE15-64
	Kernel Version: 4.12.14-lp150.11-default
	CPU info: Intel(R) Xeon(R) CPU E5-2699 v4 @ 2.20GHz
	GCC Version: gcc (SUSE Linux) 7.3.1 20180323 [gcc-7-branch revision 258812]
	Clang Version: 5.0.1 (tags/RELEASE_501/final 312548)
	x86_64-native-linuxapp-gcc
	x86_64-native-linuxapp-clang


** Meson build **


OS: UB1804-64
	Kernel Version: 4.15.0-20-generic
	CPU info: Intel(R) Xeon(R) CPU E5-2699 v4 @ 2.20GHz
	GCC Version: gcc (Ubuntu 7.3.0-27ubuntu1~18.04) 7.3.0
	Clang Version: 6.0.0-1ubuntu2 (tags/RELEASE_600/final)
	x86_64-native-linuxapp-doc
	build-gcc-static
	build-gcc-shared
	build-clang-static
	build-clang-shared
	build-x86-default


OS: UB1604-32
	Kernel Version: 4.4.0-131-generic
	CPU info: Intel(R) Xeon(R) CPU E5-2699 v4 @ 2.20GHz
	GCC Version: gcc (Ubuntu 5.4.0-6ubuntu1~16.04.11) 5.4.0 20160609
	Clang Version: 3.8.0-2ubuntu4 (tags/RELEASE_380/final)
	build-gcc-static
	build-gcc-shared
	build-clang-static
	build-clang-shared
	build-x86-default


OS: FC30-64
	Kernel Version: 5.0.9-301.fc30.x86_64
	CPU info: Intel(R) Xeon(R) CPU E5-2699 v4 @ 2.20GHz
	GCC Version: gcc (GCC) 9.1.1 20190503 (Red Hat 9.1.1-1)
	Clang Version: 8.0.0 (Fedora 8.0.0-1.fc30)
	build-gcc-static
	build-gcc-shared
	build-clang-static
	build-clang-shared
	build-x86-default


OS: WIN10-64
	Kernel Version: N/A
	CPU info: N/A
	GCC Version: N/A
	Clang Version: Clang 8.0.0
	x86_64-windows-clang


OS: FreeBSD12-64
	Kernel Version: 12.0-RC3
	CPU info: Intel(R) Xeon(R) CPU E5-2699 v4 @ 2.20GHz (2194.97-MHz K8-class CPU)
	GCC Version: gcc (FreeBSD Ports Collection) 7.3.0
	Clang Version: 6.0.1 (tags/RELEASE_601/final 335540) (based on LLVM 6.0.1)
	build-gcc-static
	build-gcc-shared
	build-clang-static
	build-clang-shared
	build-x86-default


OS: SUSE15-64
	Kernel Version: 4.12.14-lp150.11-default
	CPU info: Intel(R) Xeon(R) CPU E5-2699 v4 @ 2.20GHz
	GCC Version: gcc (SUSE Linux) 7.3.1 20180323 [gcc-7-branch revision 258812]
	Clang Version: 5.0.1 (tags/RELEASE_501/final 312548)
	build-gcc-static
	build-gcc-shared
	build-clang-static
	build-clang-shared
	build-x86-default


*Make Build Failed #1:
OS: RHEL76-64
Target: x86_64-native-linuxapp-gcc
/tmp/RHEL76-64_K3.10.0_GCC4.8.5/x86_64-native-linuxapp-gcc/a8e7c50bae4543a399473420f6442228/dpdk/app/test/test_atomic.c:328:2: error: ‘for’ loop initial declarations are only allowed in C99 mode
  for (int i = 0; i < N; i++) {
  ^
/tmp/RHEL76-64_K3.10.0_GCC4.8.5/x86_64-native-linuxapp-gcc/a8e7c50bae4543a399473420f6442228/dpdk/app/test/test_atomic.c: At top level:
cc1: warning: unrecognized command line option "-Wno-address-of-packed-member" [enabled by default]
make[5]: *** [test_atomic.o] Error 1
make[5]: *** Waiting for unfinished jobs....
  CC cmdline_mtr.o
  LD testpipeline
  LD dpdk-test-compress-perf
make[4]: *** [test] Error 2
make[4]: *** Waiting for unfinished jobs....
  CC cperf_test_latency.o
  CC test_bbdev_vector.o
  CC cperf_test_pmd_cyclecount.o
  CC cperf_test_verify.o
--
  INSTALL-MAP testbbdev.map
  INSTALL-APP testpmd
  INSTALL-APP dpdk-test-eventdev
  INSTALL-MAP testpmd.map
  INSTALL-MAP dpdk-test-eventdev.map
make[3]: *** [app] Error 2
make[2]: *** [all] Error 2
make[1]: *** [pre_install] Error 2
make: *** [install] Error 2


*Make Build Failed #2:
OS: CENTOS76-64
Target: x86_64-native-linuxapp-gcc+debug
/tmp/CENTOS76-64_K3.10.0_GCC4.8.5/x86_64-native-linuxapp-gcc+debug/a8e7c50bae4543a399473420f6442228/dpdk/app/test/test_atomic.c:328:2: error: ‘for’ loop initial declarations are only allowed in C99 mode
  for (int i = 0; i < N; i++) {
  ^
/tmp/CENTOS76-64_K3.10.0_GCC4.8.5/x86_64-native-linuxapp-gcc+debug/a8e7c50bae4543a399473420f6442228/dpdk/app/test/test_atomic.c: At top level:
cc1: warning: unrecognized command line option "-Wno-address-of-packed-member" [enabled by default]
make[5]: *** [test_atomic.o] Error 1
make[4]: *** [test] Error 2
make[4]: *** Waiting for unfinished jobs....
  CC cmdline_flow.o
  CC pipeline_lpm_ipv6.o
  CC pipeline_acl.o
  CC cmdline_mtr.o
--
  INSTALL-MAP testbbdev.map
  INSTALL-APP dpdk-test-eventdev
  INSTALL-MAP dpdk-test-eventdev.map
  INSTALL-APP testpmd
  INSTALL-MAP testpmd.map
make[3]: *** [app] Error 2
make[2]: *** [all] Error 2
make[1]: *** [pre_install] Error 2
make: *** [install] Error 2


*Make Build Failed #3:
OS: CENTOS76-64
Target: x86_64-native-linuxapp-gcc
/tmp/CENTOS76-64_K3.10.0_GCC4.8.5/x86_64-native-linuxapp-gcc/a8e7c50bae4543a399473420f6442228/dpdk/app/test/test_atomic.c:328:2: error: ‘for’ loop initial declarations are only allowed in C99 mode
  for (int i = 0; i < N; i++) {
  ^
/tmp/CENTOS76-64_K3.10.0_GCC4.8.5/x86_64-native-linuxapp-gcc/a8e7c50bae4543a399473420f6442228/dpdk/app/test/test_atomic.c: At top level:
cc1: warning: unrecognized command line option "-Wno-address-of-packed-member" [enabled by default]
make[5]: *** [test_atomic.o] Error 1
make[5]: *** Waiting for unfinished jobs....
  CC pipeline_lpm.o
make[4]: *** [test] Error 2
make[4]: *** Waiting for unfinished jobs....
  CC comp_perf_test_common.o
  CC pipeline_lpm_ipv6.o
  CC cmdline.o
  CC pipeline_acl.o
--
  INSTALL-APP testbbdev
  INSTALL-MAP testbbdev.map
  LD testpmd
  INSTALL-APP testpmd
  INSTALL-MAP testpmd.map
make[3]: *** [app] Error 2
make[2]: *** [all] Error 2
make[1]: *** [pre_install] Error 2
make: *** [install] Error 2


*Make Build Failed #4:
OS: CENTOS76-64
Target: x86_64-native-linuxapp-gcc+shared
/tmp/CENTOS76-64_K3.10.0_GCC4.8.5/x86_64-native-linuxapp-gcc+shared/a8e7c50bae4543a399473420f6442228/dpdk/app/test/test_atomic.c:328:2: error: ‘for’ loop initial declarations are only allowed in C99 mode
  for (int i = 0; i < N; i++) {
  ^
/tmp/CENTOS76-64_K3.10.0_GCC4.8.5/x86_64-native-linuxapp-gcc+shared/a8e7c50bae4543a399473420f6442228/dpdk/app/test/test_atomic.c: At top level:
cc1: warning: unrecognized command line option "-Wno-address-of-packed-member" [enabled by default]
make[5]: *** [test_atomic.o] Error 1
  CC cperf_test_vectors.o
make[4]: *** [test] Error 2
make[4]: *** Waiting for unfinished jobs....
  CC cperf_test_throughput.o
  CC cperf_test_latency.o
  CC comp_perf_test_common.o
  CC cmdline_tm.o
--
  INSTALL-APP dpdk-test-eventdev
  INSTALL-MAP dpdk-test-eventdev.map
  LD testpmd
  INSTALL-APP testpmd
  INSTALL-MAP testpmd.map
make[3]: *** [app] Error 2
make[2]: *** [all] Error 2
make[1]: *** [pre_install] Error 2
make: *** [install] Error 2


*Make Build Failed #5:
OS: CENTOS76-64
Target: x86_64-native-linuxapp-icc
/tmp/CENTOS76-64_K3.10.0_ICC19.0.0/x86_64-native-linuxapp-icc/a8e7c50bae4543a399473420f6442228/dpdk/app/test/test_atomic.c(328): error: identifier "i" is undefined
  	for (int i = 0; i < N; i++) {
  	                ^

compilation aborted for /tmp/CENTOS76-64_K3.10.0_ICC19.0.0/x86_64-native-linuxapp-icc/a8e7c50bae4543a399473420f6442228/dpdk/app/test/test_atomic.c (code 2)
make[5]: *** [test_atomic.o] Error 2
make[5]: *** Waiting for unfinished jobs....
  CC pipeline_lpm_ipv6.o
  CC cmdline_flow.o
make[4]: *** [test] Error 2
make[4]: *** Waiting for unfinished jobs....
  CC cperf_test_latency.o
  CC cperf_test_pmd_cyclecount.o
  CC cperf_test_verify.o
  CC pipeline_acl.o
--
  LD dpdk-test-eventdev
  INSTALL-APP testpmd
  INSTALL-MAP testpmd.map
  INSTALL-APP dpdk-test-eventdev
  INSTALL-MAP dpdk-test-eventdev.map
make[3]: *** [app] Error 2
make[2]: *** [all] Error 2
make[1]: *** [pre_install] Error 2
make: *** [install] Error 2

DPDK STV team

^ permalink raw reply	[flat|nested] only message in thread

only message in thread, other threads:[~2019-10-18 19:06 UTC | newest]

Thread overview: (only message) (download: mbox.gz / follow: Atom feed)
-- links below jump to the message on this page --
2019-10-18 19:05 [dpdk-test-report] |FAILURE| pw61475[v3] app/test: add tests for atomic exchanges sys_stv

automatic DPDK test reports

This inbox may be cloned and mirrored by anyone:

	git clone --mirror https://inbox.dpdk.org/test-report/0 test-report/git/0.git

	# If you have public-inbox 1.1+ installed, you may
	# initialize and index your mirror using the following commands:
	public-inbox-init -V2 test-report test-report/ https://inbox.dpdk.org/test-report \
		test-report@dpdk.org
	public-inbox-index test-report

Example config snippet for mirrors.
Newsgroup available over NNTP:
	nntp://inbox.dpdk.org/inbox.dpdk.test-report


AGPL code for this site: git clone https://public-inbox.org/public-inbox.git