automatic DPDK test reports
 help / color / mirror / Atom feed
* [dpdk-test-report]  |FAILURE| pw61480[v7, 2/2] net/ice: enable advanced RSS
@ 2019-10-20  3:09 sys_stv
  0 siblings, 0 replies; only message in thread
From: sys_stv @ 2019-10-20  3:09 UTC (permalink / raw)
  To: test-report

[-- Attachment #1: Type: text/plain, Size: 29661 bytes --]

Test-Label: Intel-compilation
Test-Status: FAILURE
http://dpdk.org/patch/61480

_Compilation issues_

Submitter: Simei Su <simei.su@intel.com>
Date: 2019-10-20 02:14:49
Reply_mail: 1571537689-351403-3-git-send-email-simei.su@intel.com
DPDK git baseline: Repo:dpdk-next-net-intel, CommitID: b33c29cb765ca19f68c8c4f80ae719a8fc1884cd

Makefile build Summary: 22 Builds Done, 21 Successful, 1 Failures

Meson build Summary: 7 Builds Done, 2 Successful, 5 Failures

               +==============================================+===========+==========+
               |                   Makefile                   |   Meson   | Document |
+--------------+------+-------+------+------------+-----------+-----------+----------+
| os           | gcc  | clang | icc  | gcc+shared | gcc+debug | gcc/clang | pdf/html |
+--------------+------+-------+------+------------+-----------+-----------+----------+
| RHEL76-64    | pass |       |      |            |           |           |          |
| CENTOS76-64  | pass | pass  | pass | pass       | pass      |           |          |
| UB1804-64    | pass | pass  | pass |            |           | FAIL      | pass     |
| UB1604-32    | FAIL |       |      |            |           | FAIL      |          |
| UB1904-64    | pass |       |      |            |           |           |          |
| UB1604-64    | pass | pass  |      |            |           |           |          |
| FC30-64      | pass | pass  |      |            |           | FAIL      |          |
| WIN10-64     |      |       |      |            |           | pass      |          |
| FreeBSD12-64 | pass | pass  |      | pass       | pass      | FAIL      |          |
| RHEL80-64    | pass |       |      |            |           |           |          |
| SUSE15-64    | pass | pass  |      |            |           | FAIL      |          |
+--------------+------+-------+------+------------+-----------+-----------+----------+

Test environment and configuration as below:

** Makefile build **


OS: RHEL76-64
	Kernel Version: 3.10.0-957.el7.x86_64
	CPU info: Intel(R) Xeon(R) CPU E5-2699 v4 @ 2.20GHz
	GCC Version: gcc (GCC) 4.8.5 20150623 (Red Hat 4.8.5-36)
	Clang Version: NA
	x86_64-native-linuxapp-gcc


OS: CENTOS76-64
	Kernel Version: 3.10.0-957.27.2.el7.x86_64
	CPU info: Intel(R) Xeon(R) CPU E5-2699 v4 @ 2.20GHz
	GCC Version: gcc (GCC) 4.8.5 20150623 (Red Hat 4.8.5-36)
	Clang Version: 3.4.2 (tags/RELEASE_34/dot2-final)
	x86_64-native-linuxapp-clang
	x86_64-native-linuxapp-gcc+debug
	x86_64-native-linuxapp-gcc
	x86_64-native-linuxapp-gcc+shared
	x86_64-native-linuxapp-icc


OS: UB1804-64
	Kernel Version: 4.15.0-20-generic
	CPU info: Intel(R) Xeon(R) CPU E5-2699 v3 @ 2.30GHz
	GCC Version: gcc (Ubuntu 7.3.0-16ubuntu3) 7.3.0
	Clang Version: 6.0.0-1ubuntu2 (tags/RELEASE_600/final)
	x86_64-native-linuxapp-clang
	x86_64-native-linuxapp-icc
	x86_64-native-linuxapp-gcc


OS: UB1904-64
	Kernel Version: 5.0.0-13-generic
	CPU info: Intel(R) Xeon(R) CPU E5-2699 v3 @ 2.30GHz
	GCC Version: gcc (Ubuntu 8.3.0-6ubuntu1) 8.3.0
	Clang Version: 8.0.0-3 (tags/RELEASE_800/final)
	x86_64-native-linuxapp-gcc


OS: UB1604-32
	Kernel Version: 4.4.0-131-generic
	CPU info: Intel(R) Xeon(R) CPU E5-2699 v3 @ 2.30GHz
	GCC Version: gcc (Ubuntu 5.4.0-6ubuntu1~16.04.11) 5.4.0 20160609
	Clang Version: 3.8.0-2ubuntu4 (tags/RELEASE_380/final)
	i686-native-linuxapp-gcc


OS: UB1604-64
	Kernel Version: 4.4.0-47-generic
	CPU info: Intel(R) Xeon(R) CPU E5-2699 v3 @ 2.30GHz
	GCC Version: gcc (Ubuntu 5.4.0-6ubuntu1~16.04.10) 5.4.0 20160609
	Clang Version: 3.8.0-2ubuntu4 (tags/RELEASE_380/final)
	x86_64-native-linuxapp-clang
	x86_64-native-linuxapp-gcc


OS: FC30-64
	Kernel Version: 5.1.7-300.fc30.x86_64
	CPU info: Intel(R) Xeon(R) CPU E5-2699 v4 @ 2.20GHz
	GCC Version: gcc (GCC) 9.1.1 20190503 (Red Hat 9.1.1-1)
	Clang Version: 8.0.0 (Fedora 8.0.0-1.fc30)
	x86_64-native-linuxapp-gcc
	x86_64-native-linuxapp-clang


OS: FreeBSD12-64
	Kernel Version: 12.0-RC3
	CPU info: Intel(R) Xeon(R) CPU E5-2699 v4 @ 2.20GHz (2194.97-MHz K8-class CPU)
	GCC Version: gcc (FreeBSD Ports Collection) 7.3.0
	Clang Version: 6.0.1 (tags/RELEASE_601/final 335540) (based on LLVM 6.0.1)
	x86_64-native-bsdapp-gcc+shared
	x86_64-native-bsdapp-gcc+debug
	x86_64-native-bsdapp-clang
	x86_64-native-bsdapp-gcc


OS: RHEL80-64
	Kernel Version: 4.18.0-80.el8.x86_64
	CPU info: Intel(R) Xeon(R) CPU E5-2699 v4 @ 2.20GHz
	GCC Version: gcc (GCC) 8.2.1 20180905 (Red Hat 8.2.1-3)
	Clang Version: 6.0.1 (tags/RELEASE_601/final)
	x86_64-native-linuxapp-gcc


OS: SUSE15-64
	Kernel Version: 4.12.14-lp150.11-default
	CPU info: Intel(R) Xeon(R) CPU E5-2699 v4 @ 2.20GHz
	GCC Version: gcc (SUSE Linux) 7.3.1 20180323 [gcc-7-branch revision 258812]
	Clang Version: 5.0.1 (tags/RELEASE_501/final 312548)
	x86_64-native-linuxapp-gcc
	x86_64-native-linuxapp-clang


** Meson build **


OS: UB1804-64
	Kernel Version: 4.15.0-20-generic
	CPU info: Intel(R) Xeon(R) CPU E5-2699 v4 @ 2.20GHz
	GCC Version: gcc (Ubuntu 7.3.0-27ubuntu1~18.04) 7.3.0
	Clang Version: 6.0.0-1ubuntu2 (tags/RELEASE_600/final)
	x86_64-native-linuxapp-doc
	build-gcc-static
	build-gcc-shared
	build-clang-static
	build-clang-shared
	build-x86-default


OS: UB1604-32
	Kernel Version: 4.4.0-131-generic
	CPU info: Intel(R) Xeon(R) CPU E5-2699 v4 @ 2.20GHz
	GCC Version: gcc (Ubuntu 5.4.0-6ubuntu1~16.04.11) 5.4.0 20160609
	Clang Version: 3.8.0-2ubuntu4 (tags/RELEASE_380/final)
	build-gcc-static
	build-gcc-shared
	build-clang-static
	build-clang-shared
	build-x86-default


OS: FC30-64
	Kernel Version: 5.0.9-301.fc30.x86_64
	CPU info: Intel(R) Xeon(R) CPU E5-2699 v4 @ 2.20GHz
	GCC Version: gcc (GCC) 9.1.1 20190503 (Red Hat 9.1.1-1)
	Clang Version: 8.0.0 (Fedora 8.0.0-1.fc30)
	build-gcc-static
	build-gcc-shared
	build-clang-static
	build-clang-shared
	build-x86-default


OS: WIN10-64
	Kernel Version: N/A
	CPU info: N/A
	GCC Version: N/A
	Clang Version: Clang 8.0.0
	x86_64-windows-clang


OS: FreeBSD12-64
	Kernel Version: 12.0-RC3
	CPU info: Intel(R) Xeon(R) CPU E5-2699 v4 @ 2.20GHz (2194.97-MHz K8-class CPU)
	GCC Version: gcc (FreeBSD Ports Collection) 7.3.0
	Clang Version: 6.0.1 (tags/RELEASE_601/final 335540) (based on LLVM 6.0.1)
	build-gcc-static
	build-gcc-shared
	build-clang-static
	build-clang-shared
	build-x86-default


OS: SUSE15-64
	Kernel Version: 4.12.14-lp150.11-default
	CPU info: Intel(R) Xeon(R) CPU E5-2699 v4 @ 2.20GHz
	GCC Version: gcc (SUSE Linux) 7.3.1 20180323 [gcc-7-branch revision 258812]
	Clang Version: 5.0.1 (tags/RELEASE_501/final 312548)
	build-gcc-static
	build-gcc-shared
	build-clang-static
	build-clang-shared
	build-x86-default


*Make Build Failed #1:
OS: UB1604-32
Target: i686-native-linuxapp-gcc
/tmp/UB1604-32_K4.4.0_GCC5.4.0/i686-native-linuxapp-gcc/965e603e4d934c65a2ec8dd823782ee7/dpdk/drivers/net/ice/ice_hash.c:525:23: warning: comparison of constant ‘2’ with boolean expression is always false [-Wbool-compare]
  if (filter_ptr->symm == RTE_ETH_HASH_FUNCTION_SIMPLE_XOR) {
                       ^
/tmp/UB1604-32_K4.4.0_GCC5.4.0/i686-native-linuxapp-gcc/965e603e4d934c65a2ec8dd823782ee7/dpdk/drivers/net/ice/ice_hash.c: At top level:
cc1: warning: unrecognized command line option ‘-Wno-address-of-packed-member’
/tmp/UB1604-32_K4.4.0_GCC5.4.0/i686-native-linuxapp-gcc/965e603e4d934c65a2ec8dd823782ee7/dpdk/mk/internal/rte.compile-pre.mk:114: recipe for target 'ice_hash.o' failed
make[6]: *** [ice_hash.o] Error 1
make[6]: *** Waiting for unfinished jobs....
  CC ecore_vf.o
  PMDINFO virtio_user_ethdev.o.pmd.c
  CC virtio_user_ethdev.o.pmd.o
  CC otx2_mcast.o
  CC bnxt_txr.o
  LD virtio_user_ethdev.o
/tmp/UB1604-32_K4.4.0_GCC5.4.0/i686-native-linuxapp-gcc/965e603e4d934c65a2ec8dd823782ee7/dpdk/mk/rte.subdir.mk:35: recipe for target 'ice' failed
make[5]: *** [ice] Error 2
make[5]: *** Waiting for unfinished jobs....
  CC bnxt_vnic.o
  CC bnxt_irq.o
  AR librte_pmd_virtio.a
  INSTALL-LIB librte_pmd_virtio.a
--
  AR librte_pmd_octeontx2.a
  INSTALL-LIB librte_pmd_octeontx2.a
make[6]: warning:  Clock skew detected.  Your build may be incomplete.
  AR librte_pmd_qede.a
  INSTALL-LIB librte_pmd_qede.a
/tmp/UB1604-32_K4.4.0_GCC5.4.0/i686-native-linuxapp-gcc/965e603e4d934c65a2ec8dd823782ee7/dpdk/mk/rte.subdir.mk:35: recipe for target 'net' failed
make[4]: *** [net] Error 2
/tmp/UB1604-32_K4.4.0_GCC5.4.0/i686-native-linuxapp-gcc/965e603e4d934c65a2ec8dd823782ee7/dpdk/mk/rte.sdkbuild.mk:46: recipe for target 'drivers' failed
make[3]: *** [drivers] Error 2
/tmp/UB1604-32_K4.4.0_GCC5.4.0/i686-native-linuxapp-gcc/965e603e4d934c65a2ec8dd823782ee7/dpdk/mk/rte.sdkroot.mk:98: recipe for target 'all' failed
make[2]: *** [all] Error 2
/tmp/UB1604-32_K4.4.0_GCC5.4.0/i686-native-linuxapp-gcc/965e603e4d934c65a2ec8dd823782ee7/dpdk/mk/rte.sdkinstall.mk:60: recipe for target 'pre_install' failed
make[1]: *** [pre_install] Error 2
/tmp/UB1604-32_K4.4.0_GCC5.4.0/i686-native-linuxapp-gcc/965e603e4d934c65a2ec8dd823782ee7/dpdk/mk/rte.sdkroot.mk:77: recipe for target 'install' failed
make: *** [install] Error 2

*Meson Build Failed #1:
OS: FC30-64
Target:build-gcc-static
FAILED: drivers/a715181@@tmp_rte_pmd_ice@sta/net_ice_ice_hash.c.o 
gcc -Idrivers/a715181@@tmp_rte_pmd_ice@sta -Idrivers -I../drivers -Idrivers/net/ice -I../drivers/net/ice -Idrivers/net/ice/base -I../drivers/net/ice/base -Ilib/librte_ethdev -I../lib/librte_ethdev -I. -I../ -Iconfig -I../config -Ilib/librte_eal/common/include -I../lib/librte_eal/common/include -I../lib/librte_eal/linux/eal/include -Ilib/librte_eal/common -I../lib/librte_eal/common -Ilib/librte_eal/common/include/arch/x86 -I../lib/librte_eal/common/include/arch/x86 -Ilib/librte_eal -I../lib/librte_eal -Ilib/librte_kvargs -I../lib/librte_kvargs -Ilib/librte_net -I../lib/librte_net -Ilib/librte_mbuf -I../lib/librte_mbuf -Ilib/librte_mempool -I../lib/librte_mempool -Ilib/librte_ring -I../lib/librte_ring -Ilib/librte_meter -I../lib/librte_meter -Idrivers/bus/pci -I../drivers/bus/pci -I../drivers/bus/pci/linux -Ilib/librte_pci -I../lib/librte_pci -Idrivers/bus/vdev -I../drivers/bus/vdev -Ilib/librte_hash -I../lib/librte_hash -fdiagnostics-color=always -pipe -D_FILE_OFFSET_BITS=64 -Wall -Winvalid-pch -Werror -O3 -include rte_config.h -Wunused-parameter -Wsign-compare -Wcast-qual -Wno-address-of-packed-member -D_GNU_SOURCE -fPIC -march=native -mno-avx512f -Wno-format-truncation -DALLOW_EXPERIMENTAL_API -MD -MQ 'drivers/a715181@@tmp_rte_pmd_ice@sta/net_ice_ice_hash.c.o' -MF 'drivers/a715181@@tmp_rte_pmd_ice@sta/net_ice_ice_hash.c.o.d' -o 'drivers/a715181@@tmp_rte_pmd_ice@sta/net_ice_ice_hash.c.o' -c ../drivers/net/ice/ice_hash.c
../drivers/net/ice/ice_hash.c: In function ‘ice_hash_destroy’:
../drivers/net/ice/ice_hash.c:525:23: error: comparison of constant ‘2’ with boolean expression is always false [-Werror=bool-compare]
  525 |  if (filter_ptr->symm == RTE_ETH_HASH_FUNCTION_SIMPLE_XOR) {
      |                       ^~
cc1: all warnings being treated as errors
[871/1862] Compiling C object 'drivers/net/ice/base/39545a2@@ice_base@sta/ice_flex_pipe.c.o'.
[872/1862] Compiling C object 'drivers/a715181@@tmp_rte_pmd_ice@sta/net_ice_ice_generic_flow.c.o'.
[873/1862] Compiling C object 'drivers/a715181@@tmp_rte_pmd_ice@sta/net_ice_ice_switch_filter.c.o'.
[874/1862] Compiling C object 'drivers/a715181@@tmp_rte_pmd_ice@sta/net_ice_ice_ethdev.c.o'.
[875/1862] Compiling C object 'drivers/a715181@@tmp_rte_pmd_ice@sta/net_ice_ice_fdir_filter.c.o'.
[876/1862] Compiling C object 'drivers/a715181@@tmp_rte_pmd_ice@sta/net_ice_ice_rxtx.c.o'.
[877/1862] Compiling C object 'drivers/a715181@@tmp_rte_pmd_ice@sta/net_ice_ice_rxtx_vec_sse.c.o'.
ninja: build stopped: subcommand failed




*Meson Build Failed #2:
OS: SUSE15-64
Target:build-gcc-static
FAILED: drivers/a715181@@tmp_rte_pmd_ice@sta/net_ice_ice_hash.c.o 
gcc -Idrivers/a715181@@tmp_rte_pmd_ice@sta -Idrivers -I../drivers -Idrivers/net/ice -I../drivers/net/ice -Idrivers/net/ice/base -I../drivers/net/ice/base -Ilib/librte_ethdev -I../lib/librte_ethdev -I. -I../ -Iconfig -I../config -Ilib/librte_eal/common/include -I../lib/librte_eal/common/include -I../lib/librte_eal/linux/eal/include -Ilib/librte_eal/common -I../lib/librte_eal/common -Ilib/librte_eal/common/include/arch/x86 -I../lib/librte_eal/common/include/arch/x86 -Ilib/librte_eal -I../lib/librte_eal -Ilib/librte_kvargs -I../lib/librte_kvargs -Ilib/librte_net -I../lib/librte_net -Ilib/librte_mbuf -I../lib/librte_mbuf -Ilib/librte_mempool -I../lib/librte_mempool -Ilib/librte_ring -I../lib/librte_ring -Ilib/librte_meter -I../lib/librte_meter -Idrivers/bus/pci -I../drivers/bus/pci -I../drivers/bus/pci/linux -Ilib/librte_pci -I../lib/librte_pci -Idrivers/bus/vdev -I../drivers/bus/vdev -Ilib/librte_hash -I../lib/librte_hash -fdiagnostics-color=always -pipe -D_FILE_OFFSET_BITS=64 -Wall -Winvalid-pch -Werror -O3 -include rte_config.h -Wunused-parameter -Wsign-compare -Wcast-qual -D_GNU_SOURCE -fPIC -march=native -Wno-format-truncation -DALLOW_EXPERIMENTAL_API -MD -MQ 'drivers/a715181@@tmp_rte_pmd_ice@sta/net_ice_ice_hash.c.o' -MF 'drivers/a715181@@tmp_rte_pmd_ice@sta/net_ice_ice_hash.c.o.d' -o 'drivers/a715181@@tmp_rte_pmd_ice@sta/net_ice_ice_hash.c.o' -c ../drivers/net/ice/ice_hash.c
../drivers/net/ice/ice_hash.c: In function ‘ice_hash_destroy’:
../drivers/net/ice/ice_hash.c:525:23: error: comparison of constant ‘2’ with boolean expression is always false [-Werror=bool-compare]
  if (filter_ptr->symm == RTE_ETH_HASH_FUNCTION_SIMPLE_XOR) {
                       ^~
cc1: all warnings being treated as errors
[878/1909] Compiling C object 'drivers/net/ice/base/39545a2@@ice_base@sta/ice_flow.c.o'.
[879/1909] Compiling C object 'drivers/net/ice/base/39545a2@@ice_base@sta/ice_flex_pipe.c.o'.
[880/1909] Compiling C object 'drivers/a715181@@tmp_rte_pmd_ice@sta/net_ice_ice_generic_flow.c.o'.
[881/1909] Compiling C object 'drivers/a715181@@tmp_rte_pmd_ice@sta/net_ice_ice_switch_filter.c.o'.
[882/1909] Compiling C object 'drivers/net/ice/base/39545a2@@ice_base@sta/ice_switch.c.o'.
[883/1909] Compiling C object 'drivers/a715181@@tmp_rte_pmd_ice@sta/net_ice_ice_ethdev.c.o'.
[884/1909] Compiling C object 'drivers/a715181@@tmp_rte_pmd_ice@sta/net_ice_ice_rxtx.c.o'.
ninja: build stopped: subcommand failed




*Meson Build Failed #3:
OS: UB1604-32
Target:build-gcc-static
FAILED: drivers/a715181@@tmp_rte_pmd_ice@sta/net_ice_ice_hash.c.o 
gcc -Idrivers/a715181@@tmp_rte_pmd_ice@sta -Idrivers -I../drivers -Idrivers/net/ice -I../drivers/net/ice -Idrivers/net/ice/base -I../drivers/net/ice/base -Ilib/librte_ethdev -I../lib/librte_ethdev -I. -I../ -Iconfig -I../config -Ilib/librte_eal/common/include -I../lib/librte_eal/common/include -I../lib/librte_eal/linux/eal/include -Ilib/librte_eal/common -I../lib/librte_eal/common -Ilib/librte_eal/common/include/arch/x86 -I../lib/librte_eal/common/include/arch/x86 -Ilib/librte_eal -I../lib/librte_eal -Ilib/librte_kvargs -I../lib/librte_kvargs -Ilib/librte_net -I../lib/librte_net -Ilib/librte_mbuf -I../lib/librte_mbuf -Ilib/librte_mempool -I../lib/librte_mempool -Ilib/librte_ring -I../lib/librte_ring -Ilib/librte_meter -I../lib/librte_meter -Idrivers/bus/pci -I../drivers/bus/pci -I../drivers/bus/pci/linux -Ilib/librte_pci -I../lib/librte_pci -Idrivers/bus/vdev -I../drivers/bus/vdev -Ilib/librte_hash -I../lib/librte_hash -fdiagnostics-color=always -pipe -D_FILE_OFFSET_BITS=64 -Wall -Winvalid-pch -Werror -O3 -include rte_config.h -Wunused-parameter -Wsign-compare -Wcast-qual -Wno-pointer-to-int-cast -D_GNU_SOURCE -fPIC -march=native -DALLOW_EXPERIMENTAL_API -MD -MQ 'drivers/a715181@@tmp_rte_pmd_ice@sta/net_ice_ice_hash.c.o' -MF 'drivers/a715181@@tmp_rte_pmd_ice@sta/net_ice_ice_hash.c.o.d' -o 'drivers/a715181@@tmp_rte_pmd_ice@sta/net_ice_ice_hash.c.o' -c ../drivers/net/ice/ice_hash.c
../drivers/net/ice/ice_hash.c:107:37: error: initializer element is not constant
  {pattern_eth_ipv4, ICE_INSET_NONE, (uint64_t)(&hint_1)},
                                     ^
../drivers/net/ice/ice_hash.c:107:37: note: (near initialization for ‘ice_hash_pattern_list_os[0].meta’)
../drivers/net/ice/ice_hash.c:108:41: error: initializer element is not constant
  {pattern_eth_ipv4_udp, ICE_INSET_NONE, (uint64_t)(&hint_2)},
                                         ^
../drivers/net/ice/ice_hash.c:108:41: note: (near initialization for ‘ice_hash_pattern_list_os[1].meta’)
../drivers/net/ice/ice_hash.c:109:41: error: initializer element is not constant
  {pattern_eth_ipv4_tcp, ICE_INSET_NONE, (uint64_t)(&hint_3)},
                                         ^
../drivers/net/ice/ice_hash.c:109:41: note: (near initialization for ‘ice_hash_pattern_list_os[2].meta’)
../drivers/net/ice/ice_hash.c:110:42: error: initializer element is not constant
  {pattern_eth_ipv4_sctp, ICE_INSET_NONE, (uint64_t)(&hint_4)},
                                          ^
../drivers/net/ice/ice_hash.c:110:42: note: (near initialization for ‘ice_hash_pattern_list_os[3].meta’)
../drivers/net/ice/ice_hash.c:111:37: error: initializer element is not constant
  {pattern_eth_ipv6, ICE_INSET_NONE, (uint64_t)(&hint_5)},
                                     ^
../drivers/net/ice/ice_hash.c:111:37: note: (near initialization for ‘ice_hash_pattern_list_os[4].meta’)
../drivers/net/ice/ice_hash.c:112:41: error: initializer element is not constant
  {pattern_eth_ipv6_udp, ICE_INSET_NONE, (uint64_t)(&hint_6)},
                                         ^
../drivers/net/ice/ice_hash.c:112:41: note: (near initialization for ‘ice_hash_pattern_list_os[5].meta’)
../drivers/net/ice/ice_hash.c:113:41: error: initializer element is not constant
  {pattern_eth_ipv6_tcp, ICE_INSET_NONE, (uint64_t)(&hint_7)},
                                         ^
../drivers/net/ice/ice_hash.c:113:41: note: (near initialization for ‘ice_hash_pattern_list_os[6].meta’)
../drivers/net/ice/ice_hash.c:114:42: error: initializer element is not constant
  {pattern_eth_ipv6_sctp, ICE_INSET_NONE, (uint64_t)(&hint_8)},
                                          ^
../drivers/net/ice/ice_hash.c:114:42: note: (near initialization for ‘ice_hash_pattern_list_os[7].meta’)
../drivers/net/ice/ice_hash.c:115:35: error: initializer element is not constant
  {pattern_empty,  ICE_INSET_NONE, (uint64_t)(&hint_0)},
                                   ^
../drivers/net/ice/ice_hash.c:115:35: note: (near initialization for ‘ice_hash_pattern_list_os[8].meta’)
../drivers/net/ice/ice_hash.c:120:40: error: initializer element is not constant
  {pattern_eth_ipv4,   ICE_INSET_NONE,  (uint64_t)(&hint_1)},
                                        ^
../drivers/net/ice/ice_hash.c:120:40: note: (near initialization for ‘ice_hash_pattern_list_comms[0].meta’)
../drivers/net/ice/ice_hash.c:121:44: error: initializer element is not constant
  {pattern_eth_ipv4_udp,   ICE_INSET_NONE,  (uint64_t)(&hint_2)},
                                            ^
../drivers/net/ice/ice_hash.c:121:44: note: (near initialization for ‘ice_hash_pattern_list_comms[1].meta’)
../drivers/net/ice/ice_hash.c:122:44: error: initializer element is not constant
  {pattern_eth_ipv4_tcp,   ICE_INSET_NONE,  (uint64_t)(&hint_3)},
                                            ^
../drivers/net/ice/ice_hash.c:122:44: note: (near initialization for ‘ice_hash_pattern_list_comms[2].meta’)
../drivers/net/ice/ice_hash.c:123:45: error: initializer element is not constant
  {pattern_eth_ipv4_sctp,   ICE_INSET_NONE,  (uint64_t)(&hint_4)},
                                             ^
../drivers/net/ice/ice_hash.c:123:45: note: (near initialization for ‘ice_hash_pattern_list_comms[3].meta’)
../drivers/net/ice/ice_hash.c:124:40: error: initializer element is not constant
  {pattern_eth_ipv6,   ICE_INSET_NONE,  (uint64_t)(&hint_5)},
                                        ^
../drivers/net/ice/ice_hash.c:124:40: note: (near initialization for ‘ice_hash_pattern_list_comms[4].meta’)
../drivers/net/ice/ice_hash.c:125:44: error: initializer element is not constant
  {pattern_eth_ipv6_udp,   ICE_INSET_NONE,  (uint64_t)(&hint_6)},
                                            ^
../drivers/net/ice/ice_hash.c:125:44: note: (near initialization for ‘ice_hash_pattern_list_comms[5].meta’)
../drivers/net/ice/ice_hash.c:126:44: error: initializer element is not constant
  {pattern_eth_ipv6_tcp,   ICE_INSET_NONE,  (uint64_t)(&hint_7)},
                                            ^
../drivers/net/ice/ice_hash.c:126:44: note: (near initialization for ‘ice_hash_pattern_list_comms[6].meta’)
../drivers/net/ice/ice_hash.c:127:45: error: initializer element is not constant
  {pattern_eth_ipv6_sctp,   ICE_INSET_NONE,  (uint64_t)(&hint_8)},
                                             ^
../drivers/net/ice/ice_hash.c:127:45: note: (near initialization for ‘ice_hash_pattern_list_comms[7].meta’)
../drivers/net/ice/ice_hash.c:128:38: error: initializer element is not constant
  {pattern_empty,    ICE_INSET_NONE,  (uint64_t)(&hint_0)},
                                      ^
../drivers/net/ice/ice_hash.c:128:38: note: (near initialization for ‘ice_hash_pattern_list_comms[8].meta’)
../drivers/net/ice/ice_hash.c:129:49: error: initializer element is not constant
  {pattern_eth_ipv4_gtpu_ipv4,  ICE_INSET_NONE,  (uint64_t)(&hint_9)},
                                                 ^
../drivers/net/ice/ice_hash.c:129:49: note: (near initialization for ‘ice_hash_pattern_list_comms[9].meta’)
../drivers/net/ice/ice_hash.c:130:52: error: initializer element is not constant
  {pattern_eth_ipv4_gtpu_ipv4_udp, ICE_INSET_NONE,  (uint64_t)(&hint_9)},
                                                    ^
../drivers/net/ice/ice_hash.c:130:52: note: (near initialization for ‘ice_hash_pattern_list_comms[10].meta’)
../drivers/net/ice/ice_hash.c:131:52: error: initializer element is not constant
  {pattern_eth_ipv4_gtpu_ipv4_tcp, ICE_INSET_NONE,  (uint64_t)(&hint_9)},
                                                    ^
../drivers/net/ice/ice_hash.c:131:52: note: (near initialization for ‘ice_hash_pattern_list_comms[11].meta’)
../drivers/net/ice/ice_hash.c:132:46: error: initializer element is not constant
  {pattern_eth_pppoes_ipv4,  ICE_INSET_NONE,  (uint64_t)(&hint_10)},
                                              ^
../drivers/net/ice/ice_hash.c:132:46: note: (near initialization for ‘ice_hash_pattern_list_comms[12].meta’)
../drivers/net/ice/ice_hash.c:133:50: error: initializer element is not constant
  {pattern_eth_pppoes_ipv4_udp,  ICE_INSET_NONE,  (uint64_t)(&hint_11)},
                                                  ^
../drivers/net/ice/ice_hash.c:133:50: note: (near initialization for ‘ice_hash_pattern_list_comms[13].meta’)
../drivers/net/ice/ice_hash.c:134:50: error: initializer element is not constant
  {pattern_eth_pppoes_ipv4_tcp,  ICE_INSET_NONE,  (uint64_t)(&hint_12)},
                                                  ^
../drivers/net/ice/ice_hash.c:134:50: note: (near initialization for ‘ice_hash_pattern_list_comms[14].meta’)
../drivers/net/ice/ice_hash.c:135:51: error: initializer element is not constant
  {pattern_eth_pppoes_ipv4_sctp,  ICE_INSET_NONE,  (uint64_t)(&hint_13)},
                                                   ^
../drivers/net/ice/ice_hash.c:135:51: note: (near initialization for ‘ice_hash_pattern_list_comms[15].meta’)
../drivers/net/ice/ice_hash.c: In function ‘ice_hash_parse_action’:
../drivers/net/ice/ice_hash.c:286:33: error: cast to pointer from integer of different size [-Werror=int-to-pointer-cast]
  struct rss_type_match_hdr *m = (struct rss_type_match_hdr *)
                                 ^
../drivers/net/ice/ice_hash.c: In function ‘ice_hash_parse_pattern_action’:
../drivers/net/ice/ice_hash.c:430:41: error: cast to pointer from integer of different size [-Werror=int-to-pointer-cast]
  ((struct rss_meta *)*meta)->pkt_hdr = ((struct rss_type_match_hdr *)
                                         ^
../drivers/net/ice/ice_hash.c: In function ‘ice_hash_destroy’:
../drivers/net/ice/ice_hash.c:525:23: error: comparison of constant ‘2’ with boolean expression is always false [-Werror=bool-compare]
  if (filter_ptr->symm == RTE_ETH_HASH_FUNCTION_SIMPLE_XOR) {
                       ^
cc1: all warnings being treated as errors
[850/1715] Compiling C object 'drivers/a715181@@tmp_rte_pmd_ice@sta/net_ice_ice_fdir_filter.c.o'.
[851/1715] Compiling C object 'drivers/a715181@@tmp_rte_pmd_ice@sta/net_ice_ice_rxtx.c.o'.
[852/1715] Compiling C object 'drivers/a715181@@tmp_rte_pmd_ice@sta/net_ice_ice_ethdev.c.o'.
[853/1715] Compiling C object 'drivers/a715181@@tmp_rte_pmd_ice@sta/net_ice_ice_rxtx_vec_avx2.c.o'.
[854/1715] Compiling C object 'drivers/a715181@@tmp_rte_pmd_ice@sta/net_ice_ice_rxtx_vec_sse.c.o'.
ninja: build stopped: subcommand failed




*Meson Build Failed #4:
OS: UB1804-64
Target:build-gcc-static
FAILED: drivers/a715181@@tmp_rte_pmd_ice@sta/net_ice_ice_hash.c.o 
gcc -Idrivers/a715181@@tmp_rte_pmd_ice@sta -Idrivers -I../drivers -Idrivers/net/ice -I../drivers/net/ice -Idrivers/net/ice/base -I../drivers/net/ice/base -Ilib/librte_ethdev -I../lib/librte_ethdev -I. -I../ -Iconfig -I../config -Ilib/librte_eal/common/include -I../lib/librte_eal/common/include -I../lib/librte_eal/linux/eal/include -Ilib/librte_eal/common -I../lib/librte_eal/common -Ilib/librte_eal/common/include/arch/x86 -I../lib/librte_eal/common/include/arch/x86 -Ilib/librte_eal -I../lib/librte_eal -Ilib/librte_kvargs -I../lib/librte_kvargs -Ilib/librte_net -I../lib/librte_net -Ilib/librte_mbuf -I../lib/librte_mbuf -Ilib/librte_mempool -I../lib/librte_mempool -Ilib/librte_ring -I../lib/librte_ring -Ilib/librte_meter -I../lib/librte_meter -Idrivers/bus/pci -I../drivers/bus/pci -I../drivers/bus/pci/linux -Ilib/librte_pci -I../lib/librte_pci -Idrivers/bus/vdev -I../drivers/bus/vdev -Ilib/librte_hash -I../lib/librte_hash -fdiagnostics-color=always -pipe -D_FILE_OFFSET_BITS=64 -Wall -Winvalid-pch -Werror -O3 -include rte_config.h -Wunused-parameter -Wsign-compare -Wcast-qual -D_GNU_SOURCE -fPIC -march=native -mno-avx512f -Wno-format-truncation -DALLOW_EXPERIMENTAL_API -MD -MQ 'drivers/a715181@@tmp_rte_pmd_ice@sta/net_ice_ice_hash.c.o' -MF 'drivers/a715181@@tmp_rte_pmd_ice@sta/net_ice_ice_hash.c.o.d' -o 'drivers/a715181@@tmp_rte_pmd_ice@sta/net_ice_ice_hash.c.o' -c ../drivers/net/ice/ice_hash.c
../drivers/net/ice/ice_hash.c: In function ‘ice_hash_destroy’:
../drivers/net/ice/ice_hash.c:525:23: error: comparison of constant ‘2’ with boolean expression is always false [-Werror=bool-compare]
  if (filter_ptr->symm == RTE_ETH_HASH_FUNCTION_SIMPLE_XOR) {
                       ^~
cc1: all warnings being treated as errors
[884/1869] Compiling C object 'drivers/a715181@@tmp_rte_pmd_ice@sta/net_ice_ice_generic_flow.c.o'.
[885/1869] Compiling C object 'drivers/a715181@@tmp_rte_pmd_ice@sta/net_ice_ice_switch_filter.c.o'.
[886/1869] Compiling C object 'drivers/a715181@@tmp_rte_pmd_ice@sta/net_ice_ice_fdir_filter.c.o'.
[887/1869] Compiling C object 'drivers/a715181@@tmp_rte_pmd_ice@sta/net_ice_ice_ethdev.c.o'.
[888/1869] Compiling C object 'drivers/a715181@@tmp_rte_pmd_ice@sta/net_ice_ice_rxtx.c.o'.
ninja: build stopped: subcommand failed




*Meson Build Failed #5:
OS: FreeBSD12-64
Target:build-gcc-static
FAILED: drivers/a715181@@tmp_rte_pmd_ice@sta/net_ice_ice_hash.c.o 
ccache gcc -Idrivers/a715181@@tmp_rte_pmd_ice@sta -Idrivers -I../drivers -Idrivers/net/ice -I../drivers/net/ice -Idrivers/net/ice/base -I../drivers/net/ice/base -Ilib/librte_ethdev -I../lib/librte_ethdev -I. -I../ -Iconfig -I../config -Ilib/librte_eal/common/include -I../lib/librte_eal/common/include -I../lib/librte_eal/freebsd/eal/include -Ilib/librte_eal/common -I../lib/librte_eal/common -Ilib/librte_eal/common/include/arch/x86 -I../lib/librte_eal/common/include/arch/x86 -Ilib/librte_eal -I../lib/librte_eal -Ilib/librte_kvargs -I../lib/librte_kvargs -Ilib/librte_net -I../lib/librte_net -Ilib/librte_mbuf -I../lib/librte_mbuf -Ilib/librte_mempool -I../lib/librte_mempool -Ilib/librte_ring -I../lib/librte_ring -Ilib/librte_meter -I../lib/librte_meter -Idrivers/bus/pci -I../drivers/bus/pci -I../drivers/bus/pci/bsd -Ilib/librte_pci -I../lib/librte_pci -Idrivers/bus/vdev -I../drivers/bus/vdev -Ilib/librte_hash -I../lib/librte_hash -fdiagnostics-color=always -pipe -D_FILE_OFFSET_BITS=64 -Wall -Winvalid-pch -Werror -O3 -include rte_config.h -Wunused-parameter -Wsign-compare -Wcast-qual -D_GNU_SOURCE -D__BSD_VISIBLE -fPIC -march=native -Wno-format-truncation -DALLOW_EXPERIMENTAL_API -MD -MQ 'drivers/a715181@@tmp_rte_pmd_ice@sta/net_ice_ice_hash.c.o' -MF 'drivers/a715181@@tmp_rte_pmd_ice@sta/net_ice_ice_hash.c.o.d' -o 'drivers/a715181@@tmp_rte_pmd_ice@sta/net_ice_ice_hash.c.o' -c ../drivers/net/ice/ice_hash.c
../drivers/net/ice/ice_hash.c: In function 'ice_hash_destroy':
../drivers/net/ice/ice_hash.c:525:23: error: comparison of constant '2' with boolean expression is always false [-Werror=bool-compare]
  if (filter_ptr->symm == RTE_ETH_HASH_FUNCTION_SIMPLE_XOR) {
                       ^~
cc1: all warnings being treated as errors
[800/1446] Compiling C object 'drivers/a715181@@tmp_rte_pmd_ice@sta/net_ice_ice_ethdev.c.o'.
[801/1446] Compiling C object 'drivers/a715181@@tmp_rte_pmd_ipn3ke@sta/net_ipn3ke_ipn3ke_ethdev.c.o'.
[802/1446] Compiling C object 'drivers/a715181@@tmp_rte_pmd_ice@sta/net_ice_ice_rxtx_vec_sse.c.o'.
[803/1446] Compiling C object 'drivers/a715181@@tmp_rte_pmd_ice@sta/net_ice_ice_rxtx_vec_avx2.c.o'.
[804/1446] Compiling C object 'drivers/a715181@@tmp_rte_pmd_ipn3ke@sta/net_ipn3ke_ipn3ke_representor.c.o'.
ninja: build stopped: subcommand failed



DPDK STV team

^ permalink raw reply	[flat|nested] only message in thread

only message in thread, other threads:[~2019-10-20  3:09 UTC | newest]

Thread overview: (only message) (download: mbox.gz / follow: Atom feed)
-- links below jump to the message on this page --
2019-10-20  3:09 [dpdk-test-report] |FAILURE| pw61480[v7, 2/2] net/ice: enable advanced RSS sys_stv

automatic DPDK test reports

This inbox may be cloned and mirrored by anyone:

	git clone --mirror https://inbox.dpdk.org/test-report/0 test-report/git/0.git

	# If you have public-inbox 1.1+ installed, you may
	# initialize and index your mirror using the following commands:
	public-inbox-init -V2 test-report test-report/ https://inbox.dpdk.org/test-report \
		test-report@dpdk.org
	public-inbox-index test-report

Example config snippet for mirrors.
Newsgroup available over NNTP:
	nntp://inbox.dpdk.org/inbox.dpdk.test-report


AGPL code for this site: git clone https://public-inbox.org/public-inbox.git