automatic DPDK test reports
 help / color / mirror / Atom feed
* [dpdk-test-report] |FAILURE| pw61500[v4] app/testpmd: enable GTP header parse and Tx checksum offload
@ 2019-10-21  5:57 sys_stv
  0 siblings, 0 replies; only message in thread
From: sys_stv @ 2019-10-21  5:57 UTC (permalink / raw)
  To: test-report

[-- Attachment #1: Type: text/plain, Size: 63508 bytes --]

Test-Label: Intel-compilation
Test-Status: FAILURE
http://dpdk.org/patch/61500

_Compilation issues_

Submitter: Ting Xu <ting.xu@intel.com>
Date: 2019-10-21 12:29:13
Reply_mail: 20191021122913.35281-1-ting.xu@intel.com
DPDK git baseline: Repo:dpdk, CommitID: b36f587f010bba421a8fd0b4c383276ecb796ae3

Makefile build Summary: 22 Builds Done, 0 Successful, 22 Failures

Meson build Summary: 7 Builds Done, 2 Successful, 5 Failures

               +==============================================+===========+==========+
               |                   Makefile                   |   Meson   | Document |
+--------------+------+-------+------+------------+-----------+-----------+----------+
| os           | gcc  | clang | icc  | gcc+shared | gcc+debug | gcc/clang | pdf/html |
+--------------+------+-------+------+------------+-----------+-----------+----------+
| RHEL76-64    | FAIL |       |      |            |           |           |          |
| CENTOS76-64  | FAIL | FAIL  | FAIL | FAIL       | FAIL      |           |          |
| UB1804-64    | FAIL | FAIL  | FAIL |            |           | FAIL      | pass     |
| UB1604-32    | FAIL |       |      |            |           | FAIL      |          |
| UB1904-64    | FAIL |       |      |            |           |           |          |
| UB1604-64    | FAIL | FAIL  |      |            |           |           |          |
| FC30-64      | FAIL | FAIL  |      |            |           | FAIL      |          |
| WIN10-64     |      |       |      |            |           | pass      |          |
| FreeBSD12-64 | FAIL | FAIL  |      | FAIL       | FAIL      | FAIL      |          |
| RHEL80-64    | FAIL |       |      |            |           |           |          |
| SUSE15-64    | FAIL | FAIL  |      |            |           | FAIL      |          |
+--------------+------+-------+------+------------+-----------+-----------+----------+

Test environment and configuration as below:

** Makefile build **


OS: RHEL76-64
	Kernel Version: 3.10.0-957.el7.x86_64
	CPU info: Intel(R) Xeon(R) CPU E5-2699 v4 @ 2.20GHz
	GCC Version: gcc (GCC) 4.8.5 20150623 (Red Hat 4.8.5-36)
	Clang Version: NA
	x86_64-native-linuxapp-gcc


OS: CENTOS76-64
	Kernel Version: 3.10.0-957.27.2.el7.x86_64
	CPU info: Intel(R) Xeon(R) CPU E5-2699 v4 @ 2.20GHz
	GCC Version: gcc (GCC) 4.8.5 20150623 (Red Hat 4.8.5-36)
	Clang Version: 3.4.2 (tags/RELEASE_34/dot2-final)
	x86_64-native-linuxapp-clang
	x86_64-native-linuxapp-gcc
	x86_64-native-linuxapp-gcc+debug
	x86_64-native-linuxapp-gcc+shared
	x86_64-native-linuxapp-icc


OS: UB1804-64
	Kernel Version: 4.15.0-20-generic
	CPU info: Intel(R) Xeon(R) CPU E5-2699 v3 @ 2.30GHz
	GCC Version: gcc (Ubuntu 7.3.0-16ubuntu3) 7.3.0
	Clang Version: 6.0.0-1ubuntu2 (tags/RELEASE_600/final)
	x86_64-native-linuxapp-clang
	x86_64-native-linuxapp-icc
	x86_64-native-linuxapp-gcc


OS: UB1904-64
	Kernel Version: 5.0.0-13-generic
	CPU info: Intel(R) Xeon(R) CPU E5-2699 v3 @ 2.30GHz
	GCC Version: gcc (Ubuntu 8.3.0-6ubuntu1) 8.3.0
	Clang Version: 8.0.0-3 (tags/RELEASE_800/final)
	x86_64-native-linuxapp-gcc


OS: UB1604-32
	Kernel Version: 4.4.0-131-generic
	CPU info: Intel(R) Xeon(R) CPU E5-2699 v3 @ 2.30GHz
	GCC Version: gcc (Ubuntu 5.4.0-6ubuntu1~16.04.11) 5.4.0 20160609
	Clang Version: 3.8.0-2ubuntu4 (tags/RELEASE_380/final)
	i686-native-linuxapp-gcc


OS: UB1604-64
	Kernel Version: 4.4.0-47-generic
	CPU info: Intel(R) Xeon(R) CPU E5-2699 v3 @ 2.30GHz
	GCC Version: gcc (Ubuntu 5.4.0-6ubuntu1~16.04.10) 5.4.0 20160609
	Clang Version: 3.8.0-2ubuntu4 (tags/RELEASE_380/final)
	x86_64-native-linuxapp-clang
	x86_64-native-linuxapp-gcc


OS: FC30-64
	Kernel Version: 5.1.7-300.fc30.x86_64
	CPU info: Intel(R) Xeon(R) CPU E5-2699 v4 @ 2.20GHz
	GCC Version: gcc (GCC) 9.1.1 20190503 (Red Hat 9.1.1-1)
	Clang Version: 8.0.0 (Fedora 8.0.0-1.fc30)
	x86_64-native-linuxapp-gcc
	x86_64-native-linuxapp-clang


OS: FreeBSD12-64
	Kernel Version: 12.0-RC3
	CPU info: Intel(R) Xeon(R) CPU E5-2699 v4 @ 2.20GHz (2194.98-MHz K8-class CPU)
	GCC Version: gcc (FreeBSD Ports Collection) 7.3.0
	Clang Version: 6.0.1 (tags/RELEASE_601/final 335540) (based on LLVM 6.0.1)
	x86_64-native-bsdapp-gcc+debug
	x86_64-native-bsdapp-gcc+shared
	x86_64-native-bsdapp-clang
	x86_64-native-bsdapp-gcc


OS: RHEL80-64
	Kernel Version: 4.18.0-80.el8.x86_64
	CPU info: Intel(R) Xeon(R) CPU E5-2699 v4 @ 2.20GHz
	GCC Version: gcc (GCC) 8.2.1 20180905 (Red Hat 8.2.1-3)
	Clang Version: 6.0.1 (tags/RELEASE_601/final)
	x86_64-native-linuxapp-gcc


OS: SUSE15-64
	Kernel Version: 4.12.14-lp150.11-default
	CPU info: Intel(R) Xeon(R) CPU E5-2699 v4 @ 2.20GHz
	GCC Version: gcc (SUSE Linux) 7.3.1 20180323 [gcc-7-branch revision 258812]
	Clang Version: 5.0.1 (tags/RELEASE_501/final 312548)
	x86_64-native-linuxapp-gcc
	x86_64-native-linuxapp-clang


** Meson build **


OS: UB1804-64
	Kernel Version: 4.15.0-20-generic
	CPU info: Intel(R) Xeon(R) CPU E5-2699 v4 @ 2.20GHz
	GCC Version: gcc (Ubuntu 7.3.0-27ubuntu1~18.04) 7.3.0
	Clang Version: 6.0.0-1ubuntu2 (tags/RELEASE_600/final)
	x86_64-native-linuxapp-doc
	build-gcc-static
	build-gcc-shared
	build-clang-static
	build-clang-shared
	build-x86-default


OS: UB1604-32
	Kernel Version: 4.4.0-131-generic
	CPU info: Intel(R) Xeon(R) CPU E5-2699 v4 @ 2.20GHz
	GCC Version: gcc (Ubuntu 5.4.0-6ubuntu1~16.04.11) 5.4.0 20160609
	Clang Version: 3.8.0-2ubuntu4 (tags/RELEASE_380/final)
	build-gcc-static
	build-gcc-shared
	build-clang-static
	build-clang-shared
	build-x86-default


OS: FC30-64
	Kernel Version: 5.0.9-301.fc30.x86_64
	CPU info: Intel(R) Xeon(R) CPU E5-2699 v4 @ 2.20GHz
	GCC Version: gcc (GCC) 9.1.1 20190503 (Red Hat 9.1.1-1)
	Clang Version: 8.0.0 (Fedora 8.0.0-1.fc30)
	build-gcc-static
	build-gcc-shared
	build-clang-static
	build-clang-shared
	build-x86-default


OS: WIN10-64
	Kernel Version: N/A
	CPU info: N/A
	GCC Version: N/A
	Clang Version: Clang 8.0.0
	x86_64-windows-clang


OS: FreeBSD12-64
	Kernel Version: 12.0-RC3
	CPU info: Intel(R) Xeon(R) CPU E5-2699 v4 @ 2.20GHz (2194.97-MHz K8-class CPU)
	GCC Version: gcc (FreeBSD Ports Collection) 7.3.0
	Clang Version: 6.0.1 (tags/RELEASE_601/final 335540) (based on LLVM 6.0.1)
	build-gcc-static
	build-gcc-shared
	build-clang-static
	build-clang-shared
	build-x86-default


OS: SUSE15-64
	Kernel Version: 4.12.14-lp150.11-default
	CPU info: Intel(R) Xeon(R) CPU E5-2699 v4 @ 2.20GHz
	GCC Version: gcc (SUSE Linux) 7.3.1 20180323 [gcc-7-branch revision 258812]
	Clang Version: 5.0.1 (tags/RELEASE_501/final 312548)
	build-gcc-static
	build-gcc-shared
	build-clang-static
	build-clang-shared
	build-x86-default


*Make Build Failed #1:
OS: UB1604-64
Target: x86_64-native-linuxapp-clang
  CC test_hash_perf.o
/tmp/UB1604-64_K4.4.0_Clang3.8.0/x86_64-native-linuxapp-clang/05f63dc8e8474372b063ae095af51c67/dpdk/app/test-pmd/csumonly.c:861:21: error: use of undeclared identifier 'PKT_TX_TUNNEL_GTP'
                                        tx_ol_flags |= PKT_TX_TUNNEL_GTP;
                                                       ^
1 error generated.
/tmp/UB1604-64_K4.4.0_Clang3.8.0/x86_64-native-linuxapp-clang/05f63dc8e8474372b063ae095af51c67/dpdk/mk/internal/rte.compile-pre.mk:114: recipe for target 'csumonly.o' failed
make[5]: *** [csumonly.o] Error 1
make[5]: *** Waiting for unfinished jobs....
  CC test_hash_functions.o
  CC test_hash_multiwriter.o
  CC test_hash_readwrite.o
  CC test_hash_readwrite_lf.o
/tmp/UB1604-64_K4.4.0_Clang3.8.0/x86_64-native-linuxapp-clang/05f63dc8e8474372b063ae095af51c67/dpdk/mk/rte.subdir.mk:35: recipe for target 'test-pmd' failed
make[4]: *** [test-pmd] Error 2
make[4]: *** Waiting for unfinished jobs....
  CC test_lpm.o
  CC test_lpm_perf.o
  CC test_lpm6.o
  CC test_lpm6_perf.o
--
  CC test_ipsec.o
  MKRES test_resource_c.res.o
  LD test
  INSTALL-APP test
  INSTALL-MAP test.map
/tmp/UB1604-64_K4.4.0_Clang3.8.0/x86_64-native-linuxapp-clang/05f63dc8e8474372b063ae095af51c67/dpdk/mk/rte.sdkbuild.mk:46: recipe for target 'app' failed
make[3]: *** [app] Error 2
/tmp/UB1604-64_K4.4.0_Clang3.8.0/x86_64-native-linuxapp-clang/05f63dc8e8474372b063ae095af51c67/dpdk/mk/rte.sdkroot.mk:98: recipe for target 'all' failed
make[2]: *** [all] Error 2
/tmp/UB1604-64_K4.4.0_Clang3.8.0/x86_64-native-linuxapp-clang/05f63dc8e8474372b063ae095af51c67/dpdk/mk/rte.sdkinstall.mk:60: recipe for target 'pre_install' failed
make[1]: *** [pre_install] Error 2
/tmp/UB1604-64_K4.4.0_Clang3.8.0/x86_64-native-linuxapp-clang/05f63dc8e8474372b063ae095af51c67/dpdk/mk/rte.sdkroot.mk:77: recipe for target 'install' failed
make: *** [install] Error 2


*Make Build Failed #2:
OS: UB1604-32
Target: i686-native-linuxapp-gcc
                     ^
/tmp/UB1604-32_K4.4.0_GCC5.4.0/i686-native-linuxapp-gcc/05f63dc8e8474372b063ae095af51c67/dpdk/app/test-pmd/csumonly.c:861:21: note: each undeclared identifier is reported only once for each function it appears in
  CC test_hash_readwrite_lf.o
/tmp/UB1604-32_K4.4.0_GCC5.4.0/i686-native-linuxapp-gcc/05f63dc8e8474372b063ae095af51c67/dpdk/app/test-pmd/csumonly.c: At top level:
cc1: warning: unrecognized command line option ‘-Wno-address-of-packed-member’
/tmp/UB1604-32_K4.4.0_GCC5.4.0/i686-native-linuxapp-gcc/05f63dc8e8474372b063ae095af51c67/dpdk/mk/internal/rte.compile-pre.mk:114: recipe for target 'csumonly.o' failed
make[5]: *** [csumonly.o] Error 1
make[5]: *** Waiting for unfinished jobs....
  CC test_lpm.o
  CC test_lpm_perf.o
  CC test_lpm6_perf.o
  CC test_lpm6.o
--
  CC test_latencystats.o
  CC test_cmdline.o
  CC test_cmdline_num.o
  CC test_cmdline_etheraddr.o
  CC test_cmdline_portlist.o
/tmp/UB1604-32_K4.4.0_GCC5.4.0/i686-native-linuxapp-gcc/05f63dc8e8474372b063ae095af51c67/dpdk/mk/rte.subdir.mk:35: recipe for target 'test-pmd' failed
make[4]: *** [test-pmd] Error 2
make[4]: *** Waiting for unfinished jobs....
  CC test_cmdline_ipaddr.o
  CC test_cmdline_cirbuf.o
  CC test_cmdline_string.o
  CC test_cmdline_lib.o
--
  CC test_ipsec.o
  MKRES test_resource_c.res.o
  LD test
  INSTALL-APP test
  INSTALL-MAP test.map
/tmp/UB1604-32_K4.4.0_GCC5.4.0/i686-native-linuxapp-gcc/05f63dc8e8474372b063ae095af51c67/dpdk/mk/rte.sdkbuild.mk:46: recipe for target 'app' failed
make[3]: *** [app] Error 2
/tmp/UB1604-32_K4.4.0_GCC5.4.0/i686-native-linuxapp-gcc/05f63dc8e8474372b063ae095af51c67/dpdk/mk/rte.sdkroot.mk:98: recipe for target 'all' failed
make[2]: *** [all] Error 2
/tmp/UB1604-32_K4.4.0_GCC5.4.0/i686-native-linuxapp-gcc/05f63dc8e8474372b063ae095af51c67/dpdk/mk/rte.sdkinstall.mk:60: recipe for target 'pre_install' failed
make[1]: *** [pre_install] Error 2
/tmp/UB1604-32_K4.4.0_GCC5.4.0/i686-native-linuxapp-gcc/05f63dc8e8474372b063ae095af51c67/dpdk/mk/rte.sdkroot.mk:77: recipe for target 'install' failed
make: *** [install] Error 2


*Make Build Failed #3:
OS: UB1904-64
Target: x86_64-native-linuxapp-gcc
/tmp/UB1904-64_K4.18.0_GCC8.3.0/x86_64-native-linuxapp-gcc/05f63dc8e8474372b063ae095af51c67/dpdk/app/test-pmd/csumonly.c:861:21: note: each undeclared identifier is reported only once for each function it appears in
/tmp/UB1904-64_K4.18.0_GCC8.3.0/x86_64-native-linuxapp-gcc/05f63dc8e8474372b063ae095af51c67/dpdk/app/test-pmd/csumonly.c: At top level:
cc1: warning: unrecognized command line option ‘-Wno-address-of-packed-member’
  CC test_pipeline_queue.o
  CC test_table_combined.o
make[5]: *** [/tmp/UB1904-64_K4.18.0_GCC8.3.0/x86_64-native-linuxapp-gcc/05f63dc8e8474372b063ae095af51c67/dpdk/mk/internal/rte.compile-pre.mk:116: csumonly.o] Error 1
make[5]: *** Waiting for unfinished jobs....
  CC test_table_acl.o
  CC test_flow_classify.o
  CC test_pipeline_atq.o
  CC test_rwlock.o
make[4]: *** [/tmp/UB1904-64_K4.18.0_GCC8.3.0/x86_64-native-linuxapp-gcc/05f63dc8e8474372b063ae095af51c67/dpdk/mk/rte.subdir.mk:35: test-pmd] Error 2
make[4]: *** Waiting for unfinished jobs....
  CC test_stack.o
  CC test_stack_perf.o
  CC test_timer.o
  CC test_timer_perf.o
--
  CC test_ipsec.o
  MKRES test_resource_c.res.o
  LD test
  INSTALL-APP test
  INSTALL-MAP test.map
make[3]: *** [/tmp/UB1904-64_K4.18.0_GCC8.3.0/x86_64-native-linuxapp-gcc/05f63dc8e8474372b063ae095af51c67/dpdk/mk/rte.sdkbuild.mk:48: app] Error 2
make[2]: *** [/tmp/UB1904-64_K4.18.0_GCC8.3.0/x86_64-native-linuxapp-gcc/05f63dc8e8474372b063ae095af51c67/dpdk/mk/rte.sdkroot.mk:99: all] Error 2
make[1]: *** [/tmp/UB1904-64_K4.18.0_GCC8.3.0/x86_64-native-linuxapp-gcc/05f63dc8e8474372b063ae095af51c67/dpdk/mk/rte.sdkinstall.mk:61: pre_install] Error 2
make: *** [/tmp/UB1904-64_K4.18.0_GCC8.3.0/x86_64-native-linuxapp-gcc/05f63dc8e8474372b063ae095af51c67/dpdk/mk/rte.sdkroot.mk:77: install] Error 2


*Make Build Failed #4:
OS: UB1804-64
Target: x86_64-native-linuxapp-clang
  CC test_timer_racecond.o
/tmp/UB1804-64_K4.15.0_Clang6.0.0/x86_64-native-linuxapp-clang/05f63dc8e8474372b063ae095af51c67/dpdk/app/test-pmd/csumonly.c:861:21: error: use of undeclared identifier 'PKT_TX_TUNNEL_GTP'
                                        tx_ol_flags |= PKT_TX_TUNNEL_GTP;
                                                       ^
1 error generated.
/tmp/UB1804-64_K4.15.0_Clang6.0.0/x86_64-native-linuxapp-clang/05f63dc8e8474372b063ae095af51c67/dpdk/mk/internal/rte.compile-pre.mk:114: recipe for target 'csumonly.o' failed
make[5]: *** [csumonly.o] Error 1
make[5]: *** Waiting for unfinished jobs....
  CC test_timer_secondary.o
  CC test_mempool.o
  CC test_mempool_perf.o
  CC test_mbuf.o
--
  CC test_memcpy.o
  CC test_pipeline_atq.o
  CC test_memcpy_perf.o
  CC test_member.o
  CC test_member_perf.o
/tmp/UB1804-64_K4.15.0_Clang6.0.0/x86_64-native-linuxapp-clang/05f63dc8e8474372b063ae095af51c67/dpdk/mk/rte.subdir.mk:35: recipe for target 'test-pmd' failed
make[4]: *** [test-pmd] Error 2
make[4]: *** Waiting for unfinished jobs....
  CC test_efd.o
  CC test_efd_perf.o
  CC test_hash.o
  CC test_thash.o
--
  CC test_ipsec.o
  MKRES test_resource_c.res.o
  LD test
  INSTALL-APP test
  INSTALL-MAP test.map
/tmp/UB1804-64_K4.15.0_Clang6.0.0/x86_64-native-linuxapp-clang/05f63dc8e8474372b063ae095af51c67/dpdk/mk/rte.sdkbuild.mk:46: recipe for target 'app' failed
make[3]: *** [app] Error 2
/tmp/UB1804-64_K4.15.0_Clang6.0.0/x86_64-native-linuxapp-clang/05f63dc8e8474372b063ae095af51c67/dpdk/mk/rte.sdkroot.mk:98: recipe for target 'all' failed
make[2]: *** [all] Error 2
/tmp/UB1804-64_K4.15.0_Clang6.0.0/x86_64-native-linuxapp-clang/05f63dc8e8474372b063ae095af51c67/dpdk/mk/rte.sdkinstall.mk:60: recipe for target 'pre_install' failed
make[1]: *** [pre_install] Error 2
/tmp/UB1804-64_K4.15.0_Clang6.0.0/x86_64-native-linuxapp-clang/05f63dc8e8474372b063ae095af51c67/dpdk/mk/rte.sdkroot.mk:77: recipe for target 'install' failed
make: *** [install] Error 2


*Make Build Failed #5:
OS: UB1804-64
Target: x86_64-native-linuxapp-icc
/tmp/UB1804-64_K4.15.0_ICC19.0.0/x86_64-native-linuxapp-icc/05f63dc8e8474372b063ae095af51c67/dpdk/app/test-pmd/csumonly.c(861): error: identifier "PKT_TX_TUNNEL_GTP" is undefined
  					tx_ol_flags |= PKT_TX_TUNNEL_GTP;
  					               ^

compilation aborted for /tmp/UB1804-64_K4.15.0_ICC19.0.0/x86_64-native-linuxapp-icc/05f63dc8e8474372b063ae095af51c67/dpdk/app/test-pmd/csumonly.c (code 2)
/tmp/UB1804-64_K4.15.0_ICC19.0.0/x86_64-native-linuxapp-icc/05f63dc8e8474372b063ae095af51c67/dpdk/mk/internal/rte.compile-pre.mk:114: recipe for target 'csumonly.o' failed
make[5]: *** [csumonly.o] Error 2
make[5]: *** Waiting for unfinished jobs....
  CC test_mempool.o
  CC test_perf_queue.o
  CC test_mempool_perf.o
  CC test_mbuf.o
--
  CC test_pipeline_common.o
  CC test_memcpy.o
  CC test_memcpy_perf.o
  CC test_member.o
  CC test_member_perf.o
/tmp/UB1804-64_K4.15.0_ICC19.0.0/x86_64-native-linuxapp-icc/05f63dc8e8474372b063ae095af51c67/dpdk/mk/rte.subdir.mk:35: recipe for target 'test-pmd' failed
make[4]: *** [test-pmd] Error 2
make[4]: *** Waiting for unfinished jobs....
  CC test_pipeline_queue.o
  CC test_efd_perf.o
  CC test_hash.o
  CC test_efd.o
--
  CC test_ipsec.o
  MKRES test_resource_c.res.o
  LD test
  INSTALL-APP test
  INSTALL-MAP test.map
/tmp/UB1804-64_K4.15.0_ICC19.0.0/x86_64-native-linuxapp-icc/05f63dc8e8474372b063ae095af51c67/dpdk/mk/rte.sdkbuild.mk:46: recipe for target 'app' failed
make[3]: *** [app] Error 2
/tmp/UB1804-64_K4.15.0_ICC19.0.0/x86_64-native-linuxapp-icc/05f63dc8e8474372b063ae095af51c67/dpdk/mk/rte.sdkroot.mk:98: recipe for target 'all' failed
make[2]: *** [all] Error 2
/tmp/UB1804-64_K4.15.0_ICC19.0.0/x86_64-native-linuxapp-icc/05f63dc8e8474372b063ae095af51c67/dpdk/mk/rte.sdkinstall.mk:60: recipe for target 'pre_install' failed
make[1]: *** [pre_install] Error 2
/tmp/UB1804-64_K4.15.0_ICC19.0.0/x86_64-native-linuxapp-icc/05f63dc8e8474372b063ae095af51c67/dpdk/mk/rte.sdkroot.mk:77: recipe for target 'install' failed
make: *** [install] Error 2


*Make Build Failed #6:
OS: SUSE15-64
Target: x86_64-native-linuxapp-gcc
                     ^~~~~~~~~~~~~~~~~
                     PKT_TX_TUNNEL_IP
/tmp/SUSE15-64_K4.12.14_GCC7.3.1/x86_64-native-linuxapp-gcc/05f63dc8e8474372b063ae095af51c67/dpdk/app/test-pmd/csumonly.c:861:21: note: each undeclared identifier is reported only once for each function it appears in
/tmp/SUSE15-64_K4.12.14_GCC7.3.1/x86_64-native-linuxapp-gcc/05f63dc8e8474372b063ae095af51c67/dpdk/app/test-pmd/csumonly.c: At top level:
cc1: warning: unrecognized command line option ‘-Wno-address-of-packed-member’
make[5]: *** [/tmp/SUSE15-64_K4.12.14_GCC7.3.1/x86_64-native-linuxapp-gcc/05f63dc8e8474372b063ae095af51c67/dpdk/mk/internal/rte.compile-pre.mk:116: csumonly.o] Error 1
make[5]: *** Waiting for unfinished jobs....
  CC test_table_combined.o
  CC test_table_acl.o
  CC test_flow_classify.o
  CC test_rwlock.o
--
  CC test_mempool_perf.o
  CC test_mbuf.o
  CC test_logs.o
  CC test_memcpy.o
  CC test_memcpy_perf.o
make[4]: *** [/tmp/SUSE15-64_K4.12.14_GCC7.3.1/x86_64-native-linuxapp-gcc/05f63dc8e8474372b063ae095af51c67/dpdk/mk/rte.subdir.mk:35: test-pmd] Error 2
make[4]: *** Waiting for unfinished jobs....
  CC test_member.o
  CC test_member_perf.o
  CC test_efd.o
  CC test_efd_perf.o
--
  CC test_ipsec.o
  MKRES test_resource_c.res.o
  LD test
  INSTALL-MAP test.map
  INSTALL-APP test
make[3]: *** [/tmp/SUSE15-64_K4.12.14_GCC7.3.1/x86_64-native-linuxapp-gcc/05f63dc8e8474372b063ae095af51c67/dpdk/mk/rte.sdkbuild.mk:48: app] Error 2
make[2]: *** [/tmp/SUSE15-64_K4.12.14_GCC7.3.1/x86_64-native-linuxapp-gcc/05f63dc8e8474372b063ae095af51c67/dpdk/mk/rte.sdkroot.mk:99: all] Error 2
make[1]: *** [/tmp/SUSE15-64_K4.12.14_GCC7.3.1/x86_64-native-linuxapp-gcc/05f63dc8e8474372b063ae095af51c67/dpdk/mk/rte.sdkinstall.mk:61: pre_install] Error 2
make: *** [/tmp/SUSE15-64_K4.12.14_GCC7.3.1/x86_64-native-linuxapp-gcc/05f63dc8e8474372b063ae095af51c67/dpdk/mk/rte.sdkroot.mk:77: install] Error 2


*Make Build Failed #7:
OS: FC30-64
Target: x86_64-native-linuxapp-gcc
  CC test_timer.o
  CC test_timer_perf.o
  CC test_timer_racecond.o
  CC test_timer_secondary.o
  CC test_mempool.o
make[5]: *** [/tmp/FC30-64_K4.20_GCC9.1.1/x86_64-native-linuxapp-gcc/05f63dc8e8474372b063ae095af51c67/dpdk/mk/internal/rte.compile-pre.mk:114: csumonly.o] Error 1
make[5]: *** Waiting for unfinished jobs....
  CC test_mempool_perf.o
  CC test_mbuf.o
  CC noisy_vnf.o
  CC test_logs.o
--
  CC test_thash.o
  CC test_hash_perf.o
  CC test_hash_functions.o
  CC test_hash_multiwriter.o
  CC test_hash_readwrite.o
make[4]: *** [/tmp/FC30-64_K4.20_GCC9.1.1/x86_64-native-linuxapp-gcc/05f63dc8e8474372b063ae095af51c67/dpdk/mk/rte.subdir.mk:35: test-pmd] Error 2
make[4]: *** Waiting for unfinished jobs....
  CC test_hash_readwrite_lf.o
  CC test_lpm.o
  CC test_lpm_perf.o
  CC test_lpm6.o
--
  CC test_ipsec.o
  MKRES test_resource_c.res.o
  LD test
  INSTALL-APP test
  INSTALL-MAP test.map
make[3]: *** [/tmp/FC30-64_K4.20_GCC9.1.1/x86_64-native-linuxapp-gcc/05f63dc8e8474372b063ae095af51c67/dpdk/mk/rte.sdkbuild.mk:48: app] Error 2
make[2]: *** [/tmp/FC30-64_K4.20_GCC9.1.1/x86_64-native-linuxapp-gcc/05f63dc8e8474372b063ae095af51c67/dpdk/mk/rte.sdkroot.mk:99: all] Error 2
make[1]: *** [/tmp/FC30-64_K4.20_GCC9.1.1/x86_64-native-linuxapp-gcc/05f63dc8e8474372b063ae095af51c67/dpdk/mk/rte.sdkinstall.mk:61: pre_install] Error 2
make: *** [/tmp/FC30-64_K4.20_GCC9.1.1/x86_64-native-linuxapp-gcc/05f63dc8e8474372b063ae095af51c67/dpdk/mk/rte.sdkroot.mk:77: install] Error 2


*Make Build Failed #8:
OS: RHEL80-64
Target: x86_64-native-linuxapp-gcc
/tmp/RHEL80-64_K3.10.0_GCC8.2.1/x86_64-native-linuxapp-gcc/05f63dc8e8474372b063ae095af51c67/dpdk/app/test-pmd/csumonly.c:861:21: note: each undeclared identifier is reported only once for each function it appears in
/tmp/RHEL80-64_K3.10.0_GCC8.2.1/x86_64-native-linuxapp-gcc/05f63dc8e8474372b063ae095af51c67/dpdk/app/test-pmd/csumonly.c: At top level:
cc1: warning: unrecognized command line option ‘-Wno-address-of-packed-member’
  INSTALL-APP dpdk-test-eventdev
  INSTALL-MAP dpdk-test-crypto-perf.map
make[5]: *** [/tmp/RHEL80-64_K3.10.0_GCC8.2.1/x86_64-native-linuxapp-gcc/05f63dc8e8474372b063ae095af51c67/dpdk/mk/internal/rte.compile-pre.mk:114: csumonly.o] Error 1
make[5]: *** Waiting for unfinished jobs....
  CC test_timer.o
  INSTALL-MAP dpdk-test-eventdev.map
  CC test_timer_perf.o
  CC test_timer_racecond.o
--
  CC test_member.o
  CC test_member_perf.o
  CC test_efd.o
  CC test_efd_perf.o
  CC test_hash.o
make[4]: *** [/tmp/RHEL80-64_K3.10.0_GCC8.2.1/x86_64-native-linuxapp-gcc/05f63dc8e8474372b063ae095af51c67/dpdk/mk/rte.subdir.mk:35: test-pmd] Error 2
make[4]: *** Waiting for unfinished jobs....
  CC test_thash.o
  CC test_hash_perf.o
  CC test_hash_functions.o
  CC test_hash_multiwriter.o
--
  CC test_ipsec.o
  MKRES test_resource_c.res.o
  LD test
  INSTALL-APP test
  INSTALL-MAP test.map
make[3]: *** [/tmp/RHEL80-64_K3.10.0_GCC8.2.1/x86_64-native-linuxapp-gcc/05f63dc8e8474372b063ae095af51c67/dpdk/mk/rte.sdkbuild.mk:48: app] Error 2
make[2]: *** [/tmp/RHEL80-64_K3.10.0_GCC8.2.1/x86_64-native-linuxapp-gcc/05f63dc8e8474372b063ae095af51c67/dpdk/mk/rte.sdkroot.mk:99: all] Error 2
make[1]: *** [/tmp/RHEL80-64_K3.10.0_GCC8.2.1/x86_64-native-linuxapp-gcc/05f63dc8e8474372b063ae095af51c67/dpdk/mk/rte.sdkinstall.mk:61: pre_install] Error 2
make: *** [/tmp/RHEL80-64_K3.10.0_GCC8.2.1/x86_64-native-linuxapp-gcc/05f63dc8e8474372b063ae095af51c67/dpdk/mk/rte.sdkroot.mk:77: install] Error 2


*Make Build Failed #9:
OS: RHEL76-64
Target: x86_64-native-linuxapp-gcc
                     ^
/tmp/RHEL76-64_K3.10.0_GCC4.8.5/x86_64-native-linuxapp-gcc/05f63dc8e8474372b063ae095af51c67/dpdk/app/test-pmd/csumonly.c:861:21: note: each undeclared identifier is reported only once for each function it appears in
/tmp/RHEL76-64_K3.10.0_GCC4.8.5/x86_64-native-linuxapp-gcc/05f63dc8e8474372b063ae095af51c67/dpdk/app/test-pmd/csumonly.c: At top level:
cc1: warning: unrecognized command line option "-Wno-address-of-packed-member" [enabled by default]
  CC bpf_cmd.o
make[5]: *** [csumonly.o] Error 1
make[5]: *** Waiting for unfinished jobs....
  CC test_pmd_perf.o
  CC test_pipeline_atq.o
  CC test_table.o
  CC test_table_pipeline.o
  CC test_table_tables.o
  CC test_table_ports.o
  CC test_table_combined.o
make[4]: *** [test-pmd] Error 2
make[4]: *** Waiting for unfinished jobs....
  CC test_table_acl.o
  CC test_flow_classify.o
  CC test_rwlock.o
  LD dpdk-test-eventdev
--
  CC test_ipsec.o
  MKRES test_resource_c.res.o
  LD test
  INSTALL-APP test
  INSTALL-MAP test.map
make[3]: *** [app] Error 2
make[2]: *** [all] Error 2
make[1]: *** [pre_install] Error 2
make: *** [install] Error 2


*Make Build Failed #10:
OS: FC30-64
Target: x86_64-native-linuxapp-clang
  CC noisy_vnf.o
/tmp/FC30-64_K4.20_Clang8.0.0/x86_64-native-linuxapp-clang/05f63dc8e8474372b063ae095af51c67/dpdk/app/test-pmd/csumonly.c:861:21: error: use of undeclared identifier 'PKT_TX_TUNNEL_GTP'
                                        tx_ol_flags |= PKT_TX_TUNNEL_GTP;
                                                       ^
1 error generated.
make[5]: *** [/tmp/FC30-64_K4.20_Clang8.0.0/x86_64-native-linuxapp-clang/05f63dc8e8474372b063ae095af51c67/dpdk/mk/internal/rte.compile-pre.mk:116: csumonly.o] Error 1
make[5]: *** Waiting for unfinished jobs....
  CC test_pipeline_atq.o
  CC test_reciprocal_division_perf.o
  CC test_fbarray.o
  CC test_external_mem.o
--
  CC test_table_tables.o
  CC test_table_ports.o
  CC test_table_combined.o
  LD dpdk-test-eventdev
  CC test_table_acl.o
make[4]: *** [/tmp/FC30-64_K4.20_Clang8.0.0/x86_64-native-linuxapp-clang/05f63dc8e8474372b063ae095af51c67/dpdk/mk/rte.subdir.mk:35: test-pmd] Error 2
make[4]: *** Waiting for unfinished jobs....
  CC test_flow_classify.o
  CC test_rwlock.o
  CC test_stack.o
  CC test_stack_perf.o
--
  CC test_ipsec.o
  MKRES test_resource_c.res.o
  LD test
  INSTALL-MAP test.map
  INSTALL-APP test
make[3]: *** [/tmp/FC30-64_K4.20_Clang8.0.0/x86_64-native-linuxapp-clang/05f63dc8e8474372b063ae095af51c67/dpdk/mk/rte.sdkbuild.mk:48: app] Error 2
make[2]: *** [/tmp/FC30-64_K4.20_Clang8.0.0/x86_64-native-linuxapp-clang/05f63dc8e8474372b063ae095af51c67/dpdk/mk/rte.sdkroot.mk:99: all] Error 2
make[1]: *** [/tmp/FC30-64_K4.20_Clang8.0.0/x86_64-native-linuxapp-clang/05f63dc8e8474372b063ae095af51c67/dpdk/mk/rte.sdkinstall.mk:61: pre_install] Error 2
make: *** [/tmp/FC30-64_K4.20_Clang8.0.0/x86_64-native-linuxapp-clang/05f63dc8e8474372b063ae095af51c67/dpdk/mk/rte.sdkroot.mk:77: install] Error 2


*Make Build Failed #11:
OS: SUSE15-64
Target: x86_64-native-linuxapp-clang
  CC test_perf_atq.o
/tmp/SUSE15-64_K4.12.14_Clang5.0.1/x86_64-native-linuxapp-clang/05f63dc8e8474372b063ae095af51c67/dpdk/app/test-pmd/csumonly.c:861:21: error: use of undeclared identifier 'PKT_TX_TUNNEL_GTP'
                                        tx_ol_flags |= PKT_TX_TUNNEL_GTP;
                                                       ^
1 error generated.
make[5]: *** [/tmp/SUSE15-64_K4.12.14_Clang5.0.1/x86_64-native-linuxapp-clang/05f63dc8e8474372b063ae095af51c67/dpdk/mk/internal/rte.compile-pre.mk:114: csumonly.o] Error 1
make[5]: *** Waiting for unfinished jobs....
  CC bpf_cmd.o
  CC test_pipeline_common.o
  CC test_bitmap.o
  CC test_pipeline_queue.o
  INSTALL-APP dpdk-test-crypto-perf
  CC test_pipeline_atq.o
  INSTALL-MAP dpdk-test-crypto-perf.map
  CC test_reciprocal_division.o
make[4]: *** [/tmp/SUSE15-64_K4.12.14_Clang5.0.1/x86_64-native-linuxapp-clang/05f63dc8e8474372b063ae095af51c67/dpdk/mk/rte.subdir.mk:35: test-pmd] Error 2
make[4]: *** Waiting for unfinished jobs....
  CC test_reciprocal_division_perf.o
  CC test_fbarray.o
  CC test_rand_perf.o
  CC test_external_mem.o
--
  CC test_ipsec.o
  MKRES test_resource_c.res.o
  LD test
  INSTALL-APP test
  INSTALL-MAP test.map
make[3]: *** [/tmp/SUSE15-64_K4.12.14_Clang5.0.1/x86_64-native-linuxapp-clang/05f63dc8e8474372b063ae095af51c67/dpdk/mk/rte.sdkbuild.mk:48: app] Error 2
make[2]: *** [/tmp/SUSE15-64_K4.12.14_Clang5.0.1/x86_64-native-linuxapp-clang/05f63dc8e8474372b063ae095af51c67/dpdk/mk/rte.sdkroot.mk:99: all] Error 2
make[1]: *** [/tmp/SUSE15-64_K4.12.14_Clang5.0.1/x86_64-native-linuxapp-clang/05f63dc8e8474372b063ae095af51c67/dpdk/mk/rte.sdkinstall.mk:61: pre_install] Error 2
make: *** [/tmp/SUSE15-64_K4.12.14_Clang5.0.1/x86_64-native-linuxapp-clang/05f63dc8e8474372b063ae095af51c67/dpdk/mk/rte.sdkroot.mk:77: install] Error 2


*Make Build Failed #12:
OS: UB1604-64
Target: x86_64-native-linuxapp-gcc
      tx_ol_flags |= PKT_TX_TUNNEL_GTP;
                     ^
/tmp/UB1604-64_K4.4.0_GCC5.4.0/x86_64-native-linuxapp-gcc/05f63dc8e8474372b063ae095af51c67/dpdk/app/test-pmd/csumonly.c:861:21: note: each undeclared identifier is reported only once for each function it appears in
/tmp/UB1604-64_K4.4.0_GCC5.4.0/x86_64-native-linuxapp-gcc/05f63dc8e8474372b063ae095af51c67/dpdk/app/test-pmd/csumonly.c: At top level:
cc1: warning: unrecognized command line option ‘-Wno-address-of-packed-member’
/tmp/UB1604-64_K4.4.0_GCC5.4.0/x86_64-native-linuxapp-gcc/05f63dc8e8474372b063ae095af51c67/dpdk/mk/internal/rte.compile-pre.mk:114: recipe for target 'csumonly.o' failed
make[5]: *** [csumonly.o] Error 1
make[5]: *** Waiting for unfinished jobs....
  CC bpf_cmd.o
  CC test_perf_atq.o
  CC test_pipeline_common.o
  CC test_pipeline_queue.o
--
  CC test_table.o
  CC test_table_pipeline.o
  CC test_table_tables.o
  CC test_table_ports.o
  CC test_table_combined.o
/tmp/UB1604-64_K4.4.0_GCC5.4.0/x86_64-native-linuxapp-gcc/05f63dc8e8474372b063ae095af51c67/dpdk/mk/rte.subdir.mk:35: recipe for target 'test-pmd' failed
make[4]: *** [test-pmd] Error 2
make[4]: *** Waiting for unfinished jobs....
  CC test_table_acl.o
  CC test_flow_classify.o
  CC test_rwlock.o
  CC test_stack.o
--
  CC test_ipsec.o
  MKRES test_resource_c.res.o
  LD test
  INSTALL-APP test
  INSTALL-MAP test.map
/tmp/UB1604-64_K4.4.0_GCC5.4.0/x86_64-native-linuxapp-gcc/05f63dc8e8474372b063ae095af51c67/dpdk/mk/rte.sdkbuild.mk:46: recipe for target 'app' failed
make[3]: *** [app] Error 2
/tmp/UB1604-64_K4.4.0_GCC5.4.0/x86_64-native-linuxapp-gcc/05f63dc8e8474372b063ae095af51c67/dpdk/mk/rte.sdkroot.mk:98: recipe for target 'all' failed
make[2]: *** [all] Error 2
/tmp/UB1604-64_K4.4.0_GCC5.4.0/x86_64-native-linuxapp-gcc/05f63dc8e8474372b063ae095af51c67/dpdk/mk/rte.sdkinstall.mk:60: recipe for target 'pre_install' failed
make[1]: *** [pre_install] Error 2
/tmp/UB1604-64_K4.4.0_GCC5.4.0/x86_64-native-linuxapp-gcc/05f63dc8e8474372b063ae095af51c67/dpdk/mk/rte.sdkroot.mk:77: recipe for target 'install' failed
make: *** [install] Error 2


*Make Build Failed #13:
OS: UB1804-64
Target: x86_64-native-linuxapp-gcc
                     ^~~~~~~~~~~~~~~~~
                     PKT_TX_TUNNEL_IP
/tmp/UB1804-64_K4.15.0_GCC7.3.0/x86_64-native-linuxapp-gcc/05f63dc8e8474372b063ae095af51c67/dpdk/app/test-pmd/csumonly.c:861:21: note: each undeclared identifier is reported only once for each function it appears in
/tmp/UB1804-64_K4.15.0_GCC7.3.0/x86_64-native-linuxapp-gcc/05f63dc8e8474372b063ae095af51c67/dpdk/app/test-pmd/csumonly.c: At top level:
cc1: warning: unrecognized command line option ‘-Wno-address-of-packed-member’
/tmp/UB1804-64_K4.15.0_GCC7.3.0/x86_64-native-linuxapp-gcc/05f63dc8e8474372b063ae095af51c67/dpdk/mk/internal/rte.compile-pre.mk:114: recipe for target 'csumonly.o' failed
make[5]: *** [csumonly.o] Error 1
make[5]: *** Waiting for unfinished jobs....
  CC test_flow_classify.o
  CC test_rwlock.o
  CC test_stack.o
  CC test_stack_perf.o
--
  CC test_memcpy.o
  CC test_memcpy_perf.o
  CC test_member.o
  CC test_member_perf.o
  CC test_efd.o
/tmp/UB1804-64_K4.15.0_GCC7.3.0/x86_64-native-linuxapp-gcc/05f63dc8e8474372b063ae095af51c67/dpdk/mk/rte.subdir.mk:35: recipe for target 'test-pmd' failed
make[4]: *** [test-pmd] Error 2
make[4]: *** Waiting for unfinished jobs....
  CC test_efd_perf.o
  CC test_hash.o
  CC test_thash.o
  CC test_hash_perf.o
--
  CC test_ipsec.o
  MKRES test_resource_c.res.o
  LD test
  INSTALL-APP test
  INSTALL-MAP test.map
/tmp/UB1804-64_K4.15.0_GCC7.3.0/x86_64-native-linuxapp-gcc/05f63dc8e8474372b063ae095af51c67/dpdk/mk/rte.sdkbuild.mk:46: recipe for target 'app' failed
make[3]: *** [app] Error 2
/tmp/UB1804-64_K4.15.0_GCC7.3.0/x86_64-native-linuxapp-gcc/05f63dc8e8474372b063ae095af51c67/dpdk/mk/rte.sdkroot.mk:98: recipe for target 'all' failed
make[2]: *** [all] Error 2
/tmp/UB1804-64_K4.15.0_GCC7.3.0/x86_64-native-linuxapp-gcc/05f63dc8e8474372b063ae095af51c67/dpdk/mk/rte.sdkinstall.mk:60: recipe for target 'pre_install' failed
make[1]: *** [pre_install] Error 2
/tmp/UB1804-64_K4.15.0_GCC7.3.0/x86_64-native-linuxapp-gcc/05f63dc8e8474372b063ae095af51c67/dpdk/mk/rte.sdkroot.mk:77: recipe for target 'install' failed
make: *** [install] Error 2


*Make Build Failed #14:
OS: CENTOS76-64
Target: x86_64-native-linuxapp-clang
  CC test_flow_classify.o
/tmp/CENTOS76-64_K3.10.0_Clang3.4.2/x86_64-native-linuxapp-clang/05f63dc8e8474372b063ae095af51c67/dpdk/app/test-pmd/csumonly.c:861:21: error: use of undeclared identifier 'PKT_TX_TUNNEL_GTP'
                                        tx_ol_flags |= PKT_TX_TUNNEL_GTP;
                                                       ^
1 error generated.
make[5]: *** [csumonly.o] Error 1
make[5]: *** Waiting for unfinished jobs....
  CC test_rwlock.o
  CC test_stack.o
  CC test_pipeline_atq.o
  CC test_stack_perf.o
--
  LD dpdk-test-eventdev
  CC test_member.o
  CC test_member_perf.o
  CC test_efd.o
  CC test_efd_perf.o
make[4]: *** [test-pmd] Error 2
make[4]: *** Waiting for unfinished jobs....
  CC test_hash.o
  CC test_thash.o
  CC test_hash_perf.o
  CC test_hash_functions.o
--
  CC test_ipsec.o
  MKRES test_resource_c.res.o
  LD test
  INSTALL-APP test
  INSTALL-MAP test.map
make[3]: *** [app] Error 2
make[2]: *** [all] Error 2
make[1]: *** [pre_install] Error 2
make: *** [install] Error 2


*Make Build Failed #15:
OS: FreeBSD12-64
Target: x86_64-native-bsdapp-gcc+debug
  INSTALL-APP dpdk-test-crypto-perf
/tmp/FreeBSD12-64_K19.02_GCC7.3.0/x86_64-native-bsdapp-gcc+debug/05f63dc8e8474372b063ae095af51c67/dpdk/app/test-pmd/csumonly.c:861:21: note: each undeclared identifier is reported only once for each function it appears in
  CC bpf_cmd.o
/tmp/FreeBSD12-64_K19.02_GCC7.3.0/x86_64-native-bsdapp-gcc+debug/05f63dc8e8474372b063ae095af51c67/dpdk/app/test-pmd/csumonly.c: At top level:
cc1: warning: unrecognized command line option '-Wno-address-of-packed-member'
gmake[5]: *** [/tmp/FreeBSD12-64_K19.02_GCC7.3.0/x86_64-native-bsdapp-gcc+debug/05f63dc8e8474372b063ae095af51c67/dpdk/mk/internal/rte.compile-pre.mk:116: csumonly.o] Error 1
gmake[5]: *** Waiting for unfinished jobs....
  CC test_fbarray.o
  CC test_rand_perf.o
  CC test_external_mem.o
  CC test_ring.o
--
  CC test_table_tables.o
  INSTALL-APP dpdk-test-eventdev
  CC test_table_ports.o
  INSTALL-MAP dpdk-test-eventdev.map
  CC test_table_combined.o
gmake[4]: *** [/tmp/FreeBSD12-64_K19.02_GCC7.3.0/x86_64-native-bsdapp-gcc+debug/05f63dc8e8474372b063ae095af51c67/dpdk/mk/rte.subdir.mk:35: test-pmd] Error 2
gmake[4]: *** Waiting for unfinished jobs....
  CC test_flow_classify.o
  CC test_rwlock.o
  CC test_table_acl.o
  CC test_stack.o
--
  MKRES test_resource_c.res.o
  CC test_ipsec.o
  LD test
  INSTALL-APP test
  INSTALL-MAP test.map
gmake[3]: *** [/tmp/FreeBSD12-64_K19.02_GCC7.3.0/x86_64-native-bsdapp-gcc+debug/05f63dc8e8474372b063ae095af51c67/dpdk/mk/rte.sdkbuild.mk:48: app] Error 2
gmake[2]: *** [/tmp/FreeBSD12-64_K19.02_GCC7.3.0/x86_64-native-bsdapp-gcc+debug/05f63dc8e8474372b063ae095af51c67/dpdk/mk/rte.sdkroot.mk:99: all] Error 2
gmake[1]: *** [/tmp/FreeBSD12-64_K19.02_GCC7.3.0/x86_64-native-bsdapp-gcc+debug/05f63dc8e8474372b063ae095af51c67/dpdk/mk/rte.sdkinstall.mk:61: pre_install] Error 2
gmake: *** [/tmp/FreeBSD12-64_K19.02_GCC7.3.0/x86_64-native-bsdapp-gcc+debug/05f63dc8e8474372b063ae095af51c67/dpdk/mk/rte.sdkroot.mk:77: install] Error 2


*Make Build Failed #16:
OS: FreeBSD12-64
Target: x86_64-native-bsdapp-gcc+shared
                     PKT_TX_TUNNEL_IP
/tmp/FreeBSD12-64_K19.02_GCC7.3.0/x86_64-native-bsdapp-gcc+shared/05f63dc8e8474372b063ae095af51c67/dpdk/app/test-pmd/csumonly.c:861:21: note: each undeclared identifier is reported only once for each function it appears in
  CC test_table_pipeline.o
/tmp/FreeBSD12-64_K19.02_GCC7.3.0/x86_64-native-bsdapp-gcc+shared/05f63dc8e8474372b063ae095af51c67/dpdk/app/test-pmd/csumonly.c: At top level:
cc1: warning: unrecognized command line option '-Wno-address-of-packed-member'
gmake[5]: *** [/tmp/FreeBSD12-64_K19.02_GCC7.3.0/x86_64-native-bsdapp-gcc+shared/05f63dc8e8474372b063ae095af51c67/dpdk/mk/internal/rte.compile-pre.mk:114: csumonly.o] Error 1
gmake[5]: *** Waiting for unfinished jobs....
  CC test_table_tables.o
  CC test_table_ports.o
  CC test_table_combined.o
  CC test_table_acl.o
  CC test_flow_classify.o
  CC test_rwlock.o
  CC test_stack.o
gmake[4]: *** [/tmp/FreeBSD12-64_K19.02_GCC7.3.0/x86_64-native-bsdapp-gcc+shared/05f63dc8e8474372b063ae095af51c67/dpdk/mk/rte.subdir.mk:35: test-pmd] Error 2
gmake[4]: *** Waiting for unfinished jobs....
  CC test_stack_perf.o
  CC test_timer.o
  CC test_timer_perf.o
  CC test_timer_racecond.o
--
  MKRES test_resource_c.res.o
  CC test_ipsec.o
  LD test
  INSTALL-APP test
  INSTALL-MAP test.map
gmake[3]: *** [/tmp/FreeBSD12-64_K19.02_GCC7.3.0/x86_64-native-bsdapp-gcc+shared/05f63dc8e8474372b063ae095af51c67/dpdk/mk/rte.sdkbuild.mk:48: app] Error 2
gmake[2]: *** [/tmp/FreeBSD12-64_K19.02_GCC7.3.0/x86_64-native-bsdapp-gcc+shared/05f63dc8e8474372b063ae095af51c67/dpdk/mk/rte.sdkroot.mk:99: all] Error 2
gmake[1]: *** [/tmp/FreeBSD12-64_K19.02_GCC7.3.0/x86_64-native-bsdapp-gcc+shared/05f63dc8e8474372b063ae095af51c67/dpdk/mk/rte.sdkinstall.mk:61: pre_install] Error 2
gmake: *** [/tmp/FreeBSD12-64_K19.02_GCC7.3.0/x86_64-native-bsdapp-gcc+shared/05f63dc8e8474372b063ae095af51c67/dpdk/mk/rte.sdkroot.mk:77: install] Error 2


*Make Build Failed #17:
OS: CENTOS76-64
Target: x86_64-native-linuxapp-gcc
      tx_ol_flags |= PKT_TX_TUNNEL_GTP;
                     ^
/tmp/CENTOS76-64_K3.10.0_GCC4.8.5/x86_64-native-linuxapp-gcc/05f63dc8e8474372b063ae095af51c67/dpdk/app/test-pmd/csumonly.c:861:21: note: each undeclared identifier is reported only once for each function it appears in
/tmp/CENTOS76-64_K3.10.0_GCC4.8.5/x86_64-native-linuxapp-gcc/05f63dc8e8474372b063ae095af51c67/dpdk/app/test-pmd/csumonly.c: At top level:
cc1: warning: unrecognized command line option "-Wno-address-of-packed-member" [enabled by default]
make[5]: *** [csumonly.o] Error 1
make[5]: *** Waiting for unfinished jobs....
  CC test_reciprocal_division_perf.o
  CC test_pipeline_queue.o
  CC test_pipeline_atq.o
  CC test_fbarray.o
--
  INSTALL-MAP dpdk-test-crypto-perf.map
  CC test_pmd_perf.o
  CC test_table.o
  CC test_table_pipeline.o
  CC test_table_tables.o
make[4]: *** [test-pmd] Error 2
make[4]: *** Waiting for unfinished jobs....
  CC test_table_ports.o
  LD dpdk-test-eventdev
  CC test_table_combined.o
  CC test_table_acl.o
--
  CC test_ipsec.o
  MKRES test_resource_c.res.o
  LD test
  INSTALL-APP test
  INSTALL-MAP test.map
make[3]: *** [app] Error 2
make[2]: *** [all] Error 2
make[1]: *** [pre_install] Error 2
make: *** [install] Error 2


*Make Build Failed #18:
OS: CENTOS76-64
Target: x86_64-native-linuxapp-gcc+debug
      tx_ol_flags |= PKT_TX_TUNNEL_GTP;
                     ^
/tmp/CENTOS76-64_K3.10.0_GCC4.8.5/x86_64-native-linuxapp-gcc+debug/05f63dc8e8474372b063ae095af51c67/dpdk/app/test-pmd/csumonly.c:861:21: note: each undeclared identifier is reported only once for each function it appears in
/tmp/CENTOS76-64_K3.10.0_GCC4.8.5/x86_64-native-linuxapp-gcc+debug/05f63dc8e8474372b063ae095af51c67/dpdk/app/test-pmd/csumonly.c: At top level:
cc1: warning: unrecognized command line option "-Wno-address-of-packed-member" [enabled by default]
make[5]: *** [csumonly.o] Error 1
make[5]: *** Waiting for unfinished jobs....
  CC test_pipeline_atq.o
  CC test_table_pipeline.o
  INSTALL-APP testbbdev
  INSTALL-MAP testbbdev.map
--
  CC test_table_combined.o
  CC test_table_acl.o
  CC test_flow_classify.o
  LD dpdk-test-eventdev
  CC test_rwlock.o
make[4]: *** [test-pmd] Error 2
make[4]: *** Waiting for unfinished jobs....
  CC test_stack.o
  CC test_stack_perf.o
  CC test_timer.o
  CC test_timer_perf.o
--
  CC test_ipsec.o
  MKRES test_resource_c.res.o
  LD test
  INSTALL-APP test
  INSTALL-MAP test.map
make[3]: *** [app] Error 2
make[2]: *** [all] Error 2
make[1]: *** [pre_install] Error 2
make: *** [install] Error 2


*Make Build Failed #19:
OS: FreeBSD12-64
Target: x86_64-native-bsdapp-clang
  CC bpf_cmd.o
                                        tx_ol_flags |= PKT_TX_TUNNEL_GTP;  INSTALL-APP dpdk-test-crypto-perf

                                                       ^
1 error generated.
gmake[5]: *** [/tmp/FreeBSD12-64_K19.02_Clang6.0.1/x86_64-native-bsdapp-clang/05f63dc8e8474372b063ae095af51c67/dpdk/mk/internal/rte.compile-pre.mk:116: csumonly.o] Error 1
gmake[5]: *** Waiting for unfinished jobs....
  INSTALL-MAP dpdk-test-crypto-perf.map
  CC test_ring_perf.o
  CC test_pmd_perf.o
  CC test_ring.o
--
  CC test_table.o
  CC test_table_tables.o
  CC test_table_ports.o
  CC test_table_combined.o
  CC test_table_acl.o
gmake[4]: *** [/tmp/FreeBSD12-64_K19.02_Clang6.0.1/x86_64-native-bsdapp-clang/05f63dc8e8474372b063ae095af51c67/dpdk/mk/rte.subdir.mk:35: test-pmd] Error 2
gmake[4]: *** Waiting for unfinished jobs....
  CC test_flow_classify.o
  CC test_rwlock.o
  CC test_stack.o
  CC test_stack_perf.o
--
  CC test_ipsec.o
  MKRES test_resource_c.res.o
  LD test
  INSTALL-APP test
  INSTALL-MAP test.map
gmake[3]: *** [/tmp/FreeBSD12-64_K19.02_Clang6.0.1/x86_64-native-bsdapp-clang/05f63dc8e8474372b063ae095af51c67/dpdk/mk/rte.sdkbuild.mk:48: app] Error 2
gmake[2]: *** [/tmp/FreeBSD12-64_K19.02_Clang6.0.1/x86_64-native-bsdapp-clang/05f63dc8e8474372b063ae095af51c67/dpdk/mk/rte.sdkroot.mk:99: all] Error 2
gmake[1]: *** [/tmp/FreeBSD12-64_K19.02_Clang6.0.1/x86_64-native-bsdapp-clang/05f63dc8e8474372b063ae095af51c67/dpdk/mk/rte.sdkinstall.mk:61: pre_install] Error 2
gmake: *** [/tmp/FreeBSD12-64_K19.02_Clang6.0.1/x86_64-native-bsdapp-clang/05f63dc8e8474372b063ae095af51c67/dpdk/mk/rte.sdkroot.mk:77: install] Error 2


*Make Build Failed #20:
OS: CENTOS76-64
Target: x86_64-native-linuxapp-gcc+shared
                     ^
/tmp/CENTOS76-64_K3.10.0_GCC4.8.5/x86_64-native-linuxapp-gcc+shared/05f63dc8e8474372b063ae095af51c67/dpdk/app/test-pmd/csumonly.c:861:21: note: each undeclared identifier is reported only once for each function it appears in
/tmp/CENTOS76-64_K3.10.0_GCC4.8.5/x86_64-native-linuxapp-gcc+shared/05f63dc8e8474372b063ae095af51c67/dpdk/app/test-pmd/csumonly.c: At top level:
cc1: warning: unrecognized command line option "-Wno-address-of-packed-member" [enabled by default]
  CC bpf_cmd.o
make[5]: *** [csumonly.o] Error 1
make[5]: *** Waiting for unfinished jobs....
  CC test_perf_atq.o
  INSTALL-APP testbbdev
  INSTALL-MAP testbbdev.map
  CC test_pipeline_common.o
  CC test_ring_perf.o
  CC test_pipeline_queue.o
  CC test_pipeline_atq.o
  CC test_pmd_perf.o
  CC test_table.o
make[4]: *** [test-pmd] Error 2
make[4]: *** Waiting for unfinished jobs....
  CC test_table_pipeline.o
  CC test_table_tables.o
  CC test_table_ports.o
  CC test_table_combined.o
--
  CC test_ipsec.o
  MKRES test_resource_c.res.o
  LD test
  INSTALL-APP test
  INSTALL-MAP test.map
make[3]: *** [app] Error 2
make[2]: *** [all] Error 2
make[1]: *** [pre_install] Error 2
make: *** [install] Error 2


*Make Build Failed #21:
OS: FreeBSD12-64
Target: x86_64-native-bsdapp-gcc
/tmp/FreeBSD12-64_K19.02_GCC7.3.0/x86_64-native-bsdapp-gcc/05f63dc8e8474372b063ae095af51c67/dpdk/app/test-pmd/csumonly.c:861:21: error: 'PKT_TX_TUNNEL_GTP' undeclared (first use in this function); did you mean 'PKT_TX_TUNNEL_IP'?
  861 |      tx_ol_flags |= PKT_TX_TUNNEL_GTP;
      |                     ^~~~~~~~~~~~~~~~~
      |                     PKT_TX_TUNNEL_IP
/tmp/FreeBSD12-64_K19.02_GCC7.3.0/x86_64-native-bsdapp-gcc/05f63dc8e8474372b063ae095af51c67/dpdk/app/test-pmd/csumonly.c:861:21: note: each undeclared identifier is reported only once for each function it appears in
gmake[5]: *** [/tmp/FreeBSD12-64_K19.02_GCC7.3.0/x86_64-native-bsdapp-gcc/05f63dc8e8474372b063ae095af51c67/dpdk/mk/internal/rte.compile-pre.mk:114: csumonly.o] Error 1
gmake[5]: *** Waiting for unfinished jobs....
  CC test_pmd_perf.o
  CC test_table.o
  CC test_table_pipeline.o
  INSTALL-APP dpdk-test-eventdev
  INSTALL-MAP dpdk-test-eventdev.map
  CC test_table_tables.o
  CC test_table_ports.o
  CC test_table_combined.o
  CC test_table_acl.o
gmake[4]: *** [/tmp/FreeBSD12-64_K19.02_GCC7.3.0/x86_64-native-bsdapp-gcc/05f63dc8e8474372b063ae095af51c67/dpdk/mk/rte.subdir.mk:35: test-pmd] Error 2
gmake[4]: *** Waiting for unfinished jobs....
  CC test_flow_classify.o
  CC test_rwlock.o
  CC test_stack.o
  CC test_stack_perf.o
--
  CC test_ipsec.o
  MKRES test_resource_c.res.o
  LD test
  INSTALL-APP test
  INSTALL-MAP test.map
gmake[3]: *** [/tmp/FreeBSD12-64_K19.02_GCC7.3.0/x86_64-native-bsdapp-gcc/05f63dc8e8474372b063ae095af51c67/dpdk/mk/rte.sdkbuild.mk:48: app] Error 2
gmake[2]: *** [/tmp/FreeBSD12-64_K19.02_GCC7.3.0/x86_64-native-bsdapp-gcc/05f63dc8e8474372b063ae095af51c67/dpdk/mk/rte.sdkroot.mk:99: all] Error 2
gmake[1]: *** [/tmp/FreeBSD12-64_K19.02_GCC7.3.0/x86_64-native-bsdapp-gcc/05f63dc8e8474372b063ae095af51c67/dpdk/mk/rte.sdkinstall.mk:61: pre_install] Error 2
gmake: *** [/tmp/FreeBSD12-64_K19.02_GCC7.3.0/x86_64-native-bsdapp-gcc/05f63dc8e8474372b063ae095af51c67/dpdk/mk/rte.sdkroot.mk:77: install] Error 2


*Make Build Failed #22:
OS: CENTOS76-64
Target: x86_64-native-linuxapp-icc
/tmp/CENTOS76-64_K3.10.0_ICC19.0.0/x86_64-native-linuxapp-icc/05f63dc8e8474372b063ae095af51c67/dpdk/app/test-pmd/csumonly.c(861): error: identifier "PKT_TX_TUNNEL_GTP" is undefined
  					tx_ol_flags |= PKT_TX_TUNNEL_GTP;
  					               ^

compilation aborted for /tmp/CENTOS76-64_K3.10.0_ICC19.0.0/x86_64-native-linuxapp-icc/05f63dc8e8474372b063ae095af51c67/dpdk/app/test-pmd/csumonly.c (code 2)
make[5]: *** [csumonly.o] Error 2
make[5]: *** Waiting for unfinished jobs....
  CC test_table_acl.o
  CC test_flow_classify.o
  INSTALL-APP dpdk-test-eventdev
  INSTALL-MAP dpdk-test-eventdev.map
  CC test_rwlock.o
  CC test_stack.o
  CC test_stack_perf.o
make[4]: *** [test-pmd] Error 2
make[4]: *** Waiting for unfinished jobs....
  CC test_timer.o
  CC test_timer_perf.o
  CC test_timer_racecond.o
  CC test_timer_secondary.o
--
  CC test_ipsec.o
  MKRES test_resource_c.res.o
  LD test
  INSTALL-APP test
  INSTALL-MAP test.map
make[3]: *** [app] Error 2
make[2]: *** [all] Error 2
make[1]: *** [pre_install] Error 2
make: *** [install] Error 2

*Meson Build Failed #1:
OS: SUSE15-64
Target:build-gcc-static
FAILED: app/a172ced@@dpdk-testpmd@exe/test-pmd_csumonly.c.o 
gcc -Iapp/a172ced@@dpdk-testpmd@exe -Iapp -I../app -Ilib/librte_ethdev -I../lib/librte_ethdev -I. -I../ -Iconfig -I../config -Ilib/librte_eal/common/include -I../lib/librte_eal/common/include -I../lib/librte_eal/linux/eal/include -Ilib/librte_eal/common -I../lib/librte_eal/common -Ilib/librte_eal/common/include/arch/x86 -I../lib/librte_eal/common/include/arch/x86 -Ilib/librte_eal -I../lib/librte_eal -Ilib/librte_kvargs -I../lib/librte_kvargs -Ilib/librte_net -I../lib/librte_net -Ilib/librte_mbuf -I../lib/librte_mbuf -Ilib/librte_mempool -I../lib/librte_mempool -Ilib/librte_ring -I../lib/librte_ring -Ilib/librte_meter -I../lib/librte_meter -Ilib/librte_gro -I../lib/librte_gro -Ilib/librte_gso -I../lib/librte_gso -Ilib/librte_cmdline -I../lib/librte_cmdline -Ilib/librte_metrics -I../lib/librte_metrics -Idrivers/bus/pci -I../drivers/bus/pci -I../drivers/bus/pci/linux -Ilib/librte_pci -I../lib/librte_pci -Ilib/librte_pdump -I../lib/librte_pdump -Idrivers/net/bnxt -I../drivers/net/bnxt -Idrivers/bus/vdev -I../drivers/bus/vdev -Idrivers/net/i40e -I../drivers/net/i40e -Idrivers/net/i40e/base -I../drivers/net/i40e/base -Ilib/librte_hash -I../lib/librte_hash -Idrivers/net/ixgbe -I../drivers/net/ixgbe -Idrivers/net/ixgbe/base -I../drivers/net/ixgbe/base -Ilib/librte_security -I../lib/librte_security -Ilib/librte_cryptodev -I../lib/librte_cryptodev -Idrivers/net/softnic -I../drivers/net/softnic -Ilib/librte_pipeline -I../lib/librte_pipeline -Ilib/librte_port -I../lib/librte_port -Ilib/librte_sched -I../lib/librte_sched -Ilib/librte_ip_frag -I../lib/librte_ip_frag -Ilib/librte_kni -I../lib/librte_kni -Ilib/librte_table -I../lib/librte_table -Ilib/librte_lpm -I../lib/librte_lpm -Ilib/librte_acl -I../lib/librte_acl -Idrivers/bus/dpaa -I../drivers/bus/dpaa -I../drivers/bus/dpaa/include -I../drivers/bus/dpaa/base/qbman -Idrivers/common/dpaax -I../drivers/common/dpaax -Ilib/librte_eventdev -I../lib/librte_eventdev -Ilib/librte_timer -I../lib/librte_timer -Idrivers/mempool/dpaa -I../drivers/mempool/dpaa -Idrivers/net/dpaa -I../drivers/net/dpaa -Ilib/librte_bpf -I../lib/librte_bpf -fdiagnostics-color=always -pipe -D_FILE_OFFSET_BITS=64 -Wall -Winvalid-pch -Werror -O3 -include rte_config.h -Wunused-parameter -Wsign-compare -Wcast-qual -D_GNU_SOURCE -march=native -Wno-deprecated-declarations -DALLOW_EXPERIMENTAL_API -MD -MQ 'app/a172ced@@dpdk-testpmd@exe/test-pmd_csumonly.c.o' -MF 'app/a172ced@@dpdk-testpmd@exe/test-pmd_csumonly.c.o.d' -o 'app/a172ced@@dpdk-testpmd@exe/test-pmd_csumonly.c.o' -c ../app/test-pmd/csumonly.c
../app/test-pmd/csumonly.c: In function ‘pkt_burst_checksum_forward’:
../app/test-pmd/csumonly.c:861:21: error: ‘PKT_TX_TUNNEL_GTP’ undeclared (first use in this function); did you mean ‘PKT_TX_TUNNEL_IP’?
      tx_ol_flags |= PKT_TX_TUNNEL_GTP;
                     ^~~~~~~~~~~~~~~~~
                     PKT_TX_TUNNEL_IP
../app/test-pmd/csumonly.c:861:21: note: each undeclared identifier is reported only once for each function it appears in
[1588/1892] Compiling C object 'app/a172ced@@dpdk-testpmd@exe/test-pmd_config.c.o'.
[1589/1892] Compiling C object 'app/a172ced@@dpdk-testpmd@exe/test-pmd_cmdline_flow.c.o'.
[1590/1892] Compiling C object 'app/a172ced@@dpdk-testpmd@exe/test-pmd_macfwd.c.o'.
[1591/1892] Compiling C object 'app/a172ced@@dpdk-testpmd@exe/test-pmd_macswap.c.o'.
[1592/1892] Compiling C object 'drivers/a715181@@tmp_rte_pmd_octeontx2_event@sta/event_octeontx2_otx2_worker.c.o'.
[1593/1892] Compiling C object 'app/a172ced@@dpdk-testpmd@exe/test-pmd_cmdline.c.o'.
[1594/1892] Compiling C object 'drivers/a715181@@tmp_rte_pmd_octeontx2_event@sta/event_octeontx2_otx2_worker_dual.c.o'.
ninja: build stopped: subcommand failed




*Meson Build Failed #2:
OS: UB1604-32
Target:build-gcc-static
FAILED: app/a172ced@@dpdk-testpmd@exe/test-pmd_csumonly.c.o 
gcc -Iapp/a172ced@@dpdk-testpmd@exe -Iapp -I../app -Ilib/librte_ethdev -I../lib/librte_ethdev -I. -I../ -Iconfig -I../config -Ilib/librte_eal/common/include -I../lib/librte_eal/common/include -I../lib/librte_eal/linux/eal/include -Ilib/librte_eal/common -I../lib/librte_eal/common -Ilib/librte_eal/common/include/arch/x86 -I../lib/librte_eal/common/include/arch/x86 -Ilib/librte_eal -I../lib/librte_eal -Ilib/librte_kvargs -I../lib/librte_kvargs -Ilib/librte_net -I../lib/librte_net -Ilib/librte_mbuf -I../lib/librte_mbuf -Ilib/librte_mempool -I../lib/librte_mempool -Ilib/librte_ring -I../lib/librte_ring -Ilib/librte_meter -I../lib/librte_meter -Ilib/librte_gro -I../lib/librte_gro -Ilib/librte_gso -I../lib/librte_gso -Ilib/librte_cmdline -I../lib/librte_cmdline -Ilib/librte_metrics -I../lib/librte_metrics -Idrivers/bus/pci -I../drivers/bus/pci -I../drivers/bus/pci/linux -Ilib/librte_pci -I../lib/librte_pci -Ilib/librte_pdump -I../lib/librte_pdump -Idrivers/net/bnxt -I../drivers/net/bnxt -Idrivers/bus/vdev -I../drivers/bus/vdev -Idrivers/net/i40e -I../drivers/net/i40e -Idrivers/net/i40e/base -I../drivers/net/i40e/base -Ilib/librte_hash -I../lib/librte_hash -Idrivers/net/ixgbe -I../drivers/net/ixgbe -Idrivers/net/ixgbe/base -I../drivers/net/ixgbe/base -Ilib/librte_security -I../lib/librte_security -Ilib/librte_cryptodev -I../lib/librte_cryptodev -Idrivers/net/softnic -I../drivers/net/softnic -Ilib/librte_pipeline -I../lib/librte_pipeline -Ilib/librte_port -I../lib/librte_port -Ilib/librte_sched -I../lib/librte_sched -Ilib/librte_ip_frag -I../lib/librte_ip_frag -Ilib/librte_table -I../lib/librte_table -Ilib/librte_lpm -I../lib/librte_lpm -Ilib/librte_acl -I../lib/librte_acl -Idrivers/bus/dpaa -I../drivers/bus/dpaa -I../drivers/bus/dpaa/include -I../drivers/bus/dpaa/base/qbman -Idrivers/common/dpaax -I../drivers/common/dpaax -Ilib/librte_eventdev -I../lib/librte_eventdev -Ilib/librte_timer -I../lib/librte_timer -Idrivers/mempool/dpaa -I../drivers/mempool/dpaa -Idrivers/net/dpaa -I../drivers/net/dpaa -Ilib/librte_bpf -I../lib/librte_bpf -fdiagnostics-color=always -pipe -D_FILE_OFFSET_BITS=64 -Wall -Winvalid-pch -Werror -O3 -include rte_config.h -Wunused-parameter -Wsign-compare -Wcast-qual -Wno-pointer-to-int-cast -D_GNU_SOURCE -march=native -Wno-deprecated-declarations -DALLOW_EXPERIMENTAL_API -MD -MQ 'app/a172ced@@dpdk-testpmd@exe/test-pmd_csumonly.c.o' -MF 'app/a172ced@@dpdk-testpmd@exe/test-pmd_csumonly.c.o.d' -o 'app/a172ced@@dpdk-testpmd@exe/test-pmd_csumonly.c.o' -c ../app/test-pmd/csumonly.c
../app/test-pmd/csumonly.c: In function ‘pkt_burst_checksum_forward’:
../app/test-pmd/csumonly.c:861:21: error: ‘PKT_TX_TUNNEL_GTP’ undeclared (first use in this function)
      tx_ol_flags |= PKT_TX_TUNNEL_GTP;
                     ^
../app/test-pmd/csumonly.c:861:21: note: each undeclared identifier is reported only once for each function it appears in
[1367/1698] Compiling C object 'app/a172ced@@dpdk-test-compress-perf@exe/test-compress-perf_comp_perf_test_verify.c.o'.
[1368/1698] Compiling C object 'app/a172ced@@dpdk-test-bbdev@exe/test-bbdev_test_bbdev_perf.c.o'.
[1369/1698] Compiling C object 'app/a172ced@@dpdk-test-crypto-perf@exe/test-crypto-perf_cperf_ops.c.o'.
[1370/1698] Compiling C object 'app/a172ced@@dpdk-test-crypto-perf@exe/test-crypto-perf_cperf_options_parsing.c.o'.
[1371/1698] Compiling C object 'drivers/a715181@@tmp_rte_pmd_octeontx2_event@sta/event_octeontx2_otx2_worker_dual.c.o'.
ninja: build stopped: subcommand failed




*Meson Build Failed #3:
OS: FC30-64
Target:build-gcc-static
FAILED: app/a172ced@@dpdk-testpmd@exe/test-pmd_csumonly.c.o 
gcc -Iapp/a172ced@@dpdk-testpmd@exe -Iapp -I../app -Ilib/librte_ethdev -I../lib/librte_ethdev -I. -I../ -Iconfig -I../config -Ilib/librte_eal/common/include -I../lib/librte_eal/common/include -I../lib/librte_eal/linux/eal/include -Ilib/librte_eal/common -I../lib/librte_eal/common -Ilib/librte_eal/common/include/arch/x86 -I../lib/librte_eal/common/include/arch/x86 -Ilib/librte_eal -I../lib/librte_eal -Ilib/librte_kvargs -I../lib/librte_kvargs -Ilib/librte_net -I../lib/librte_net -Ilib/librte_mbuf -I../lib/librte_mbuf -Ilib/librte_mempool -I../lib/librte_mempool -Ilib/librte_ring -I../lib/librte_ring -Ilib/librte_meter -I../lib/librte_meter -Ilib/librte_gro -I../lib/librte_gro -Ilib/librte_gso -I../lib/librte_gso -Ilib/librte_cmdline -I../lib/librte_cmdline -Ilib/librte_metrics -I../lib/librte_metrics -Idrivers/bus/pci -I../drivers/bus/pci -I../drivers/bus/pci/linux -Ilib/librte_pci -I../lib/librte_pci -Ilib/librte_pdump -I../lib/librte_pdump -Idrivers/net/bnxt -I../drivers/net/bnxt -Idrivers/bus/vdev -I../drivers/bus/vdev -Idrivers/net/i40e -I../drivers/net/i40e -Idrivers/net/i40e/base -I../drivers/net/i40e/base -Ilib/librte_hash -I../lib/librte_hash -Idrivers/net/ixgbe -I../drivers/net/ixgbe -Idrivers/net/ixgbe/base -I../drivers/net/ixgbe/base -Ilib/librte_security -I../lib/librte_security -Ilib/librte_cryptodev -I../lib/librte_cryptodev -Idrivers/net/softnic -I../drivers/net/softnic -Ilib/librte_pipeline -I../lib/librte_pipeline -Ilib/librte_port -I../lib/librte_port -Ilib/librte_sched -I../lib/librte_sched -Ilib/librte_ip_frag -I../lib/librte_ip_frag -Ilib/librte_kni -I../lib/librte_kni -Ilib/librte_table -I../lib/librte_table -Ilib/librte_lpm -I../lib/librte_lpm -Ilib/librte_acl -I../lib/librte_acl -Idrivers/bus/dpaa -I../drivers/bus/dpaa -I../drivers/bus/dpaa/include -I../drivers/bus/dpaa/base/qbman -Idrivers/common/dpaax -I../drivers/common/dpaax -Ilib/librte_eventdev -I../lib/librte_eventdev -Ilib/librte_timer -I../lib/librte_timer -Idrivers/mempool/dpaa -I../drivers/mempool/dpaa -Idrivers/net/dpaa -I../drivers/net/dpaa -Ilib/librte_bpf -I../lib/librte_bpf -fdiagnostics-color=always -pipe -D_FILE_OFFSET_BITS=64 -Wall -Winvalid-pch -Werror -O3 -include rte_config.h -Wunused-parameter -Wsign-compare -Wcast-qual -Wno-address-of-packed-member -D_GNU_SOURCE -march=native -mno-avx512f -Wno-deprecated-declarations -DALLOW_EXPERIMENTAL_API -MD -MQ 'app/a172ced@@dpdk-testpmd@exe/test-pmd_csumonly.c.o' -MF 'app/a172ced@@dpdk-testpmd@exe/test-pmd_csumonly.c.o.d' -o 'app/a172ced@@dpdk-testpmd@exe/test-pmd_csumonly.c.o' -c ../app/test-pmd/csumonly.c
../app/test-pmd/csumonly.c: In function ‘pkt_burst_checksum_forward’:
../app/test-pmd/csumonly.c:861:21: error: ‘PKT_TX_TUNNEL_GTP’ undeclared (first use in this function); did you mean ‘PKT_TX_TUNNEL_IP’?
  861 |      tx_ol_flags |= PKT_TX_TUNNEL_GTP;
      |                     ^~~~~~~~~~~~~~~~~
      |                     PKT_TX_TUNNEL_IP
../app/test-pmd/csumonly.c:861:21: note: each undeclared identifier is reported only once for each function it appears in
[1545/1845] Compiling C object 'app/a172ced@@dpdk-testpmd@exe/test-pmd_cmdline_tm.c.o'.
[1546/1845] Compiling C object 'app/a172ced@@dpdk-testpmd@exe/test-pmd_flowgen.c.o'.
[1547/1845] Compiling C object 'app/a172ced@@dpdk-testpmd@exe/test-pmd_cmdline_flow.c.o'.
[1548/1845] Compiling C object 'app/a172ced@@dpdk-testpmd@exe/test-pmd_config.c.o'.
[1549/1845] Compiling C object 'drivers/a715181@@tmp_rte_pmd_octeontx2_event@sta/event_octeontx2_otx2_worker_dual.c.o'.
[1550/1845] Compiling C object 'drivers/a715181@@tmp_rte_pmd_octeontx2_event@sta/event_octeontx2_otx2_worker.c.o'.
[1551/1845] Compiling C object 'app/a172ced@@dpdk-testpmd@exe/test-pmd_cmdline.c.o'.
ninja: build stopped: subcommand failed




*Meson Build Failed #4:
OS: UB1804-64
Target:build-gcc-static
FAILED: app/a172ced@@dpdk-testpmd@exe/test-pmd_csumonly.c.o 
gcc -Iapp/a172ced@@dpdk-testpmd@exe -Iapp -I../app -Ilib/librte_ethdev -I../lib/librte_ethdev -I. -I../ -Iconfig -I../config -Ilib/librte_eal/common/include -I../lib/librte_eal/common/include -I../lib/librte_eal/linux/eal/include -Ilib/librte_eal/common -I../lib/librte_eal/common -Ilib/librte_eal/common/include/arch/x86 -I../lib/librte_eal/common/include/arch/x86 -Ilib/librte_eal -I../lib/librte_eal -Ilib/librte_kvargs -I../lib/librte_kvargs -Ilib/librte_net -I../lib/librte_net -Ilib/librte_mbuf -I../lib/librte_mbuf -Ilib/librte_mempool -I../lib/librte_mempool -Ilib/librte_ring -I../lib/librte_ring -Ilib/librte_meter -I../lib/librte_meter -Ilib/librte_gro -I../lib/librte_gro -Ilib/librte_gso -I../lib/librte_gso -Ilib/librte_cmdline -I../lib/librte_cmdline -Ilib/librte_metrics -I../lib/librte_metrics -Idrivers/bus/pci -I../drivers/bus/pci -I../drivers/bus/pci/linux -Ilib/librte_pci -I../lib/librte_pci -Ilib/librte_pdump -I../lib/librte_pdump -Idrivers/net/bnxt -I../drivers/net/bnxt -Idrivers/bus/vdev -I../drivers/bus/vdev -Idrivers/net/i40e -I../drivers/net/i40e -Idrivers/net/i40e/base -I../drivers/net/i40e/base -Ilib/librte_hash -I../lib/librte_hash -Idrivers/net/ixgbe -I../drivers/net/ixgbe -Idrivers/net/ixgbe/base -I../drivers/net/ixgbe/base -Ilib/librte_security -I../lib/librte_security -Ilib/librte_cryptodev -I../lib/librte_cryptodev -Idrivers/net/softnic -I../drivers/net/softnic -Ilib/librte_pipeline -I../lib/librte_pipeline -Ilib/librte_port -I../lib/librte_port -Ilib/librte_sched -I../lib/librte_sched -Ilib/librte_ip_frag -I../lib/librte_ip_frag -Ilib/librte_kni -I../lib/librte_kni -Ilib/librte_table -I../lib/librte_table -Ilib/librte_lpm -I../lib/librte_lpm -Ilib/librte_acl -I../lib/librte_acl -Idrivers/bus/dpaa -I../drivers/bus/dpaa -I../drivers/bus/dpaa/include -I../drivers/bus/dpaa/base/qbman -Idrivers/common/dpaax -I../drivers/common/dpaax -Ilib/librte_eventdev -I../lib/librte_eventdev -Ilib/librte_timer -I../lib/librte_timer -Idrivers/mempool/dpaa -I../drivers/mempool/dpaa -Idrivers/net/dpaa -I../drivers/net/dpaa -Ilib/librte_bpf -I../lib/librte_bpf -fdiagnostics-color=always -pipe -D_FILE_OFFSET_BITS=64 -Wall -Winvalid-pch -Werror -O3 -include rte_config.h -Wunused-parameter -Wsign-compare -Wcast-qual -D_GNU_SOURCE -march=native -mno-avx512f -Wno-deprecated-declarations -DALLOW_EXPERIMENTAL_API -MD -MQ 'app/a172ced@@dpdk-testpmd@exe/test-pmd_csumonly.c.o' -MF 'app/a172ced@@dpdk-testpmd@exe/test-pmd_csumonly.c.o.d' -o 'app/a172ced@@dpdk-testpmd@exe/test-pmd_csumonly.c.o' -c ../app/test-pmd/csumonly.c
../app/test-pmd/csumonly.c: In function ‘pkt_burst_checksum_forward’:
../app/test-pmd/csumonly.c:861:21: error: ‘PKT_TX_TUNNEL_GTP’ undeclared (first use in this function); did you mean ‘PKT_TX_TUNNEL_IP’?
      tx_ol_flags |= PKT_TX_TUNNEL_GTP;
                     ^~~~~~~~~~~~~~~~~
                     PKT_TX_TUNNEL_IP
../app/test-pmd/csumonly.c:861:21: note: each undeclared identifier is reported only once for each function it appears in
[1576/1852] Compiling C object 'app/a172ced@@dpdk-testpmd@exe/test-pmd_macswap.c.o'.
[1577/1852] Linking target app/dpdk-test-pipeline.
[1578/1852] Compiling C object 'app/a172ced@@dpdk-testpmd@exe/test-pmd_testpmd.c.o'.
[1579/1852] Compiling C object 'app/a172ced@@dpdk-testpmd@exe/test-pmd_parameters.c.o'.
[1580/1852] Compiling C object 'app/a172ced@@dpdk-testpmd@exe/test-pmd_cmdline.c.o'.
ninja: build stopped: subcommand failed




*Meson Build Failed #5:
OS: FreeBSD12-64
Target:build-gcc-static
FAILED: app/a172ced@@dpdk-testpmd@exe/test-pmd_csumonly.c.o 
ccache gcc -Iapp/a172ced@@dpdk-testpmd@exe -Iapp -I../app -Ilib/librte_telemetry -I../lib/librte_telemetry -I. -I../ -Iconfig -I../config -Ilib/librte_eal/common/include -I../lib/librte_eal/common/include -I../lib/librte_eal/freebsd/eal/include -Ilib/librte_eal/common -I../lib/librte_eal/common -Ilib/librte_eal/common/include/arch/x86 -I../lib/librte_eal/common/include/arch/x86 -Ilib/librte_eal -I../lib/librte_eal -Ilib/librte_kvargs -I../lib/librte_kvargs -Ilib/librte_metrics -I../lib/librte_metrics -Ilib/librte_ethdev -I../lib/librte_ethdev -Ilib/librte_net -I../lib/librte_net -Ilib/librte_mbuf -I../lib/librte_mbuf -Ilib/librte_mempool -I../lib/librte_mempool -Ilib/librte_ring -I../lib/librte_ring -Ilib/librte_meter -I../lib/librte_meter -Ilib/librte_gro -I../lib/librte_gro -Ilib/librte_gso -I../lib/librte_gso -Ilib/librte_cmdline -I../lib/librte_cmdline -Idrivers/bus/pci -I../drivers/bus/pci -I../drivers/bus/pci/bsd -Ilib/librte_pci -I../lib/librte_pci -Ilib/librte_pdump -I../lib/librte_pdump -Idrivers/net/bnxt -I../drivers/net/bnxt -Idrivers/bus/vdev -I../drivers/bus/vdev -Idrivers/net/i40e -I../drivers/net/i40e -Idrivers/net/i40e/base -I../drivers/net/i40e/base -Ilib/librte_hash -I../lib/librte_hash -Idrivers/net/ixgbe -I../drivers/net/ixgbe -Idrivers/net/ixgbe/base -I../drivers/net/ixgbe/base -Ilib/librte_security -I../lib/librte_security -Ilib/librte_cryptodev -I../lib/librte_cryptodev -Ilib/librte_bpf -I../lib/librte_bpf -I/usr/local/include -fdiagnostics-color=always -pipe -D_FILE_OFFSET_BITS=64 -Wall -Winvalid-pch -Werror -O3 -include rte_config.h -Wunused-parameter -Wsign-compare -Wcast-qual -D_GNU_SOURCE -D__BSD_VISIBLE -march=native -Wno-deprecated-declarations -DALLOW_EXPERIMENTAL_API -MD -MQ 'app/a172ced@@dpdk-testpmd@exe/test-pmd_csumonly.c.o' -MF 'app/a172ced@@dpdk-testpmd@exe/test-pmd_csumonly.c.o.d' -o 'app/a172ced@@dpdk-testpmd@exe/test-pmd_csumonly.c.o' -c ../app/test-pmd/csumonly.c
../app/test-pmd/csumonly.c: In function 'pkt_burst_checksum_forward':
../app/test-pmd/csumonly.c:861:21: error: 'PKT_TX_TUNNEL_GTP' undeclared (first use in this function); did you mean 'PKT_TX_TUNNEL_IP'?
      tx_ol_flags |= PKT_TX_TUNNEL_GTP;
                     ^~~~~~~~~~~~~~~~~
                     PKT_TX_TUNNEL_IP
../app/test-pmd/csumonly.c:861:21: note: each undeclared identifier is reported only once for each function it appears in
[1171/1439] Compiling C object 'app/a172ced@@dpdk-testpmd@exe/test-pmd_cmdline_flow.c.o'.
[1172/1439] Compiling C object 'app/a172ced@@dpdk-testpmd@exe/test-pmd_config.c.o'.
[1173/1439] Compiling C object 'app/a172ced@@dpdk-testpmd@exe/test-pmd_cmdline.c.o'.
[1174/1439] Compiling C object 'drivers/a715181@@tmp_rte_pmd_octeontx2_event@sta/event_octeontx2_otx2_worker.c.o'.
[1175/1439] Compiling C object 'drivers/a715181@@tmp_rte_pmd_octeontx2_event@sta/event_octeontx2_otx2_worker_dual.c.o'.
ninja: build stopped: subcommand failed



DPDK STV team

^ permalink raw reply	[flat|nested] only message in thread

only message in thread, other threads:[~2019-10-21  5:57 UTC | newest]

Thread overview: (only message) (download: mbox.gz / follow: Atom feed)
-- links below jump to the message on this page --
2019-10-21  5:57 [dpdk-test-report] |FAILURE| pw61500[v4] app/testpmd: enable GTP header parse and Tx checksum offload sys_stv

automatic DPDK test reports

This inbox may be cloned and mirrored by anyone:

	git clone --mirror https://inbox.dpdk.org/test-report/0 test-report/git/0.git

	# If you have public-inbox 1.1+ installed, you may
	# initialize and index your mirror using the following commands:
	public-inbox-init -V2 test-report test-report/ https://inbox.dpdk.org/test-report \
		test-report@dpdk.org
	public-inbox-index test-report

Example config snippet for mirrors.
Newsgroup available over NNTP:
	nntp://inbox.dpdk.org/inbox.dpdk.test-report


AGPL code for this site: git clone https://public-inbox.org/public-inbox.git