automatic DPDK test reports
 help / color / mirror / Atom feed
From: sys_stv@intel.com
To: test-report@dpdk.org
Subject: [dpdk-test-report] |FAILURE| pw61523[2/2] net/enetc: set random MAC in case no MAC for SI
Date: 21 Oct 2019 00:51:55 -0700
Message-ID: <ee68f5$8bs461@orsmga001.jf.intel.com> (raw)

[-- Attachment #1: Type: text/plain, Size: 54789 bytes --]

Test-Label: Intel-compilation
Test-Status: FAILURE
http://dpdk.org/patch/61523

_Compilation issues_

Submitter: Gagandeep Singh <g.singh@nxp.com>
Date: 2019-10-21 06:29:51
Reply_mail: 20191021062951.23562-2-g.singh@nxp.com
DPDK git baseline: Repo:dpdk-next-net, CommitID: 7bef76e5f840b6222c2b6bee6d9a5e54dfe8b167

Makefile build Summary: 22 Builds Done, 4 Successful, 18 Failures

Meson build Summary: 7 Builds Done, 3 Successful, 4 Failures

               +==============================================+===========+==========+
               |                   Makefile                   |   Meson   | Document |
+--------------+------+-------+------+------------+-----------+-----------+----------+
| os           | gcc  | clang | icc  | gcc+shared | gcc+debug | gcc/clang | pdf/html |
+--------------+------+-------+------+------------+-----------+-----------+----------+
| RHEL76-64    | FAIL |       |      |            |           |           |          |
| CENTOS76-64  | FAIL | FAIL  | FAIL | FAIL       | FAIL      |           |          |
| UB1804-64    | FAIL | FAIL  | FAIL |            |           | FAIL      | pass     |
| UB1604-32    | FAIL |       |      |            |           | FAIL      |          |
| UB1904-64    | FAIL |       |      |            |           |           |          |
| UB1604-64    | FAIL | FAIL  |      |            |           |           |          |
| FC30-64      | FAIL | FAIL  |      |            |           | FAIL      |          |
| WIN10-64     |      |       |      |            |           | pass      |          |
| FreeBSD12-64 | pass | pass  |      | pass       | pass      | pass      |          |
| RHEL80-64    | FAIL |       |      |            |           |           |          |
| SUSE15-64    | FAIL | FAIL  |      |            |           | FAIL      |          |
+--------------+------+-------+------+------------+-----------+-----------+----------+

Test environment and configuration as below:

** Makefile build **


OS: RHEL76-64
	Kernel Version: 3.10.0-957.el7.x86_64
	CPU info: Intel(R) Xeon(R) CPU E5-2699 v4 @ 2.20GHz
	GCC Version: gcc (GCC) 4.8.5 20150623 (Red Hat 4.8.5-36)
	Clang Version: NA
	x86_64-native-linuxapp-gcc


OS: CENTOS76-64
	Kernel Version: 3.10.0-957.27.2.el7.x86_64
	CPU info: Intel(R) Xeon(R) CPU E5-2699 v4 @ 2.20GHz
	GCC Version: gcc (GCC) 4.8.5 20150623 (Red Hat 4.8.5-36)
	Clang Version: 3.4.2 (tags/RELEASE_34/dot2-final)
	x86_64-native-linuxapp-gcc+debug
	x86_64-native-linuxapp-gcc
	x86_64-native-linuxapp-clang
	x86_64-native-linuxapp-gcc+shared
	x86_64-native-linuxapp-icc


OS: UB1804-64
	Kernel Version: 4.15.0-20-generic
	CPU info: Intel(R) Xeon(R) CPU E5-2699 v3 @ 2.30GHz
	GCC Version: gcc (Ubuntu 7.3.0-16ubuntu3) 7.3.0
	Clang Version: 6.0.0-1ubuntu2 (tags/RELEASE_600/final)
	x86_64-native-linuxapp-clang
	x86_64-native-linuxapp-icc
	x86_64-native-linuxapp-gcc


OS: UB1904-64
	Kernel Version: 5.0.0-13-generic
	CPU info: Intel(R) Xeon(R) CPU E5-2699 v3 @ 2.30GHz
	GCC Version: gcc (Ubuntu 8.3.0-6ubuntu1) 8.3.0
	Clang Version: 8.0.0-3 (tags/RELEASE_800/final)
	x86_64-native-linuxapp-gcc


OS: UB1604-32
	Kernel Version: 4.4.0-131-generic
	CPU info: Intel(R) Xeon(R) CPU E5-2699 v3 @ 2.30GHz
	GCC Version: gcc (Ubuntu 5.4.0-6ubuntu1~16.04.11) 5.4.0 20160609
	Clang Version: 3.8.0-2ubuntu4 (tags/RELEASE_380/final)
	i686-native-linuxapp-gcc


OS: UB1604-64
	Kernel Version: 4.4.0-47-generic
	CPU info: Intel(R) Xeon(R) CPU E5-2699 v3 @ 2.30GHz
	GCC Version: gcc (Ubuntu 5.4.0-6ubuntu1~16.04.10) 5.4.0 20160609
	Clang Version: 3.8.0-2ubuntu4 (tags/RELEASE_380/final)
	x86_64-native-linuxapp-clang
	x86_64-native-linuxapp-gcc


OS: FC30-64
	Kernel Version: 5.1.7-300.fc30.x86_64
	CPU info: Intel(R) Xeon(R) CPU E5-2699 v4 @ 2.20GHz
	GCC Version: gcc (GCC) 9.1.1 20190503 (Red Hat 9.1.1-1)
	Clang Version: 8.0.0 (Fedora 8.0.0-1.fc30)
	x86_64-native-linuxapp-gcc
	x86_64-native-linuxapp-clang


OS: FreeBSD12-64
	Kernel Version: 12.0-RC3
	CPU info: Intel(R) Xeon(R) CPU E5-2699 v4 @ 2.20GHz (2194.98-MHz K8-class CPU)
	GCC Version: gcc (FreeBSD Ports Collection) 7.3.0
	Clang Version: 6.0.1 (tags/RELEASE_601/final 335540) (based on LLVM 6.0.1)
	x86_64-native-bsdapp-gcc+debug
	x86_64-native-bsdapp-clang
	x86_64-native-bsdapp-gcc+shared
	x86_64-native-bsdapp-gcc


OS: RHEL80-64
	Kernel Version: 4.18.0-80.el8.x86_64
	CPU info: Intel(R) Xeon(R) CPU E5-2699 v4 @ 2.20GHz
	GCC Version: gcc (GCC) 8.2.1 20180905 (Red Hat 8.2.1-3)
	Clang Version: 6.0.1 (tags/RELEASE_601/final)
	x86_64-native-linuxapp-gcc


OS: SUSE15-64
	Kernel Version: 4.12.14-lp150.11-default
	CPU info: Intel(R) Xeon(R) CPU E5-2699 v4 @ 2.20GHz
	GCC Version: gcc (SUSE Linux) 7.3.1 20180323 [gcc-7-branch revision 258812]
	Clang Version: 5.0.1 (tags/RELEASE_501/final 312548)
	x86_64-native-linuxapp-gcc
	x86_64-native-linuxapp-clang


** Meson build **


OS: UB1804-64
	Kernel Version: 4.15.0-20-generic
	CPU info: Intel(R) Xeon(R) CPU E5-2699 v4 @ 2.20GHz
	GCC Version: gcc (Ubuntu 7.3.0-27ubuntu1~18.04) 7.3.0
	Clang Version: 6.0.0-1ubuntu2 (tags/RELEASE_600/final)
	x86_64-native-linuxapp-doc
	build-gcc-static
	build-gcc-shared
	build-clang-static
	build-clang-shared
	build-x86-default


OS: UB1604-32
	Kernel Version: 4.4.0-131-generic
	CPU info: Intel(R) Xeon(R) CPU E5-2699 v4 @ 2.20GHz
	GCC Version: gcc (Ubuntu 5.4.0-6ubuntu1~16.04.11) 5.4.0 20160609
	Clang Version: 3.8.0-2ubuntu4 (tags/RELEASE_380/final)
	build-gcc-static
	build-gcc-shared
	build-clang-static
	build-clang-shared
	build-x86-default


OS: FC30-64
	Kernel Version: 5.0.9-301.fc30.x86_64
	CPU info: Intel(R) Xeon(R) CPU E5-2699 v4 @ 2.20GHz
	GCC Version: gcc (GCC) 9.1.1 20190503 (Red Hat 9.1.1-1)
	Clang Version: 8.0.0 (Fedora 8.0.0-1.fc30)
	build-gcc-static
	build-gcc-shared
	build-clang-static
	build-clang-shared
	build-x86-default


OS: WIN10-64
	Kernel Version: N/A
	CPU info: N/A
	GCC Version: N/A
	Clang Version: Clang 8.0.0
	x86_64-windows-clang


OS: FreeBSD12-64
	Kernel Version: 12.0-RC3
	CPU info: Intel(R) Xeon(R) CPU E5-2699 v4 @ 2.20GHz (2194.97-MHz K8-class CPU)
	GCC Version: gcc (FreeBSD Ports Collection) 7.3.0
	Clang Version: 6.0.1 (tags/RELEASE_601/final 335540) (based on LLVM 6.0.1)
	build-gcc-static
	build-gcc-shared
	build-clang-static
	build-clang-shared
	build-x86-default


OS: SUSE15-64
	Kernel Version: 4.12.14-lp150.11-default
	CPU info: Intel(R) Xeon(R) CPU E5-2699 v4 @ 2.20GHz
	GCC Version: gcc (SUSE Linux) 7.3.1 20180323 [gcc-7-branch revision 258812]
	Clang Version: 5.0.1 (tags/RELEASE_501/final 312548)
	build-gcc-static
	build-gcc-shared
	build-clang-static
	build-clang-shared
	build-x86-default


*Make Build Failed #1:
OS: UB1604-64
Target: x86_64-native-linuxapp-clang
/tmp/UB1604-64_K4.4.0_Clang3.8.0/x86_64-native-linuxapp-clang/8cd789bf051b4e989daaa881ced5cf40/dpdk/drivers/net/enetc/enetc_ethdev.c:128:58: note: passing argument to parameter 'eth_addr' here
print_ethaddr(const char *name, const struct ether_addr *eth_addr)
                                                         ^
  CC cxgbe_filter.o
3 warnings and 2 errors generated.
/tmp/UB1604-64_K4.4.0_Clang3.8.0/x86_64-native-linuxapp-clang/8cd789bf051b4e989daaa881ced5cf40/dpdk/mk/internal/rte.compile-pre.mk:114: recipe for target 'enetc_ethdev.o' failed
make[6]: *** [enetc_ethdev.o] Error 1
/tmp/UB1604-64_K4.4.0_Clang3.8.0/x86_64-native-linuxapp-clang/8cd789bf051b4e989daaa881ced5cf40/dpdk/mk/rte.subdir.mk:35: recipe for target 'enetc' failed
make[5]: *** [enetc] Error 2
make[5]: *** Waiting for unfinished jobs....
  CC cxgbe_flow.o
  CC e1000_nvm.o
  CC e1000_osdep.o
  PMDINFO enic_ethdev.o.pmd.c
--
  PMDINFO em_ethdev.o.pmd.c
  CC em_ethdev.o.pmd.o
  LD em_ethdev.o
  AR librte_pmd_e1000.a
  INSTALL-LIB librte_pmd_e1000.a
/tmp/UB1604-64_K4.4.0_Clang3.8.0/x86_64-native-linuxapp-clang/8cd789bf051b4e989daaa881ced5cf40/dpdk/mk/rte.subdir.mk:35: recipe for target 'net' failed
make[4]: *** [net] Error 2
/tmp/UB1604-64_K4.4.0_Clang3.8.0/x86_64-native-linuxapp-clang/8cd789bf051b4e989daaa881ced5cf40/dpdk/mk/rte.sdkbuild.mk:46: recipe for target 'drivers' failed
make[3]: *** [drivers] Error 2
/tmp/UB1604-64_K4.4.0_Clang3.8.0/x86_64-native-linuxapp-clang/8cd789bf051b4e989daaa881ced5cf40/dpdk/mk/rte.sdkroot.mk:98: recipe for target 'all' failed
make[2]: *** [all] Error 2
/tmp/UB1604-64_K4.4.0_Clang3.8.0/x86_64-native-linuxapp-clang/8cd789bf051b4e989daaa881ced5cf40/dpdk/mk/rte.sdkinstall.mk:60: recipe for target 'pre_install' failed
make[1]: *** [pre_install] Error 2
/tmp/UB1604-64_K4.4.0_Clang3.8.0/x86_64-native-linuxapp-clang/8cd789bf051b4e989daaa881ced5cf40/dpdk/mk/rte.sdkroot.mk:77: recipe for target 'install' failed
make: *** [install] Error 2


*Make Build Failed #2:
OS: UB1604-32
Target: i686-native-linuxapp-gcc
/tmp/UB1604-32_K4.4.0_GCC5.4.0/i686-native-linuxapp-gcc/8cd789bf051b4e989daaa881ced5cf40/dpdk/drivers/net/enetc/enetc_ethdev.c:128:1: note: expected ‘const struct ether_addr *’ but argument is of type ‘const struct ether_addr *’
 print_ethaddr(const char *name, const struct ether_addr *eth_addr)
 ^
/tmp/UB1604-32_K4.4.0_GCC5.4.0/i686-native-linuxapp-gcc/8cd789bf051b4e989daaa881ced5cf40/dpdk/drivers/net/enetc/enetc_ethdev.c: At top level:
cc1: warning: unrecognized command line option ‘-Wno-address-of-packed-member’
/tmp/UB1604-32_K4.4.0_GCC5.4.0/i686-native-linuxapp-gcc/8cd789bf051b4e989daaa881ced5cf40/dpdk/mk/internal/rte.compile-pre.mk:114: recipe for target 'enetc_ethdev.o' failed
make[6]: *** [enetc_ethdev.o] Error 1
/tmp/UB1604-32_K4.4.0_GCC5.4.0/i686-native-linuxapp-gcc/8cd789bf051b4e989daaa881ced5cf40/dpdk/mk/rte.subdir.mk:35: recipe for target 'enetc' failed
make[5]: *** [enetc] Error 2
make[5]: *** Waiting for unfinished jobs....
  CC enic_rxtx.o
  CC enic_clsf.o
  PMDINFO virtio_cryptodev.o.pmd.c
  CC virtio_cryptodev.o.pmd.o
--
  PMDINFO igb_ethdev.o.pmd.c
  CC igb_ethdev.o.pmd.o
  LD igb_ethdev.o
  AR librte_pmd_e1000.a
  INSTALL-LIB librte_pmd_e1000.a
/tmp/UB1604-32_K4.4.0_GCC5.4.0/i686-native-linuxapp-gcc/8cd789bf051b4e989daaa881ced5cf40/dpdk/mk/rte.subdir.mk:35: recipe for target 'net' failed
make[4]: *** [net] Error 2
/tmp/UB1604-32_K4.4.0_GCC5.4.0/i686-native-linuxapp-gcc/8cd789bf051b4e989daaa881ced5cf40/dpdk/mk/rte.sdkbuild.mk:46: recipe for target 'drivers' failed
make[3]: *** [drivers] Error 2
/tmp/UB1604-32_K4.4.0_GCC5.4.0/i686-native-linuxapp-gcc/8cd789bf051b4e989daaa881ced5cf40/dpdk/mk/rte.sdkroot.mk:98: recipe for target 'all' failed
make[2]: *** [all] Error 2
/tmp/UB1604-32_K4.4.0_GCC5.4.0/i686-native-linuxapp-gcc/8cd789bf051b4e989daaa881ced5cf40/dpdk/mk/rte.sdkinstall.mk:60: recipe for target 'pre_install' failed
make[1]: *** [pre_install] Error 2
/tmp/UB1604-32_K4.4.0_GCC5.4.0/i686-native-linuxapp-gcc/8cd789bf051b4e989daaa881ced5cf40/dpdk/mk/rte.sdkroot.mk:77: recipe for target 'install' failed
make: *** [install] Error 2


*Make Build Failed #3:
OS: UB1904-64
Target: x86_64-native-linuxapp-gcc
/tmp/UB1904-64_K4.18.0_GCC8.3.0/x86_64-native-linuxapp-gcc/8cd789bf051b4e989daaa881ced5cf40/dpdk/drivers/net/enetc/enetc_ethdev.c:128:58: note: expected ‘const struct ether_addr *’ but argument is of type ‘const struct ether_addr *’
 print_ethaddr(const char *name, const struct ether_addr *eth_addr)
                                 ~~~~~~~~~~~~~~~~~~~~~~~~~^~~~~~~~
/tmp/UB1904-64_K4.18.0_GCC8.3.0/x86_64-native-linuxapp-gcc/8cd789bf051b4e989daaa881ced5cf40/dpdk/drivers/net/enetc/enetc_ethdev.c: At top level:
cc1: warning: unrecognized command line option ‘-Wno-address-of-packed-member’
make[6]: *** [/tmp/UB1904-64_K4.18.0_GCC8.3.0/x86_64-native-linuxapp-gcc/8cd789bf051b4e989daaa881ced5cf40/dpdk/mk/internal/rte.compile-pre.mk:114: enetc_ethdev.o] Error 1
make[5]: *** [/tmp/UB1904-64_K4.18.0_GCC8.3.0/x86_64-native-linuxapp-gcc/8cd789bf051b4e989daaa881ced5cf40/dpdk/mk/rte.subdir.mk:37: enetc] Error 2
make[5]: *** Waiting for unfinished jobs....
  CC bnx2x_vfpf.o
  CC cxgbe_filter.o
  PMDINFO dpaa2_mux.o.pmd.c
  CC dpaa2_mux.o.pmd.o
--
  INSTALL-LIB librte_pmd_cxgbe.a
  AR librte_pmd_enic.a
  INSTALL-LIB librte_pmd_enic.a
  AR librte_pmd_e1000.a
  INSTALL-LIB librte_pmd_e1000.a
make[4]: *** [/tmp/UB1904-64_K4.18.0_GCC8.3.0/x86_64-native-linuxapp-gcc/8cd789bf051b4e989daaa881ced5cf40/dpdk/mk/rte.subdir.mk:35: net] Error 2
make[3]: *** [/tmp/UB1904-64_K4.18.0_GCC8.3.0/x86_64-native-linuxapp-gcc/8cd789bf051b4e989daaa881ced5cf40/dpdk/mk/rte.sdkbuild.mk:46: drivers] Error 2
make[2]: *** [/tmp/UB1904-64_K4.18.0_GCC8.3.0/x86_64-native-linuxapp-gcc/8cd789bf051b4e989daaa881ced5cf40/dpdk/mk/rte.sdkroot.mk:99: all] Error 2
make[1]: *** [/tmp/UB1904-64_K4.18.0_GCC8.3.0/x86_64-native-linuxapp-gcc/8cd789bf051b4e989daaa881ced5cf40/dpdk/mk/rte.sdkinstall.mk:61: pre_install] Error 2
make: *** [/tmp/UB1904-64_K4.18.0_GCC8.3.0/x86_64-native-linuxapp-gcc/8cd789bf051b4e989daaa881ced5cf40/dpdk/mk/rte.sdkroot.mk:77: install] Error 2


*Make Build Failed #4:
OS: UB1804-64
Target: x86_64-native-linuxapp-clang
/tmp/UB1804-64_K4.15.0_Clang6.0.0/x86_64-native-linuxapp-clang/8cd789bf051b4e989daaa881ced5cf40/dpdk/drivers/net/enetc/enetc_ethdev.c:128:58: note: passing argument to parameter 'eth_addr' here
print_ethaddr(const char *name, const struct ether_addr *eth_addr)
                                                         ^
  AR librte_pmd_axgbe.a
4 warnings and 2 errors generated.
/tmp/UB1804-64_K4.15.0_Clang6.0.0/x86_64-native-linuxapp-clang/8cd789bf051b4e989daaa881ced5cf40/dpdk/mk/internal/rte.compile-pre.mk:114: recipe for target 'enetc_ethdev.o' failed
make[6]: *** [enetc_ethdev.o] Error 1
/tmp/UB1804-64_K4.15.0_Clang6.0.0/x86_64-native-linuxapp-clang/8cd789bf051b4e989daaa881ced5cf40/dpdk/mk/rte.subdir.mk:35: recipe for target 'enetc' failed
make[5]: *** [enetc] Error 2
make[5]: *** Waiting for unfinished jobs....
  INSTALL-LIB librte_pmd_axgbe.a
  CC e1000_i210.o
  CC e1000_api.o
  CC e1000_ich8lan.o
--
  LD em_ethdev.o
  AR librte_pmd_nitrox.a
  INSTALL-LIB librte_pmd_nitrox.a
  AR librte_pmd_e1000.a
  INSTALL-LIB librte_pmd_e1000.a
/tmp/UB1804-64_K4.15.0_Clang6.0.0/x86_64-native-linuxapp-clang/8cd789bf051b4e989daaa881ced5cf40/dpdk/mk/rte.subdir.mk:35: recipe for target 'net' failed
make[4]: *** [net] Error 2
make[4]: *** Waiting for unfinished jobs....
  PMDINFO virtio_cryptodev.o.pmd.c
  CC virtio_cryptodev.o.pmd.o
  LD virtio_cryptodev.o
  AR librte_pmd_virtio_crypto.a
  INSTALL-LIB librte_pmd_virtio_crypto.a
/tmp/UB1804-64_K4.15.0_Clang6.0.0/x86_64-native-linuxapp-clang/8cd789bf051b4e989daaa881ced5cf40/dpdk/mk/rte.sdkbuild.mk:46: recipe for target 'drivers' failed
make[3]: *** [drivers] Error 2
/tmp/UB1804-64_K4.15.0_Clang6.0.0/x86_64-native-linuxapp-clang/8cd789bf051b4e989daaa881ced5cf40/dpdk/mk/rte.sdkroot.mk:98: recipe for target 'all' failed
make[2]: *** [all] Error 2
/tmp/UB1804-64_K4.15.0_Clang6.0.0/x86_64-native-linuxapp-clang/8cd789bf051b4e989daaa881ced5cf40/dpdk/mk/rte.sdkinstall.mk:60: recipe for target 'pre_install' failed
make[1]: *** [pre_install] Error 2
/tmp/UB1804-64_K4.15.0_Clang6.0.0/x86_64-native-linuxapp-clang/8cd789bf051b4e989daaa881ced5cf40/dpdk/mk/rte.sdkroot.mk:77: recipe for target 'install' failed
make: *** [install] Error 2


*Make Build Failed #5:
OS: UB1804-64
Target: x86_64-native-linuxapp-icc
/tmp/UB1804-64_K4.15.0_ICC19.0.0/x86_64-native-linuxapp-icc/8cd789bf051b4e989daaa881ced5cf40/dpdk/drivers/net/enetc/enetc_ethdev.c(172): warning #167: argument of type "const struct ether_addr *" is incompatible with parameter of type "const struct ether_addr *"
  		print_ethaddr("New address: ", (const struct ether_addr *)hw->mac.addr);
  		                               ^

compilation aborted for /tmp/UB1804-64_K4.15.0_ICC19.0.0/x86_64-native-linuxapp-icc/8cd789bf051b4e989daaa881ced5cf40/dpdk/drivers/net/enetc/enetc_ethdev.c (code 2)
/tmp/UB1804-64_K4.15.0_ICC19.0.0/x86_64-native-linuxapp-icc/8cd789bf051b4e989daaa881ced5cf40/dpdk/mk/internal/rte.compile-pre.mk:114: recipe for target 'enetc_ethdev.o' failed
make[6]: *** [enetc_ethdev.o] Error 2
make[6]: *** Waiting for unfinished jobs....
  CC igb_ethdev.o
/tmp/UB1804-64_K4.15.0_ICC19.0.0/x86_64-native-linuxapp-icc/8cd789bf051b4e989daaa881ced5cf40/dpdk/mk/rte.subdir.mk:35: recipe for target 'enetc' failed
make[5]: *** [enetc] Error 2
make[5]: *** Waiting for unfinished jobs....
  CC igb_rxtx.o
  CC scheduler_multicore.o
  CC igb_pf.o
  CC mc/dpkg.o
--
  INSTALL-LIB librte_pmd_octeontx_crypto.a
  LD igb_ethdev.o
  CC dpaa_sec.o
  AR librte_pmd_e1000.a
  INSTALL-LIB librte_pmd_e1000.a
/tmp/UB1804-64_K4.15.0_ICC19.0.0/x86_64-native-linuxapp-icc/8cd789bf051b4e989daaa881ced5cf40/dpdk/mk/rte.subdir.mk:35: recipe for target 'net' failed
make[4]: *** [net] Error 2
make[4]: *** Waiting for unfinished jobs....
  CC caam_jr_capabilities.o
  CC caam_jr_uio.o
  CC caam_jr_hw.o
  CC caam_jr.o
--
  PMDINFO dpaa2_sec_dpseci.o.pmd.c
  CC dpaa2_sec_dpseci.o.pmd.o
  LD dpaa2_sec_dpseci.o
  AR librte_pmd_dpaa2_sec.a
  INSTALL-LIB librte_pmd_dpaa2_sec.a
/tmp/UB1804-64_K4.15.0_ICC19.0.0/x86_64-native-linuxapp-icc/8cd789bf051b4e989daaa881ced5cf40/dpdk/mk/rte.sdkbuild.mk:46: recipe for target 'drivers' failed
make[3]: *** [drivers] Error 2
/tmp/UB1804-64_K4.15.0_ICC19.0.0/x86_64-native-linuxapp-icc/8cd789bf051b4e989daaa881ced5cf40/dpdk/mk/rte.sdkroot.mk:98: recipe for target 'all' failed
make[2]: *** [all] Error 2
/tmp/UB1804-64_K4.15.0_ICC19.0.0/x86_64-native-linuxapp-icc/8cd789bf051b4e989daaa881ced5cf40/dpdk/mk/rte.sdkinstall.mk:60: recipe for target 'pre_install' failed
make[1]: *** [pre_install] Error 2
/tmp/UB1804-64_K4.15.0_ICC19.0.0/x86_64-native-linuxapp-icc/8cd789bf051b4e989daaa881ced5cf40/dpdk/mk/rte.sdkroot.mk:77: recipe for target 'install' failed
make: *** [install] Error 2


*Make Build Failed #6:
OS: SUSE15-64
Target: x86_64-native-linuxapp-gcc
/tmp/SUSE15-64_K4.12.14_GCC7.3.1/x86_64-native-linuxapp-gcc/8cd789bf051b4e989daaa881ced5cf40/dpdk/drivers/net/enetc/enetc_ethdev.c:128:1: note: expected ‘const struct ether_addr *’ but argument is of type ‘const struct ether_addr *’
 print_ethaddr(const char *name, const struct ether_addr *eth_addr)
 ^~~~~~~~~~~~~
/tmp/SUSE15-64_K4.12.14_GCC7.3.1/x86_64-native-linuxapp-gcc/8cd789bf051b4e989daaa881ced5cf40/dpdk/drivers/net/enetc/enetc_ethdev.c: At top level:
cc1: warning: unrecognized command line option ‘-Wno-address-of-packed-member’
make[6]: *** [/tmp/SUSE15-64_K4.12.14_GCC7.3.1/x86_64-native-linuxapp-gcc/8cd789bf051b4e989daaa881ced5cf40/dpdk/mk/internal/rte.compile-pre.mk:116: enetc_ethdev.o] Error 1
  PMDINFO virtio_cryptodev.o.pmd.c
  CC virtio_cryptodev.o.pmd.o
  AR librte_pmd_nitrox.a
  INSTALL-LIB librte_pmd_nitrox.a
  AR librte_pmd_caam_jr.a
make[5]: *** [/tmp/SUSE15-64_K4.12.14_GCC7.3.1/x86_64-native-linuxapp-gcc/8cd789bf051b4e989daaa881ced5cf40/dpdk/mk/rte.subdir.mk:35: enetc] Error 2
make[5]: *** Waiting for unfinished jobs....
  LD virtio_cryptodev.o
== Build drivers/net/enic
  INSTALL-LIB librte_pmd_caam_jr.a
  CC em_ethdev.o
--
  CC enic_rxtx_vec_avx2.o
  LD enic_ethdev.o
  INSTALL-LIB librte_pmd_e1000.a
  AR librte_pmd_enic.a
  INSTALL-LIB librte_pmd_enic.a
make[4]: *** [/tmp/SUSE15-64_K4.12.14_GCC7.3.1/x86_64-native-linuxapp-gcc/8cd789bf051b4e989daaa881ced5cf40/dpdk/mk/rte.subdir.mk:35: net] Error 2
make[3]: *** [/tmp/SUSE15-64_K4.12.14_GCC7.3.1/x86_64-native-linuxapp-gcc/8cd789bf051b4e989daaa881ced5cf40/dpdk/mk/rte.sdkbuild.mk:46: drivers] Error 2
make[2]: *** [/tmp/SUSE15-64_K4.12.14_GCC7.3.1/x86_64-native-linuxapp-gcc/8cd789bf051b4e989daaa881ced5cf40/dpdk/mk/rte.sdkroot.mk:99: all] Error 2
make[1]: *** [/tmp/SUSE15-64_K4.12.14_GCC7.3.1/x86_64-native-linuxapp-gcc/8cd789bf051b4e989daaa881ced5cf40/dpdk/mk/rte.sdkinstall.mk:61: pre_install] Error 2
make: *** [/tmp/SUSE15-64_K4.12.14_GCC7.3.1/x86_64-native-linuxapp-gcc/8cd789bf051b4e989daaa881ced5cf40/dpdk/mk/rte.sdkroot.mk:77: install] Error 2


*Make Build Failed #7:
OS: FC30-64
Target: x86_64-native-linuxapp-gcc
  CC e1000_osdep.o
  CC e1000_phy.o
  AR librte_pmd_failsafe.a
  INSTALL-LIB librte_pmd_failsafe.a
  CC dpaa2_ethdev.o
make[6]: *** [/tmp/FC30-64_K4.20_GCC9.1.1/x86_64-native-linuxapp-gcc/8cd789bf051b4e989daaa881ced5cf40/dpdk/mk/internal/rte.compile-pre.mk:116: enetc_ethdev.o] Error 1
make[6]: *** Waiting for unfinished jobs....
  CC ena_eth_com.o
  CC enetc_rxtx.o
  CC dpaa2_flow.o
== Build drivers/net/hns3
--
  AR librte_pmd_ena.a
  INSTALL-LIB librte_pmd_ena.a
  CC t4_hw.o
  CC dpaa2_mux.o
  CC e1000_vf.o
make[5]: *** [/tmp/FC30-64_K4.20_GCC9.1.1/x86_64-native-linuxapp-gcc/8cd789bf051b4e989daaa881ced5cf40/dpdk/mk/rte.subdir.mk:35: enetc] Error 2
make[5]: *** Waiting for unfinished jobs....
== Build drivers/net/i40e
  CC enic_main.o
  CC igb_ethdev.o
  PMDINFO dpaa2_mux.o.pmd.c
--
  PMDINFO i40e_ethdev.o.pmd.c
  CC i40e_ethdev.o.pmd.o
  LD i40e_ethdev.o
  AR librte_pmd_i40e.a
  INSTALL-LIB librte_pmd_i40e.a
make[4]: *** [/tmp/FC30-64_K4.20_GCC9.1.1/x86_64-native-linuxapp-gcc/8cd789bf051b4e989daaa881ced5cf40/dpdk/mk/rte.subdir.mk:35: net] Error 2
make[3]: *** [/tmp/FC30-64_K4.20_GCC9.1.1/x86_64-native-linuxapp-gcc/8cd789bf051b4e989daaa881ced5cf40/dpdk/mk/rte.sdkbuild.mk:46: drivers] Error 2
make[2]: *** [/tmp/FC30-64_K4.20_GCC9.1.1/x86_64-native-linuxapp-gcc/8cd789bf051b4e989daaa881ced5cf40/dpdk/mk/rte.sdkroot.mk:99: all] Error 2
make[1]: *** [/tmp/FC30-64_K4.20_GCC9.1.1/x86_64-native-linuxapp-gcc/8cd789bf051b4e989daaa881ced5cf40/dpdk/mk/rte.sdkinstall.mk:61: pre_install] Error 2
make: *** [/tmp/FC30-64_K4.20_GCC9.1.1/x86_64-native-linuxapp-gcc/8cd789bf051b4e989daaa881ced5cf40/dpdk/mk/rte.sdkroot.mk:77: install] Error 2


*Make Build Failed #8:
OS: RHEL80-64
Target: x86_64-native-linuxapp-gcc
 print_ethaddr(const char *name, const struct ether_addr *eth_addr)
                                 ~~~~~~~~~~~~~~~~~~~~~~~~~^~~~~~~~
  CC e1000_82541.o
/tmp/RHEL80-64_K3.10.0_GCC8.2.1/x86_64-native-linuxapp-gcc/8cd789bf051b4e989daaa881ced5cf40/dpdk/drivers/net/enetc/enetc_ethdev.c: At top level:
cc1: warning: unrecognized command line option ‘-Wno-address-of-packed-member’
make[6]: *** [/tmp/RHEL80-64_K3.10.0_GCC8.2.1/x86_64-native-linuxapp-gcc/8cd789bf051b4e989daaa881ced5cf40/dpdk/mk/internal/rte.compile-pre.mk:116: enetc_ethdev.o] Error 1
make[5]: *** [/tmp/RHEL80-64_K3.10.0_GCC8.2.1/x86_64-native-linuxapp-gcc/8cd789bf051b4e989daaa881ced5cf40/dpdk/mk/rte.subdir.mk:37: enetc] Error 2
make[5]: *** Waiting for unfinished jobs....
  CC dpaa2_sparser.o
  CC enic_ethdev.o
  PMDINFO ena_ethdev.o.pmd.c
  CC ena_ethdev.o.pmd.o
--
  PMDINFO igb_ethdev.o.pmd.c
  CC igb_ethdev.o.pmd.o
  LD igb_ethdev.o
  AR librte_pmd_e1000.a
  INSTALL-LIB librte_pmd_e1000.a
make[4]: *** [/tmp/RHEL80-64_K3.10.0_GCC8.2.1/x86_64-native-linuxapp-gcc/8cd789bf051b4e989daaa881ced5cf40/dpdk/mk/rte.subdir.mk:35: net] Error 2
make[3]: *** [/tmp/RHEL80-64_K3.10.0_GCC8.2.1/x86_64-native-linuxapp-gcc/8cd789bf051b4e989daaa881ced5cf40/dpdk/mk/rte.sdkbuild.mk:46: drivers] Error 2
make[2]: *** [/tmp/RHEL80-64_K3.10.0_GCC8.2.1/x86_64-native-linuxapp-gcc/8cd789bf051b4e989daaa881ced5cf40/dpdk/mk/rte.sdkroot.mk:99: all] Error 2
make[1]: *** [/tmp/RHEL80-64_K3.10.0_GCC8.2.1/x86_64-native-linuxapp-gcc/8cd789bf051b4e989daaa881ced5cf40/dpdk/mk/rte.sdkinstall.mk:61: pre_install] Error 2
make: *** [/tmp/RHEL80-64_K3.10.0_GCC8.2.1/x86_64-native-linuxapp-gcc/8cd789bf051b4e989daaa881ced5cf40/dpdk/mk/rte.sdkroot.mk:77: install] Error 2


*Make Build Failed #9:
OS: RHEL76-64
Target: x86_64-native-linuxapp-gcc
 print_ethaddr(const char *name, const struct ether_addr *eth_addr)
 ^
  CC rte_openssl_pmd.o
/tmp/RHEL76-64_K3.10.0_GCC4.8.5/x86_64-native-linuxapp-gcc/8cd789bf051b4e989daaa881ced5cf40/dpdk/drivers/net/enetc/enetc_ethdev.c: At top level:
cc1: warning: unrecognized command line option "-Wno-address-of-packed-member" [enabled by default]
make[6]: *** [enetc_ethdev.o] Error 1
make[5]: *** [enetc] Error 2
make[5]: *** Waiting for unfinished jobs....
  CC e1000_vf.o
  CC dpaa2_flow.o
  PMDINFO dpaa2_ethdev.o.pmd.c
  CC dpaa2_ethdev.o.pmd.o
--
  CC nitrox_sym_reqmgr.o
  AR librte_pmd_enic.a
  INSTALL-LIB librte_pmd_enic.a
  CC virtio_rxtx.o
  CC nitrox_qp.o
make[4]: *** [net] Error 2
make[4]: *** Waiting for unfinished jobs....
  CC virtio_cryptodev.o
  PMDINFO virtio_cryptodev.o.pmd.c
  CC virtio_cryptodev.o.pmd.o
  LD virtio_cryptodev.o
--
  PMDINFO dpaa2_sec_dpseci.o.pmd.c
  CC dpaa2_sec_dpseci.o.pmd.o
  LD dpaa2_sec_dpseci.o
  AR librte_pmd_dpaa2_sec.a
  INSTALL-LIB librte_pmd_dpaa2_sec.a
make[3]: *** [drivers] Error 2
make[2]: *** [all] Error 2
make[1]: *** [pre_install] Error 2
make: *** [install] Error 2


*Make Build Failed #10:
OS: FC30-64
Target: x86_64-native-linuxapp-clang
                                               ^~~~~~~~~~~~~~~~~~~~~~~~~~~~~~~~~~~~~~~
/tmp/FC30-64_K4.20_Clang8.0.0/x86_64-native-linuxapp-clang/8cd789bf051b4e989daaa881ced5cf40/dpdk/drivers/net/enetc/enetc_ethdev.c:128:58: note: passing argument to parameter 'eth_addr' here
print_ethaddr(const char *name, const struct ether_addr *eth_addr)
                                                         ^
4 warnings and 2 errors generated.
make[6]: *** [/tmp/FC30-64_K4.20_Clang8.0.0/x86_64-native-linuxapp-clang/8cd789bf051b4e989daaa881ced5cf40/dpdk/mk/internal/rte.compile-pre.mk:116: enetc_ethdev.o] Error 1
make[6]: *** Waiting for unfinished jobs....
  CC e1000_ich8lan.o
  CC ena_com.o
  CC e1000_logs.o
== Build drivers/net/failsafe
--
  AR librte_pmd_dpaa2.a
  INSTALL-LIB librte_pmd_dpaa2.a
  CC e1000_mac.o
== Build drivers/net/fm10k
  CC failsafe.o
make[5]: *** [/tmp/FC30-64_K4.20_Clang8.0.0/x86_64-native-linuxapp-clang/8cd789bf051b4e989daaa881ced5cf40/dpdk/mk/rte.subdir.mk:37: enetc] Error 2
make[5]: *** Waiting for unfinished jobs....
  CC enic_main.o
  PMDINFO enic_ethdev.o.pmd.c
  CC enic_ethdev.o.pmd.o
  LD enic_ethdev.o
--
  LD em_ethdev.o
  AR librte_pmd_e1000.a
  INSTALL-LIB librte_pmd_e1000.a
  AR librte_pmd_fm10k.a
  INSTALL-LIB librte_pmd_fm10k.a
make[4]: *** [/tmp/FC30-64_K4.20_Clang8.0.0/x86_64-native-linuxapp-clang/8cd789bf051b4e989daaa881ced5cf40/dpdk/mk/rte.subdir.mk:35: net] Error 2
make[3]: *** [/tmp/FC30-64_K4.20_Clang8.0.0/x86_64-native-linuxapp-clang/8cd789bf051b4e989daaa881ced5cf40/dpdk/mk/rte.sdkbuild.mk:46: drivers] Error 2
make[2]: *** [/tmp/FC30-64_K4.20_Clang8.0.0/x86_64-native-linuxapp-clang/8cd789bf051b4e989daaa881ced5cf40/dpdk/mk/rte.sdkroot.mk:99: all] Error 2
make[1]: *** [/tmp/FC30-64_K4.20_Clang8.0.0/x86_64-native-linuxapp-clang/8cd789bf051b4e989daaa881ced5cf40/dpdk/mk/rte.sdkinstall.mk:61: pre_install] Error 2
make: *** [/tmp/FC30-64_K4.20_Clang8.0.0/x86_64-native-linuxapp-clang/8cd789bf051b4e989daaa881ced5cf40/dpdk/mk/rte.sdkroot.mk:77: install] Error 2


*Make Build Failed #11:
OS: SUSE15-64
Target: x86_64-native-linuxapp-clang
                                               ^~~~~~~~~~~~~~~~~~~~~~~~~~~~~~~~~~~~~~~
/tmp/SUSE15-64_K4.12.14_Clang5.0.1/x86_64-native-linuxapp-clang/8cd789bf051b4e989daaa881ced5cf40/dpdk/drivers/net/enetc/enetc_ethdev.c:128:58: note: passing argument to parameter 'eth_addr' here
print_ethaddr(const char *name, const struct ether_addr *eth_addr)
                                                         ^
4 warnings and 2 errors generated.
make[6]: *** [/tmp/SUSE15-64_K4.12.14_Clang5.0.1/x86_64-native-linuxapp-clang/8cd789bf051b4e989daaa881ced5cf40/dpdk/mk/internal/rte.compile-pre.mk:116: enetc_ethdev.o] Error 1
make[6]: *** Waiting for unfinished jobs....
  CC ena_eth_com.o
  CC e1000_82571.o
== Build drivers/net/enic
  AR librte_pmd_axgbe.a
--
  CC e1000_82575.o
  CC enic_ethdev.o
  AR librte_pmd_ena.a
  INSTALL-LIB librte_pmd_ena.a
  CC elink.o
make[5]: *** [/tmp/SUSE15-64_K4.12.14_Clang5.0.1/x86_64-native-linuxapp-clang/8cd789bf051b4e989daaa881ced5cf40/dpdk/mk/rte.subdir.mk:35: enetc] Error 2
make[5]: *** Waiting for unfinished jobs....
== Build drivers/net/failsafe
  CC bnx2x_vfpf.o
  CC cxgbe_filter.o
  AR librte_pmd_bond.a
--
  PMDINFO igb_ethdev.o.pmd.c
  CC igb_ethdev.o.pmd.o
  LD igb_ethdev.o
  AR librte_pmd_e1000.a
  INSTALL-LIB librte_pmd_e1000.a
make[4]: *** [/tmp/SUSE15-64_K4.12.14_Clang5.0.1/x86_64-native-linuxapp-clang/8cd789bf051b4e989daaa881ced5cf40/dpdk/mk/rte.subdir.mk:35: net] Error 2
make[3]: *** [/tmp/SUSE15-64_K4.12.14_Clang5.0.1/x86_64-native-linuxapp-clang/8cd789bf051b4e989daaa881ced5cf40/dpdk/mk/rte.sdkbuild.mk:46: drivers] Error 2
make[2]: *** [/tmp/SUSE15-64_K4.12.14_Clang5.0.1/x86_64-native-linuxapp-clang/8cd789bf051b4e989daaa881ced5cf40/dpdk/mk/rte.sdkroot.mk:99: all] Error 2
make[1]: *** [/tmp/SUSE15-64_K4.12.14_Clang5.0.1/x86_64-native-linuxapp-clang/8cd789bf051b4e989daaa881ced5cf40/dpdk/mk/rte.sdkinstall.mk:61: pre_install] Error 2
make: *** [/tmp/SUSE15-64_K4.12.14_Clang5.0.1/x86_64-native-linuxapp-clang/8cd789bf051b4e989daaa881ced5cf40/dpdk/mk/rte.sdkroot.mk:77: install] Error 2


*Make Build Failed #12:
OS: UB1604-64
Target: x86_64-native-linuxapp-gcc
  AR librte_pmd_ena.a
  CC cxgbe_filter.o
/tmp/UB1604-64_K4.4.0_GCC5.4.0/x86_64-native-linuxapp-gcc/8cd789bf051b4e989daaa881ced5cf40/dpdk/drivers/net/enetc/enetc_ethdev.c: At top level:
cc1: warning: unrecognized command line option ‘-Wno-address-of-packed-member’
  INSTALL-LIB librte_pmd_ena.a
/tmp/UB1604-64_K4.4.0_GCC5.4.0/x86_64-native-linuxapp-gcc/8cd789bf051b4e989daaa881ced5cf40/dpdk/mk/internal/rte.compile-pre.mk:114: recipe for target 'enetc_ethdev.o' failed
make[6]: *** [enetc_ethdev.o] Error 1
/tmp/UB1604-64_K4.4.0_GCC5.4.0/x86_64-native-linuxapp-gcc/8cd789bf051b4e989daaa881ced5cf40/dpdk/mk/rte.subdir.mk:35: recipe for target 'enetc' failed
make[5]: *** [enetc] Error 2
make[5]: *** Waiting for unfinished jobs....
  CC dpaa2_mux.o
  CC failsafe.o
  CC cxgbe_flow.o
  CC e1000_api.o
--
  AR librte_pmd_crypto_scheduler.a
  INSTALL-LIB librte_pmd_crypto_scheduler.a
  LD igb_ethdev.o
  AR librte_pmd_e1000.a
  INSTALL-LIB librte_pmd_e1000.a
/tmp/UB1604-64_K4.4.0_GCC5.4.0/x86_64-native-linuxapp-gcc/8cd789bf051b4e989daaa881ced5cf40/dpdk/mk/rte.subdir.mk:35: recipe for target 'net' failed
make[4]: *** [net] Error 2
make[4]: *** Waiting for unfinished jobs....
  CC dpaa_sec.o
  CC dpaa2_sec_dpseci.o
  CC mc/dpseci.o
  CC caam_jr.o
--
  PMDINFO dpaa2_sec_dpseci.o.pmd.c
  CC dpaa2_sec_dpseci.o.pmd.o
  LD dpaa2_sec_dpseci.o
  AR librte_pmd_dpaa2_sec.a
  INSTALL-LIB librte_pmd_dpaa2_sec.a
/tmp/UB1604-64_K4.4.0_GCC5.4.0/x86_64-native-linuxapp-gcc/8cd789bf051b4e989daaa881ced5cf40/dpdk/mk/rte.sdkbuild.mk:46: recipe for target 'drivers' failed
make[3]: *** [drivers] Error 2
/tmp/UB1604-64_K4.4.0_GCC5.4.0/x86_64-native-linuxapp-gcc/8cd789bf051b4e989daaa881ced5cf40/dpdk/mk/rte.sdkroot.mk:98: recipe for target 'all' failed
make[2]: *** [all] Error 2
/tmp/UB1604-64_K4.4.0_GCC5.4.0/x86_64-native-linuxapp-gcc/8cd789bf051b4e989daaa881ced5cf40/dpdk/mk/rte.sdkinstall.mk:60: recipe for target 'pre_install' failed
make[1]: *** [pre_install] Error 2
/tmp/UB1604-64_K4.4.0_GCC5.4.0/x86_64-native-linuxapp-gcc/8cd789bf051b4e989daaa881ced5cf40/dpdk/mk/rte.sdkroot.mk:77: recipe for target 'install' failed
make: *** [install] Error 2


*Make Build Failed #13:
OS: UB1804-64
Target: x86_64-native-linuxapp-gcc
/tmp/UB1804-64_K4.15.0_GCC7.3.0/x86_64-native-linuxapp-gcc/8cd789bf051b4e989daaa881ced5cf40/dpdk/drivers/net/enetc/enetc_ethdev.c:128:1: note: expected ‘const struct ether_addr *’ but argument is of type ‘const struct ether_addr *’
 print_ethaddr(const char *name, const struct ether_addr *eth_addr)
 ^~~~~~~~~~~~~
/tmp/UB1804-64_K4.15.0_GCC7.3.0/x86_64-native-linuxapp-gcc/8cd789bf051b4e989daaa881ced5cf40/dpdk/drivers/net/enetc/enetc_ethdev.c: At top level:
cc1: warning: unrecognized command line option ‘-Wno-address-of-packed-member’
/tmp/UB1804-64_K4.15.0_GCC7.3.0/x86_64-native-linuxapp-gcc/8cd789bf051b4e989daaa881ced5cf40/dpdk/mk/internal/rte.compile-pre.mk:114: recipe for target 'enetc_ethdev.o' failed
make[6]: *** [enetc_ethdev.o] Error 1
make[6]: *** Waiting for unfinished jobs....
  CC e1000_82541.o
  PMDINFO dpaa_ethdev.o.pmd.c
  AR librte_pmd_bond.a
  CC dpaa_ethdev.o.pmd.o
--
== Build drivers/net/enic
  PMDINFO cxgbe_ethdev.o.pmd.c
  CC cxgbe_ethdev.o.pmd.o
  CC dpaa_rxtx.o
  LD cxgbe_ethdev.o
/tmp/UB1804-64_K4.15.0_GCC7.3.0/x86_64-native-linuxapp-gcc/8cd789bf051b4e989daaa881ced5cf40/dpdk/mk/rte.subdir.mk:35: recipe for target 'enetc' failed
make[5]: *** [enetc] Error 2
make[5]: *** Waiting for unfinished jobs....
  CC cxgbevf_ethdev.o
  CC cxgbe_main.o
  CC cxgbevf_main.o
  CC e1000_82543.o
--
  LD em_ethdev.o
  AR librte_pmd_nitrox.a
  INSTALL-LIB librte_pmd_nitrox.a
  AR librte_pmd_e1000.a
  INSTALL-LIB librte_pmd_e1000.a
/tmp/UB1804-64_K4.15.0_GCC7.3.0/x86_64-native-linuxapp-gcc/8cd789bf051b4e989daaa881ced5cf40/dpdk/mk/rte.subdir.mk:35: recipe for target 'net' failed
make[4]: *** [net] Error 2
/tmp/UB1804-64_K4.15.0_GCC7.3.0/x86_64-native-linuxapp-gcc/8cd789bf051b4e989daaa881ced5cf40/dpdk/mk/rte.sdkbuild.mk:46: recipe for target 'drivers' failed
make[3]: *** [drivers] Error 2
/tmp/UB1804-64_K4.15.0_GCC7.3.0/x86_64-native-linuxapp-gcc/8cd789bf051b4e989daaa881ced5cf40/dpdk/mk/rte.sdkroot.mk:98: recipe for target 'all' failed
make[2]: *** [all] Error 2
/tmp/UB1804-64_K4.15.0_GCC7.3.0/x86_64-native-linuxapp-gcc/8cd789bf051b4e989daaa881ced5cf40/dpdk/mk/rte.sdkinstall.mk:60: recipe for target 'pre_install' failed
make[1]: *** [pre_install] Error 2
/tmp/UB1804-64_K4.15.0_GCC7.3.0/x86_64-native-linuxapp-gcc/8cd789bf051b4e989daaa881ced5cf40/dpdk/mk/rte.sdkroot.mk:77: recipe for target 'install' failed
make: *** [install] Error 2


*Make Build Failed #14:
OS: CENTOS76-64
Target: x86_64-native-linuxapp-gcc+debug
/tmp/CENTOS76-64_K3.10.0_GCC4.8.5/x86_64-native-linuxapp-gcc+debug/8cd789bf051b4e989daaa881ced5cf40/dpdk/drivers/net/enetc/enetc_ethdev.c:128:1: note: expected ‘const struct ether_addr *’ but argument is of type ‘const struct ether_addr *’
 print_ethaddr(const char *name, const struct ether_addr *eth_addr)
 ^
/tmp/CENTOS76-64_K3.10.0_GCC4.8.5/x86_64-native-linuxapp-gcc+debug/8cd789bf051b4e989daaa881ced5cf40/dpdk/drivers/net/enetc/enetc_ethdev.c: At top level:
cc1: warning: unrecognized command line option "-Wno-address-of-packed-member" [enabled by default]
make[6]: *** [enetc_ethdev.o] Error 1
make[5]: *** [enetc] Error 2
make[5]: *** Waiting for unfinished jobs....
  CC e1000_82542.o
  CC enic_ethdev.o
  CC e1000_82543.o
  CC ena_com.o
--
  PMDINFO hinic_pmd_ethdev.o.pmd.c
  CC hinic_pmd_ethdev.o.pmd.o
  LD hinic_pmd_ethdev.o
  AR librte_pmd_hinic.a
  INSTALL-LIB librte_pmd_hinic.a
make[4]: *** [net] Error 2
make[3]: *** [drivers] Error 2
make[2]: *** [all] Error 2
make[1]: *** [pre_install] Error 2
make: *** [install] Error 2


*Make Build Failed #15:
OS: CENTOS76-64
Target: x86_64-native-linuxapp-gcc
/tmp/CENTOS76-64_K3.10.0_GCC4.8.5/x86_64-native-linuxapp-gcc/8cd789bf051b4e989daaa881ced5cf40/dpdk/drivers/net/enetc/enetc_ethdev.c:128:1: note: expected ‘const struct ether_addr *’ but argument is of type ‘const struct ether_addr *’
 print_ethaddr(const char *name, const struct ether_addr *eth_addr)
 ^
/tmp/CENTOS76-64_K3.10.0_GCC4.8.5/x86_64-native-linuxapp-gcc/8cd789bf051b4e989daaa881ced5cf40/dpdk/drivers/net/enetc/enetc_ethdev.c: At top level:
cc1: warning: unrecognized command line option "-Wno-address-of-packed-member" [enabled by default]
make[6]: *** [enetc_ethdev.o] Error 1
make[5]: *** [enetc] Error 2
make[5]: *** Waiting for unfinished jobs....
  CC ena_com.o
  CC e1000_i210.o
  CC nitrox_sym_reqmgr.o
  CC elink.o
--
  LD igb_ethdev.o
  AR librte_pmd_e1000.a
  INSTALL-LIB librte_pmd_e1000.a
  AR librte_pmd_bnx2x.a
  INSTALL-LIB librte_pmd_bnx2x.a
make[4]: *** [net] Error 2
make[3]: *** [drivers] Error 2
make[2]: *** [all] Error 2
make[1]: *** [pre_install] Error 2
make: *** [install] Error 2


*Make Build Failed #16:
OS: CENTOS76-64
Target: x86_64-native-linuxapp-clang
/tmp/CENTOS76-64_K3.10.0_Clang3.4.2/x86_64-native-linuxapp-clang/8cd789bf051b4e989daaa881ced5cf40/dpdk/drivers/net/enetc/enetc_ethdev.c:128:58: note: passing argument to parameter 'eth_addr' here
print_ethaddr(const char *name, const struct ether_addr *eth_addr)
                                                         ^
  AR librte_pmd_dpaa_sec.a
4 warnings and 1 error generated.
make[6]: *** [enetc_ethdev.o] Error 1
make[5]: *** [enetc] Error 2
make[5]: *** Waiting for unfinished jobs....
  CC ena_eth_com.o
  INSTALL-LIB librte_pmd_dpaa_sec.a
  AR librte_pmd_dpaa2_sec.a
  CC dpaa2_ethdev.o
--
  PMDINFO igb_ethdev.o.pmd.c
  CC igb_ethdev.o.pmd.o
  LD igb_ethdev.o
  AR librte_pmd_e1000.a
  INSTALL-LIB librte_pmd_e1000.a
make[4]: *** [net] Error 2
make[3]: *** [drivers] Error 2
make[2]: *** [all] Error 2
make[1]: *** [pre_install] Error 2
make: *** [install] Error 2


*Make Build Failed #17:
OS: CENTOS76-64
Target: x86_64-native-linuxapp-gcc+shared
/tmp/CENTOS76-64_K3.10.0_GCC4.8.5/x86_64-native-linuxapp-gcc+shared/8cd789bf051b4e989daaa881ced5cf40/dpdk/drivers/net/enetc/enetc_ethdev.c:128:1: note: expected ‘const struct ether_addr *’ but argument is of type ‘const struct ether_addr *’
 print_ethaddr(const char *name, const struct ether_addr *eth_addr)
 ^
/tmp/CENTOS76-64_K3.10.0_GCC4.8.5/x86_64-native-linuxapp-gcc+shared/8cd789bf051b4e989daaa881ced5cf40/dpdk/drivers/net/enetc/enetc_ethdev.c: At top level:
cc1: warning: unrecognized command line option "-Wno-address-of-packed-member" [enabled by default]
make[6]: *** [enetc_ethdev.o] Error 1
make[5]: *** [enetc] Error 2
make[5]: *** Waiting for unfinished jobs....
  CC l2t.o
  CC mc/dpkg.o
  CC failsafe.o
  CC t4vf_hw.o
--
  LD igb_ethdev.o
  LD librte_pmd_fm10k.so.1.1
  LD librte_pmd_e1000.so.1.1
  INSTALL-LIB librte_pmd_fm10k.so.1.1
  INSTALL-LIB librte_pmd_e1000.so.1.1
make[4]: *** [net] Error 2
make[3]: *** [drivers] Error 2
make[2]: *** [all] Error 2
make[1]: *** [pre_install] Error 2
make: *** [install] Error 2


*Make Build Failed #18:
OS: CENTOS76-64
Target: x86_64-native-linuxapp-icc
/tmp/CENTOS76-64_K3.10.0_ICC19.0.0/x86_64-native-linuxapp-icc/8cd789bf051b4e989daaa881ced5cf40/dpdk/drivers/net/enetc/enetc_ethdev.c(172): warning #167: argument of type "const struct ether_addr *" is incompatible with parameter of type "const struct ether_addr *"
  		print_ethaddr("New address: ", (const struct ether_addr *)hw->mac.addr);
  		                               ^

compilation aborted for /tmp/CENTOS76-64_K3.10.0_ICC19.0.0/x86_64-native-linuxapp-icc/8cd789bf051b4e989daaa881ced5cf40/dpdk/drivers/net/enetc/enetc_ethdev.c (code 2)
make[6]: *** [enetc_ethdev.o] Error 2
make[5]: *** [enetc] Error 2
make[5]: *** Waiting for unfinished jobs....
  CC ena_eth_com.o
  CC e1000_82575.o
  CC clip_tbl.o
  CC dpaa2_sec_dpseci.o
--
  INSTALL-LIB librte_pmd_nitrox.a
  AR librte_pmd_caam_jr.a
  INSTALL-LIB librte_pmd_caam_jr.a
  AR librte_pmd_e1000.a
  INSTALL-LIB librte_pmd_e1000.a
make[4]: *** [net] Error 2
make[3]: *** [drivers] Error 2
make[2]: *** [all] Error 2
make[1]: *** [pre_install] Error 2
make: *** [install] Error 2

*Meson Build Failed #1:
OS: FC30-64
Target:build-gcc-static
FAILED: drivers/a715181@@tmp_rte_pmd_enetc@sta/net_enetc_enetc_ethdev.c.o 
gcc -Idrivers/a715181@@tmp_rte_pmd_enetc@sta -Idrivers -I../drivers -Idrivers/net/enetc -I../drivers/net/enetc -I../drivers/net/enetc/base -Ilib/librte_ethdev -I../lib/librte_ethdev -I. -I../ -Iconfig -I../config -Ilib/librte_eal/common/include -I../lib/librte_eal/common/include -I../lib/librte_eal/linux/eal/include -Ilib/librte_eal/common -I../lib/librte_eal/common -Ilib/librte_eal/common/include/arch/x86 -I../lib/librte_eal/common/include/arch/x86 -Ilib/librte_eal -I../lib/librte_eal -Ilib/librte_kvargs -I../lib/librte_kvargs -Ilib/librte_net -I../lib/librte_net -Ilib/librte_mbuf -I../lib/librte_mbuf -Ilib/librte_mempool -I../lib/librte_mempool -Ilib/librte_ring -I../lib/librte_ring -Ilib/librte_meter -I../lib/librte_meter -Idrivers/bus/pci -I../drivers/bus/pci -I../drivers/bus/pci/linux -Ilib/librte_pci -I../lib/librte_pci -Idrivers/bus/vdev -I../drivers/bus/vdev -fdiagnostics-color=always -pipe -D_FILE_OFFSET_BITS=64 -Wall -Winvalid-pch -Werror -O3 -include rte_config.h -Wunused-parameter -Wsign-compare -Wcast-qual -Wno-address-of-packed-member -D_GNU_SOURCE -fPIC -march=native -mno-avx512f -Wno-format-truncation -MD -MQ 'drivers/a715181@@tmp_rte_pmd_enetc@sta/net_enetc_enetc_ethdev.c.o' -MF 'drivers/a715181@@tmp_rte_pmd_enetc@sta/net_enetc_enetc_ethdev.c.o.d' -o 'drivers/a715181@@tmp_rte_pmd_enetc@sta/net_enetc_enetc_ethdev.c.o' -c ../drivers/net/enetc/enetc_ethdev.c
../drivers/net/enetc/enetc_ethdev.c:128:46: error: ‘struct ether_addr’ declared inside parameter list will not be visible outside of this definition or declaration [-Werror]
  128 | print_ethaddr(const char *name, const struct ether_addr *eth_addr)
      |                                              ^~~~~~~~~~
../drivers/net/enetc/enetc_ethdev.c: In function ‘print_ethaddr’:
../drivers/net/enetc/enetc_ethdev.c:130:11: error: ‘ETHER_ADDR_FMT_SIZE’ undeclared (first use in this function); did you mean ‘RTE_ETHER_ADDR_FMT_SIZE’?
  130 |  char buf[ETHER_ADDR_FMT_SIZE];
      |           ^~~~~~~~~~~~~~~~~~~
      |           RTE_ETHER_ADDR_FMT_SIZE
../drivers/net/enetc/enetc_ethdev.c:130:11: note: each undeclared identifier is reported only once for each function it appears in
../drivers/net/enetc/enetc_ethdev.c:131:2: error: implicit declaration of function ‘ether_format_addr’; did you mean ‘rte_ether_format_addr’? [-Werror=implicit-function-declaration]
  131 |  ether_format_addr(buf, ETHER_ADDR_FMT_SIZE, eth_addr);
      |  ^~~~~~~~~~~~~~~~~
      |  rte_ether_format_addr
../drivers/net/enetc/enetc_ethdev.c:130:7: error: unused variable ‘buf’ [-Werror=unused-variable]
  130 |  char buf[ETHER_ADDR_FMT_SIZE];
      |       ^~~
../drivers/net/enetc/enetc_ethdev.c: In function ‘enetc_hardware_init’:
../drivers/net/enetc/enetc_ethdev.c:172:34: error: passing argument 2 of ‘print_ethaddr’ from incompatible pointer type [-Werror=incompatible-pointer-types]
  172 |   print_ethaddr("New address: ", (const struct ether_addr *)hw->mac.addr);
      |                                  ^~~~~~~~~~~~~~~~~~~~~~~~~~~~~~~~~~~~~~~
      |                                  |
      |                                  const struct ether_addr *
../drivers/net/enetc/enetc_ethdev.c:128:58: note: expected ‘const struct ether_addr *’ but argument is of type ‘const struct ether_addr *’
  128 | print_ethaddr(const char *name, const struct ether_addr *eth_addr)
      |                                 ~~~~~~~~~~~~~~~~~~~~~~~~~^~~~~~~~
cc1: all warnings being treated as errors
[704/1861] Compiling C object 'drivers/a715181@@tmp_rte_pmd_ena@sta/net_ena_base_ena_com.c.o'.
[705/1861] Compiling C object 'drivers/a715181@@tmp_rte_pmd_enetc@sta/net_enetc_enetc_rxtx.c.o'.
[706/1861] Compiling C object 'drivers/a715181@@tmp_rte_pmd_e1000@sta/net_e1000_em_rxtx.c.o'.
[707/1861] Compiling C object 'drivers/a715181@@tmp_rte_pmd_enic@sta/net_enic_base_vnic_rq.c.o'.
[708/1861] Compiling C object 'drivers/a715181@@tmp_rte_pmd_e1000@sta/net_e1000_igb_ethdev.c.o'.
[709/1861] Compiling C object 'drivers/a715181@@tmp_rte_pmd_ena@sta/net_ena_ena_ethdev.c.o'.
[710/1861] Compiling C object 'drivers/a715181@@tmp_rte_pmd_e1000@sta/net_e1000_igb_rxtx.c.o'.
ninja: build stopped: subcommand failed




*Meson Build Failed #2:
OS: SUSE15-64
Target:build-gcc-static
FAILED: drivers/a715181@@tmp_rte_pmd_enetc@sta/net_enetc_enetc_ethdev.c.o 
gcc -Idrivers/a715181@@tmp_rte_pmd_enetc@sta -Idrivers -I../drivers -Idrivers/net/enetc -I../drivers/net/enetc -I../drivers/net/enetc/base -Ilib/librte_ethdev -I../lib/librte_ethdev -I. -I../ -Iconfig -I../config -Ilib/librte_eal/common/include -I../lib/librte_eal/common/include -I../lib/librte_eal/linux/eal/include -Ilib/librte_eal/common -I../lib/librte_eal/common -Ilib/librte_eal/common/include/arch/x86 -I../lib/librte_eal/common/include/arch/x86 -Ilib/librte_eal -I../lib/librte_eal -Ilib/librte_kvargs -I../lib/librte_kvargs -Ilib/librte_net -I../lib/librte_net -Ilib/librte_mbuf -I../lib/librte_mbuf -Ilib/librte_mempool -I../lib/librte_mempool -Ilib/librte_ring -I../lib/librte_ring -Ilib/librte_meter -I../lib/librte_meter -Idrivers/bus/pci -I../drivers/bus/pci -I../drivers/bus/pci/linux -Ilib/librte_pci -I../lib/librte_pci -Idrivers/bus/vdev -I../drivers/bus/vdev -fdiagnostics-color=always -pipe -D_FILE_OFFSET_BITS=64 -Wall -Winvalid-pch -Werror -O3 -include rte_config.h -Wunused-parameter -Wsign-compare -Wcast-qual -D_GNU_SOURCE -fPIC -march=native -Wno-format-truncation -MD -MQ 'drivers/a715181@@tmp_rte_pmd_enetc@sta/net_enetc_enetc_ethdev.c.o' -MF 'drivers/a715181@@tmp_rte_pmd_enetc@sta/net_enetc_enetc_ethdev.c.o.d' -o 'drivers/a715181@@tmp_rte_pmd_enetc@sta/net_enetc_enetc_ethdev.c.o' -c ../drivers/net/enetc/enetc_ethdev.c
../drivers/net/enetc/enetc_ethdev.c:128:46: error: ‘struct ether_addr’ declared inside parameter list will not be visible outside of this definition or declaration [-Werror]
 print_ethaddr(const char *name, const struct ether_addr *eth_addr)
                                              ^~~~~~~~~~
../drivers/net/enetc/enetc_ethdev.c: In function ‘print_ethaddr’:
../drivers/net/enetc/enetc_ethdev.c:130:11: error: ‘ETHER_ADDR_FMT_SIZE’ undeclared (first use in this function); did you mean ‘RTE_ETHER_ADDR_FMT_SIZE’?
  char buf[ETHER_ADDR_FMT_SIZE];
           ^~~~~~~~~~~~~~~~~~~
           RTE_ETHER_ADDR_FMT_SIZE
../drivers/net/enetc/enetc_ethdev.c:130:11: note: each undeclared identifier is reported only once for each function it appears in
../drivers/net/enetc/enetc_ethdev.c:131:2: error: implicit declaration of function ‘ether_format_addr’; did you mean ‘rte_ether_format_addr’? [-Werror=implicit-function-declaration]
  ether_format_addr(buf, ETHER_ADDR_FMT_SIZE, eth_addr);
  ^~~~~~~~~~~~~~~~~
  rte_ether_format_addr
../drivers/net/enetc/enetc_ethdev.c:130:7: error: unused variable ‘buf’ [-Werror=unused-variable]
  char buf[ETHER_ADDR_FMT_SIZE];
       ^~~
../drivers/net/enetc/enetc_ethdev.c: In function ‘enetc_hardware_init’:
../drivers/net/enetc/enetc_ethdev.c:172:34: error: passing argument 2 of ‘print_ethaddr’ from incompatible pointer type [-Werror=incompatible-pointer-types]
   print_ethaddr("New address: ", (const struct ether_addr *)hw->mac.addr);
                                  ^
../drivers/net/enetc/enetc_ethdev.c:128:1: note: expected ‘const struct ether_addr *’ but argument is of type ‘const struct ether_addr *’
 print_ethaddr(const char *name, const struct ether_addr *eth_addr)
 ^~~~~~~~~~~~~
cc1: all warnings being treated as errors
[719/1908] Generating symbol file 'drivers/a715181@@rte_pmd_dpaa2@sha/librte_pmd_dpaa2.so.2.1.symbols'.
[720/1908] Compiling C object 'drivers/a715181@@tmp_rte_pmd_ena@sta/net_ena_base_ena_com.c.o'.
[721/1908] Compiling C object 'drivers/a715181@@tmp_rte_pmd_enic@sta/net_enic_base_vnic_rq.c.o'.
[722/1908] Compiling C object 'drivers/a715181@@tmp_rte_pmd_e1000@sta/net_e1000_igb_ethdev.c.o'.
[723/1908] Compiling C object 'drivers/a715181@@tmp_rte_pmd_enic@sta/net_enic_base_vnic_cq.c.o'.
[724/1908] Compiling C object 'drivers/a715181@@tmp_rte_pmd_e1000@sta/net_e1000_igb_rxtx.c.o'.
[725/1908] Compiling C object 'drivers/a715181@@tmp_rte_pmd_ena@sta/net_ena_ena_ethdev.c.o'.
ninja: build stopped: subcommand failed




*Meson Build Failed #3:
OS: UB1604-32
Target:build-gcc-static
FAILED: drivers/a715181@@tmp_rte_pmd_enetc@sta/net_enetc_enetc_ethdev.c.o 
gcc -Idrivers/a715181@@tmp_rte_pmd_enetc@sta -Idrivers -I../drivers -Idrivers/net/enetc -I../drivers/net/enetc -I../drivers/net/enetc/base -Ilib/librte_ethdev -I../lib/librte_ethdev -I. -I../ -Iconfig -I../config -Ilib/librte_eal/common/include -I../lib/librte_eal/common/include -I../lib/librte_eal/linux/eal/include -Ilib/librte_eal/common -I../lib/librte_eal/common -Ilib/librte_eal/common/include/arch/x86 -I../lib/librte_eal/common/include/arch/x86 -Ilib/librte_eal -I../lib/librte_eal -Ilib/librte_kvargs -I../lib/librte_kvargs -Ilib/librte_net -I../lib/librte_net -Ilib/librte_mbuf -I../lib/librte_mbuf -Ilib/librte_mempool -I../lib/librte_mempool -Ilib/librte_ring -I../lib/librte_ring -Ilib/librte_meter -I../lib/librte_meter -Idrivers/bus/pci -I../drivers/bus/pci -I../drivers/bus/pci/linux -Ilib/librte_pci -I../lib/librte_pci -Idrivers/bus/vdev -I../drivers/bus/vdev -fdiagnostics-color=always -pipe -D_FILE_OFFSET_BITS=64 -Wall -Winvalid-pch -Werror -O3 -include rte_config.h -Wunused-parameter -Wsign-compare -Wcast-qual -Wno-pointer-to-int-cast -D_GNU_SOURCE -fPIC -march=native -MD -MQ 'drivers/a715181@@tmp_rte_pmd_enetc@sta/net_enetc_enetc_ethdev.c.o' -MF 'drivers/a715181@@tmp_rte_pmd_enetc@sta/net_enetc_enetc_ethdev.c.o.d' -o 'drivers/a715181@@tmp_rte_pmd_enetc@sta/net_enetc_enetc_ethdev.c.o' -c ../drivers/net/enetc/enetc_ethdev.c
../drivers/net/enetc/enetc_ethdev.c:128:46: error: ‘struct ether_addr’ declared inside parameter list [-Werror]
 print_ethaddr(const char *name, const struct ether_addr *eth_addr)
                                              ^
../drivers/net/enetc/enetc_ethdev.c:128:46: error: its scope is only this definition or declaration, which is probably not what you want [-Werror]
../drivers/net/enetc/enetc_ethdev.c: In function ‘print_ethaddr’:
../drivers/net/enetc/enetc_ethdev.c:130:11: error: ‘ETHER_ADDR_FMT_SIZE’ undeclared (first use in this function)
  char buf[ETHER_ADDR_FMT_SIZE];
           ^
../drivers/net/enetc/enetc_ethdev.c:130:11: note: each undeclared identifier is reported only once for each function it appears in
../drivers/net/enetc/enetc_ethdev.c:131:2: error: implicit declaration of function ‘ether_format_addr’ [-Werror=implicit-function-declaration]
  ether_format_addr(buf, ETHER_ADDR_FMT_SIZE, eth_addr);
  ^
../drivers/net/enetc/enetc_ethdev.c:130:7: error: unused variable ‘buf’ [-Werror=unused-variable]
  char buf[ETHER_ADDR_FMT_SIZE];
       ^
../drivers/net/enetc/enetc_ethdev.c: In function ‘enetc_hardware_init’:
../drivers/net/enetc/enetc_ethdev.c:172:34: error: passing argument 2 of ‘print_ethaddr’ from incompatible pointer type [-Werror=incompatible-pointer-types]
   print_ethaddr("New address: ", (const struct ether_addr *)hw->mac.addr);
                                  ^
../drivers/net/enetc/enetc_ethdev.c:128:1: note: expected ‘const struct ether_addr *’ but argument is of type ‘const struct ether_addr *’
 print_ethaddr(const char *name, const struct ether_addr *eth_addr)
 ^
cc1: all warnings being treated as errors
[705/1714] Compiling C object 'drivers/a715181@@tmp_rte_pmd_enetc@sta/net_enetc_enetc_rxtx.c.o'.
[706/1714] Compiling C object 'drivers/a715181@@tmp_rte_pmd_enic@sta/net_enic_base_vnic_cq.c.o'.
[707/1714] Compiling C object 'drivers/a715181@@tmp_rte_pmd_e1000@sta/net_e1000_igb_rxtx.c.o'.
[708/1714] Compiling C object 'drivers/a715181@@tmp_rte_pmd_e1000@sta/net_e1000_igb_ethdev.c.o'.
[709/1714] Compiling C object 'drivers/a715181@@tmp_rte_pmd_ena@sta/net_ena_ena_ethdev.c.o'.
ninja: build stopped: subcommand failed




*Meson Build Failed #4:
OS: UB1804-64
Target:build-gcc-static
FAILED: drivers/a715181@@tmp_rte_pmd_enetc@sta/net_enetc_enetc_ethdev.c.o 
gcc -Idrivers/a715181@@tmp_rte_pmd_enetc@sta -Idrivers -I../drivers -Idrivers/net/enetc -I../drivers/net/enetc -I../drivers/net/enetc/base -Ilib/librte_ethdev -I../lib/librte_ethdev -I. -I../ -Iconfig -I../config -Ilib/librte_eal/common/include -I../lib/librte_eal/common/include -I../lib/librte_eal/linux/eal/include -Ilib/librte_eal/common -I../lib/librte_eal/common -Ilib/librte_eal/common/include/arch/x86 -I../lib/librte_eal/common/include/arch/x86 -Ilib/librte_eal -I../lib/librte_eal -Ilib/librte_kvargs -I../lib/librte_kvargs -Ilib/librte_net -I../lib/librte_net -Ilib/librte_mbuf -I../lib/librte_mbuf -Ilib/librte_mempool -I../lib/librte_mempool -Ilib/librte_ring -I../lib/librte_ring -Ilib/librte_meter -I../lib/librte_meter -Idrivers/bus/pci -I../drivers/bus/pci -I../drivers/bus/pci/linux -Ilib/librte_pci -I../lib/librte_pci -Idrivers/bus/vdev -I../drivers/bus/vdev -fdiagnostics-color=always -pipe -D_FILE_OFFSET_BITS=64 -Wall -Winvalid-pch -Werror -O3 -include rte_config.h -Wunused-parameter -Wsign-compare -Wcast-qual -D_GNU_SOURCE -fPIC -march=native -mno-avx512f -Wno-format-truncation -MD -MQ 'drivers/a715181@@tmp_rte_pmd_enetc@sta/net_enetc_enetc_ethdev.c.o' -MF 'drivers/a715181@@tmp_rte_pmd_enetc@sta/net_enetc_enetc_ethdev.c.o.d' -o 'drivers/a715181@@tmp_rte_pmd_enetc@sta/net_enetc_enetc_ethdev.c.o' -c ../drivers/net/enetc/enetc_ethdev.c
../drivers/net/enetc/enetc_ethdev.c:128:46: error: ‘struct ether_addr’ declared inside parameter list will not be visible outside of this definition or declaration [-Werror]
 print_ethaddr(const char *name, const struct ether_addr *eth_addr)
                                              ^~~~~~~~~~
../drivers/net/enetc/enetc_ethdev.c: In function ‘print_ethaddr’:
../drivers/net/enetc/enetc_ethdev.c:130:11: error: ‘ETHER_ADDR_FMT_SIZE’ undeclared (first use in this function); did you mean ‘RTE_ETHER_ADDR_FMT_SIZE’?
  char buf[ETHER_ADDR_FMT_SIZE];
           ^~~~~~~~~~~~~~~~~~~
           RTE_ETHER_ADDR_FMT_SIZE
../drivers/net/enetc/enetc_ethdev.c:130:11: note: each undeclared identifier is reported only once for each function it appears in
../drivers/net/enetc/enetc_ethdev.c:131:2: error: implicit declaration of function ‘ether_format_addr’; did you mean ‘rte_ether_format_addr’? [-Werror=implicit-function-declaration]
  ether_format_addr(buf, ETHER_ADDR_FMT_SIZE, eth_addr);
  ^~~~~~~~~~~~~~~~~
  rte_ether_format_addr
../drivers/net/enetc/enetc_ethdev.c:130:7: error: unused variable ‘buf’ [-Werror=unused-variable]
  char buf[ETHER_ADDR_FMT_SIZE];
       ^~~
../drivers/net/enetc/enetc_ethdev.c: In function ‘enetc_hardware_init’:
../drivers/net/enetc/enetc_ethdev.c:172:34: error: passing argument 2 of ‘print_ethaddr’ from incompatible pointer type [-Werror=incompatible-pointer-types]
   print_ethaddr("New address: ", (const struct ether_addr *)hw->mac.addr);
                                  ^
../drivers/net/enetc/enetc_ethdev.c:128:1: note: expected ‘const struct ether_addr *’ but argument is of type ‘const struct ether_addr *’
 print_ethaddr(const char *name, const struct ether_addr *eth_addr)
 ^~~~~~~~~~~~~
cc1: all warnings being treated as errors
[720/1868] Compiling C object 'drivers/a715181@@tmp_rte_pmd_e1000@sta/net_e1000_igb_ethdev.c.o'.
[721/1868] Compiling C object 'drivers/a715181@@tmp_rte_pmd_ena@sta/net_ena_base_ena_com.c.o'.
[722/1868] Compiling C object 'drivers/a715181@@tmp_rte_pmd_e1000@sta/net_e1000_igb_rxtx.c.o'.
[723/1868] Compiling C object 'drivers/a715181@@tmp_rte_pmd_enic@sta/net_enic_base_vnic_rq.c.o'.
[724/1868] Compiling C object 'drivers/a715181@@tmp_rte_pmd_ena@sta/net_ena_ena_ethdev.c.o'.
ninja: build stopped: subcommand failed



DPDK STV team

                 reply	other threads:[~2019-10-21  7:52 UTC|newest]

Thread overview: [no followups] expand[flat|nested]  mbox.gz  Atom feed

Reply instructions:

You may reply publicly to this message via plain-text email
using any one of the following methods:

* Save the following mbox file, import it into your mail client,
  and reply-to-all from there: mbox

  Avoid top-posting and favor interleaved quoting:
  https://en.wikipedia.org/wiki/Posting_style#Interleaved_style

* Reply using the --to, --cc, and --in-reply-to
  switches of git-send-email(1):

  git send-email \
    --in-reply-to='ee68f5$8bs461@orsmga001.jf.intel.com' \
    --to=sys_stv@intel.com \
    --cc=test-report@dpdk.org \
    /path/to/YOUR_REPLY

  https://kernel.org/pub/software/scm/git/docs/git-send-email.html

* If your mail client supports setting the In-Reply-To header
  via mailto: links, try the mailto: link

automatic DPDK test reports

This inbox may be cloned and mirrored by anyone:

	git clone --mirror https://inbox.dpdk.org/test-report/0 test-report/git/0.git

	# If you have public-inbox 1.1+ installed, you may
	# initialize and index your mirror using the following commands:
	public-inbox-init -V2 test-report test-report/ https://inbox.dpdk.org/test-report \
		test-report@dpdk.org
	public-inbox-index test-report

Example config snippet for mirrors.
Newsgroup available over NNTP:
	nntp://inbox.dpdk.org/inbox.dpdk.test-report


AGPL code for this site: git clone https://public-inbox.org/public-inbox.git