automatic DPDK test reports
 help / color / mirror / Atom feed
* [dpdk-test-report] |FAILURE| pw66462ipsec: use hash lookup with hash sigs in sad lookup
@ 2020-03-10  8:50 sys_stv
  0 siblings, 0 replies; only message in thread
From: sys_stv @ 2020-03-10  8:50 UTC (permalink / raw)
  To: test-report

[-- Attachment #1: Type: text/plain, Size: 131793 bytes --]

Test-Label: Intel-compilation
Test-Status: FAILURE
http://dpdk.org/patch/66462

_Compilation issues_

Submitter: Vladimir Medvedkin <vladimir.medvedkin@intel.com>
Date: 2020-03-09 12:55:45
Reply_mail: 1583758545-375405-1-git-send-email-vladimir.medvedkin@intel.com
DPDK git baseline: Repo:dpdk-next-crypto, CommitID: 345187bda58f2685e34a00c7bca917637395aad4

Makefile build Summary: 23 Builds Done, 0 Successful, 23 Failures

Meson build Summary: 8 Builds Done, 2 Successful, 6 Failures

               +==============================================+===========+==========+
               |                   Makefile                   |   Meson   | Document |
+----------------+------+-------+------+------------+-----------+-----------+----------+
| os             | gcc  | clang | icc  | gcc+shared | gcc+debug | gcc/clang | pdf/html |
+----------------+------+-------+------+------------+-----------+-----------+----------+
| RHEL80-64      | FAIL |       |      |            |           |           |          |
| UB1804-64      | FAIL | FAIL  | FAIL |            |           | FAIL      | pass     |
| UB1604-32      | FAIL |       |      |            |           | FAIL      |          |
| CENTOS77-64    | FAIL | FAIL  | FAIL | FAIL       | FAIL      | FAIL      |          |
| UB1604-64      | FAIL | FAIL  |      |            |           |           |          |
| WIN10-64       |      |       |      |            |           | pass      |          |
| UB1910-64      | FAIL |       |      |            |           |           |          |
| FC31-64        | FAIL | FAIL  |      |            |           | FAIL      |          |
| CENTOS80-64    | FAIL |       |      |            |           |           |          |
| FreeBSD1201-64 | FAIL | FAIL  |      | FAIL       | FAIL      | FAIL      |          |
| RHEL77-64      | FAIL |       |      |            |           |           |          |
| SUSE15-64      | FAIL | FAIL  |      |            |           | FAIL      |          |
+----------------+------+-------+------+------------+-----------+-----------+----------+

Test environment and configuration as below:

** Makefile build **


OS: UB1804-64
	Kernel Version: 4.15.0-20-generic
	CPU info: Intel(R) Xeon(R) CPU E5-2699 v3 @ 2.30GHz
	GCC Version: gcc (Ubuntu 7.3.0-16ubuntu3) 7.3.0
	Clang Version: 6.0.0-1ubuntu2 (tags/RELEASE_600/final)
	x86_64-native-linuxapp-clang
	x86_64-native-linuxapp-icc
	x86_64-native-linuxapp-gcc


OS: UB1604-32
	Kernel Version: 4.4.0-131-generic
	CPU info: Intel(R) Xeon(R) CPU E5-2699 v3 @ 2.30GHz
	GCC Version: gcc (Ubuntu 5.4.0-6ubuntu1~16.04.11) 5.4.0 20160609
	Clang Version: 3.8.0-2ubuntu4 (tags/RELEASE_380/final)
	i686-native-linuxapp-gcc


OS: CENTOS77-64
	Kernel Version: 3.10.0-1062.9.1.el7.x86_64
	CPU info: Intel(R) Xeon(R) CPU E5-2699 v4 @ 2.20GHz
	GCC Version: gcc (GCC) 4.8.5 20150623 (Red Hat 4.8.5-39)
	Clang Version: 3.4.2 (tags/RELEASE_34/dot2-final)
	x86_64-native-linuxapp-gcc+shared
	x86_64-native-linuxapp-clang
	x86_64-native-linuxapp-gcc
	x86_64-native-linuxapp-gcc+debug
	x86_64-native-linuxapp-icc


OS: UB1910-64
	Kernel Version: 5.3.0-18-generic
	CPU info: Intel(R) Xeon(R) CPU E5-2699 v3 @ 2.30GHz
	GCC Version: gcc (Ubuntu 9.2.1-9ubuntu2) 9.2.1 20191008
	Clang Version: 9.0.0-2 (tags/RELEASE_900/final)
	x86_64-native-linuxapp-gcc


OS: CENTOS80-64
	Kernel Version: 4.18.0-80.11.2.el8_0.x86_64
	CPU info: Intel(R) Xeon(R) CPU E5-2699 v4 @ 2.20GHz
	GCC Version: gcc (GCC) 8.2.1 20180905 (Red Hat 8.2.1-3)
	Clang Version: 7.0.1 (tags/RELEASE_701/final)
	x86_64-native-linuxapp-gcc


OS: UB1604-64
	Kernel Version: 4.4.0-170-generic
	CPU info: Intel(R) Xeon(R) CPU E5-2699 v3 @ 2.30GHz
	GCC Version: gcc (Ubuntu 5.4.0-6ubuntu1~16.04.12) 5.4.0 20160609
	Clang Version: 3.8.0-2ubuntu4 (tags/RELEASE_380/final)
	x86_64-native-linuxapp-clang
	x86_64-native-linuxapp-gcc


OS: FC31-64
	Kernel Version: 5.3.15-300.fc31.x86_64
	CPU info: Intel(R) Xeon(R) CPU E5-2699 v4 @ 2.20GHz
	GCC Version: gcc (GCC) 9.2.1 20190827 (Red Hat 9.2.1-1)
	Clang Version: 9.0.0 (Fedora 9.0.0-1.fc31)
	x86_64-native-linuxapp-gcc
	x86_64-native-linuxapp-clang


OS: RHEL80-64
	Kernel Version: 4.18.0-80.el8.x86_64
	CPU info: Intel(R) Xeon(R) CPU E5-2699 v4 @ 2.20GHz
	GCC Version: gcc (GCC) 8.2.1 20180905 (Red Hat 8.2.1-3)
	Clang Version: 6.0.1 (tags/RELEASE_601/final)
	x86_64-native-linuxapp-gcc


OS: FreeBSD1201-64
	Kernel Version: 12.1-RELEASE
	CPU info: Intel(R) Xeon(R) CPU E5-2699 v4 @ 2.20GHz (2194.96-MHz K8-class CPU)
	GCC Version: gcc (FreeBSD Ports Collection) 9.2.0
	Clang Version: 8.0.1 (tags/RELEASE_801/final 366581) (based on LLVM 8.0.1)
	x86_64-native-bsdapp-gcc+shared
	x86_64-native-bsdapp-gcc
	x86_64-native-bsdapp-clang
	x86_64-native-bsdapp-gcc+debug


OS: RHEL77-64
	Kernel Version: 3.10.0-1062.9.1.el7.x86_64
	CPU info: Intel(R) Xeon(R) CPU E5-2699 v4 @ 2.20GHz
	GCC Version: gcc (GCC) 4.8.5 20150623 (Red Hat 4.8.5-39)
	Clang Version: 3.4.2 (tags/RELEASE_34/dot2-final)
	x86_64-native-linuxapp-gcc


OS: SUSE15-64
	Kernel Version: 4.12.14-lp150.11-default
	CPU info: Intel(R) Xeon(R) CPU E5-2699 v4 @ 2.20GHz
	GCC Version: gcc (SUSE Linux) 7.3.1 20180323 [gcc-7-branch revision 258812]
	Clang Version: 5.0.1 (tags/RELEASE_501/final 312548)
	x86_64-native-linuxapp-gcc
	x86_64-native-linuxapp-clang


** Meson build **


OS: UB1804-64
	Kernel Version: 4.15.0-20-generic
	CPU info: Intel(R) Xeon(R) CPU E5-2699 v4 @ 2.20GHz
	GCC Version: gcc (Ubuntu 7.3.0-27ubuntu1~18.04) 7.3.0
	Clang Version: 6.0.0-1ubuntu2 (tags/RELEASE_600/final)
	x86_64-native-linuxapp-doc
	./build-gcc-static
	./build-gcc-shared
	./build-clang-static
	./build-clang-shared
	./build-x86-default


OS: UB1604-32
	Kernel Version: 4.4.0-131-generic
	CPU info: Intel(R) Xeon(R) CPU E5-2699 v4 @ 2.20GHz
	GCC Version: gcc (Ubuntu 5.4.0-6ubuntu1~16.04.11) 5.4.0 20160609
	Clang Version: 3.8.0-2ubuntu4 (tags/RELEASE_380/final)
	./build-gcc-static
	./build-gcc-shared
	./build-clang-static
	./build-clang-shared
	./build-x86-default


OS: CENTOS77-64
	Kernel Version: 3.10.0-1062.12.1.el7.x86_64
	CPU info: Intel(R) Xeon(R) CPU E5-2699 v4 @ 2.20GHz
	GCC Version: gcc (GCC) 4.8.5 20150623 (Red Hat 4.8.5-39)
	Clang Version: 3.4.2 (tags/RELEASE_34/dot2-final)
	./build-gcc-static
	./build-gcc-shared
	./build-clang-static
	./build-clang-shared
	./build-x86-default


OS: WIN10-64
	Kernel Version: N/A
	CPU info: N/A
	GCC Version: N/A
	Clang Version: Clang 8.0.0
	x86_64-windows-clang


OS: FC31-64
	Kernel Version: 5.4.18-200.fc31.x86_64
	CPU info: Intel(R) Xeon(R) CPU E5-2699 v4 @ 2.20GHz
	GCC Version: gcc (GCC) 9.2.1 20190827 (Red Hat 9.2.1-1)
	Clang Version: 9.0.0 (Fedora 9.0.0-1.fc31)
	./build-gcc-static
	./build-gcc-shared
	./build-clang-static
	./build-clang-shared
	./build-x86-default


OS: FreeBSD1201-64
	Kernel Version: 12.1-RELEASE
	CPU info: Intel(R) Xeon(R) CPU E5-2699 v4 @ 2.20GHz (2194.98-MHz K8-class CPU)
	GCC Version: gcc (FreeBSD Ports Collection) 9.2.0
	Clang Version: 8.0.1 (tags/RELEASE_801/final 366581) (based on LLVM 8.0.1)
	./build-gcc-static
	./build-gcc-shared
	./build-clang-static
	./build-clang-shared
	./build-x86-default


OS: SUSE15-64
	Kernel Version: 4.12.14-lp150.12.82-default
	CPU info: Intel(R) Xeon(R) CPU E5-2699 v4 @ 2.20GHz
	GCC Version: gcc (SUSE Linux) 7.4.1 20190905 [gcc-7-branch revision 275407]
	Clang Version: 5.0.1 (tags/RELEASE_501/final 312548)
	./build-gcc-static
	./build-gcc-shared
	./build-clang-static
	./build-clang-shared
	./build-x86-default


*Make Build Failed #1:
OS: UB1604-32
Target: i686-native-linuxapp-gcc
/root/UB1604-32_K4.4.0_GCC5.4.0/i686-native-linuxapp-gcc/7222f93613314e26abda8a8c47e1cbe8/dpdk/i686-native-linuxapp-gcc/lib/librte_ipsec.a(ipsec_sad.o): In function `__ipsec_sad_lookup':
ipsec_sad.c:(.text+0x27a): undefined reference to `rte_hash_lookup_with_hash_bulk_data'
ipsec_sad.c:(.text+0x945): undefined reference to `rte_hash_lookup_with_hash_bulk_data'
ipsec_sad.c:(.text+0x9ef): undefined reference to `rte_hash_lookup_with_hash_bulk_data'
collect2: error: ld returned 1 exit status
/root/UB1604-32_K4.4.0_GCC5.4.0/i686-native-linuxapp-gcc/7222f93613314e26abda8a8c47e1cbe8/dpdk/mk/rte.app.mk:444: recipe for target 'testsad' failed
make[5]: *** [testsad] Error 1
/root/UB1604-32_K4.4.0_GCC5.4.0/i686-native-linuxapp-gcc/7222f93613314e26abda8a8c47e1cbe8/dpdk/mk/rte.subdir.mk:35: recipe for target 'test-sad' failed
make[4]: *** [test-sad] Error 2
make[4]: *** Waiting for unfinished jobs....
  INSTALL-MAP dpdk-procinfo.map
  CC test_prefetch.o
  CC test_byteorder.o
  CC test_per_lcore.o
--
/root/UB1604-32_K4.4.0_GCC5.4.0/i686-native-linuxapp-gcc/7222f93613314e26abda8a8c47e1cbe8/dpdk/i686-native-linuxapp-gcc/lib/librte_ipsec.a(ipsec_sad.o): In function `__ipsec_sad_lookup':
ipsec_sad.c:(.text+0x27a): undefined reference to `rte_hash_lookup_with_hash_bulk_data'
ipsec_sad.c:(.text+0x945): undefined reference to `rte_hash_lookup_with_hash_bulk_data'
ipsec_sad.c:(.text+0x9ef): undefined reference to `rte_hash_lookup_with_hash_bulk_data'
collect2: error: ld returned 1 exit status
/root/UB1604-32_K4.4.0_GCC5.4.0/i686-native-linuxapp-gcc/7222f93613314e26abda8a8c47e1cbe8/dpdk/mk/rte.app.mk:444: recipe for target 'test' failed
make[5]: *** [test] Error 1
/root/UB1604-32_K4.4.0_GCC5.4.0/i686-native-linuxapp-gcc/7222f93613314e26abda8a8c47e1cbe8/dpdk/mk/rte.subdir.mk:35: recipe for target 'test' failed
make[4]: *** [test] Error 2
/root/UB1604-32_K4.4.0_GCC5.4.0/i686-native-linuxapp-gcc/7222f93613314e26abda8a8c47e1cbe8/dpdk/mk/rte.sdkbuild.mk:46: recipe for target 'app' failed
make[3]: *** [app] Error 2
/root/UB1604-32_K4.4.0_GCC5.4.0/i686-native-linuxapp-gcc/7222f93613314e26abda8a8c47e1cbe8/dpdk/mk/rte.sdkroot.mk:98: recipe for target 'all' failed
make[2]: *** [all] Error 2
/root/UB1604-32_K4.4.0_GCC5.4.0/i686-native-linuxapp-gcc/7222f93613314e26abda8a8c47e1cbe8/dpdk/mk/rte.sdkinstall.mk:60: recipe for target 'pre_install' failed
make[1]: *** [pre_install] Error 2
/root/UB1604-32_K4.4.0_GCC5.4.0/i686-native-linuxapp-gcc/7222f93613314e26abda8a8c47e1cbe8/dpdk/mk/rte.sdkroot.mk:77: recipe for target 'install' failed
make: *** [install] Error 2


*Make Build Failed #2:
OS: UB1604-64
Target: x86_64-native-linuxapp-clang
  CC parameters.o
  INSTALL-MAP dpdk-pdump.map
  CC runtime.o
  CC pipeline_stub.o
  INSTALL-APP dpdk-procinfo
clang: error: linker command failed with exit code 1 (use -v to see invocation)
/root/UB1604-64_K4.4.0_Clang3.8.0/x86_64-native-linuxapp-clang/7222f93613314e26abda8a8c47e1cbe8/dpdk/mk/rte.app.mk:444: recipe for target 'testsad' failed
make[5]: *** [testsad] Error 1
/root/UB1604-64_K4.4.0_Clang3.8.0/x86_64-native-linuxapp-clang/7222f93613314e26abda8a8c47e1cbe8/dpdk/mk/rte.subdir.mk:35: recipe for target 'test-sad' failed
make[4]: *** [test-sad] Error 2
make[4]: *** Waiting for unfinished jobs....
  INSTALL-MAP dpdk-procinfo.map
  CC test_per_lcore.o
  CC test_byteorder.o
  CC main.o
--
  LD test
/root/UB1604-64_K4.4.0_Clang3.8.0/x86_64-native-linuxapp-clang/7222f93613314e26abda8a8c47e1cbe8/dpdk/x86_64-native-linuxapp-clang/lib/librte_ipsec.a(ipsec_sad.o): In function `rte_ipsec_sad_lookup':
/root/UB1604-64_K4.4.0_Clang3.8.0/x86_64-native-linuxapp-clang/7222f93613314e26abda8a8c47e1cbe8/dpdk/lib/librte_ipsec/ipsec_sad.c:(.text.experimental+0x97b): undefined reference to `rte_hash_lookup_with_hash_bulk_data'
/root/UB1604-64_K4.4.0_Clang3.8.0/x86_64-native-linuxapp-clang/7222f93613314e26abda8a8c47e1cbe8/dpdk/lib/librte_ipsec/ipsec_sad.c:(.text.experimental+0xac1): undefined reference to `rte_hash_lookup_with_hash_bulk_data'
/root/UB1604-64_K4.4.0_Clang3.8.0/x86_64-native-linuxapp-clang/7222f93613314e26abda8a8c47e1cbe8/dpdk/lib/librte_ipsec/ipsec_sad.c:(.text.experimental+0xb41): undefined reference to `rte_hash_lookup_with_hash_bulk_data'
clang: error: linker command failed with exit code 1 (use -v to see invocation)
/root/UB1604-64_K4.4.0_Clang3.8.0/x86_64-native-linuxapp-clang/7222f93613314e26abda8a8c47e1cbe8/dpdk/mk/rte.app.mk:444: recipe for target 'test' failed
make[5]: *** [test] Error 1
/root/UB1604-64_K4.4.0_Clang3.8.0/x86_64-native-linuxapp-clang/7222f93613314e26abda8a8c47e1cbe8/dpdk/mk/rte.subdir.mk:35: recipe for target 'test' failed
make[4]: *** [test] Error 2
/root/UB1604-64_K4.4.0_Clang3.8.0/x86_64-native-linuxapp-clang/7222f93613314e26abda8a8c47e1cbe8/dpdk/mk/rte.sdkbuild.mk:46: recipe for target 'app' failed
make[3]: *** [app] Error 2
/root/UB1604-64_K4.4.0_Clang3.8.0/x86_64-native-linuxapp-clang/7222f93613314e26abda8a8c47e1cbe8/dpdk/mk/rte.sdkroot.mk:98: recipe for target 'all' failed
make[2]: *** [all] Error 2
/root/UB1604-64_K4.4.0_Clang3.8.0/x86_64-native-linuxapp-clang/7222f93613314e26abda8a8c47e1cbe8/dpdk/mk/rte.sdkinstall.mk:60: recipe for target 'pre_install' failed
make[1]: *** [pre_install] Error 2
/root/UB1604-64_K4.4.0_Clang3.8.0/x86_64-native-linuxapp-clang/7222f93613314e26abda8a8c47e1cbe8/dpdk/mk/rte.sdkroot.mk:77: recipe for target 'install' failed
make: *** [install] Error 2


*Make Build Failed #3:
OS: UB1910-64
Target: x86_64-native-linuxapp-gcc
ipsec_sad.c:(.text+0x2bc): undefined reference to `rte_hash_lookup_with_hash_bulk_data'
/usr/bin/ld: ipsec_sad.c:(.text+0x87a): undefined reference to `rte_hash_lookup_with_hash_bulk_data'
/usr/bin/ld: ipsec_sad.c:(.text+0x8ea): undefined reference to `rte_hash_lookup_with_hash_bulk_data'
/usr/bin/ld: ipsec_sad.c:(.text+0xb34): undefined reference to `rte_hash_lookup_with_hash_bulk_data'
collect2: error: ld returned 1 exit status
make[5]: *** [/root/UB1910-64_K5.3.0_GCC9.2.1/x86_64-native-linuxapp-gcc/7222f93613314e26abda8a8c47e1cbe8/dpdk/mk/rte.app.mk:446: testsad] Error 1
make[4]: *** [/root/UB1910-64_K5.3.0_GCC9.2.1/x86_64-native-linuxapp-gcc/7222f93613314e26abda8a8c47e1cbe8/dpdk/mk/rte.subdir.mk:37: test-sad] Error 2
make[4]: *** Waiting for unfinished jobs....
  CC test_resource.o
  CC comp_perf_test_verify.o
  CC parameters.o
  INSTALL-APP cmdline_test
--
ipsec_sad.c:(.text+0x2bc): undefined reference to `rte_hash_lookup_with_hash_bulk_data'
/usr/bin/ld: ipsec_sad.c:(.text+0x87a): undefined reference to `rte_hash_lookup_with_hash_bulk_data'
/usr/bin/ld: ipsec_sad.c:(.text+0x8ea): undefined reference to `rte_hash_lookup_with_hash_bulk_data'
/usr/bin/ld: ipsec_sad.c:(.text+0xb34): undefined reference to `rte_hash_lookup_with_hash_bulk_data'
collect2: error: ld returned 1 exit status
make[5]: *** [/root/UB1910-64_K5.3.0_GCC9.2.1/x86_64-native-linuxapp-gcc/7222f93613314e26abda8a8c47e1cbe8/dpdk/mk/rte.app.mk:446: test] Error 1
make[4]: *** [/root/UB1910-64_K5.3.0_GCC9.2.1/x86_64-native-linuxapp-gcc/7222f93613314e26abda8a8c47e1cbe8/dpdk/mk/rte.subdir.mk:35: test] Error 2
make[3]: *** [/root/UB1910-64_K5.3.0_GCC9.2.1/x86_64-native-linuxapp-gcc/7222f93613314e26abda8a8c47e1cbe8/dpdk/mk/rte.sdkbuild.mk:48: app] Error 2
make[2]: *** [/root/UB1910-64_K5.3.0_GCC9.2.1/x86_64-native-linuxapp-gcc/7222f93613314e26abda8a8c47e1cbe8/dpdk/mk/rte.sdkroot.mk:99: all] Error 2
make[1]: *** [/root/UB1910-64_K5.3.0_GCC9.2.1/x86_64-native-linuxapp-gcc/7222f93613314e26abda8a8c47e1cbe8/dpdk/mk/rte.sdkinstall.mk:61: pre_install] Error 2
make: *** [/root/UB1910-64_K5.3.0_GCC9.2.1/x86_64-native-linuxapp-gcc/7222f93613314e26abda8a8c47e1cbe8/dpdk/mk/rte.sdkroot.mk:77: install] Error 2


*Make Build Failed #4:
OS: UB1804-64
Target: x86_64-native-linuxapp-clang
ipsec_sad.c:(.text.experimental+0x90c): undefined reference to `rte_hash_lookup_with_hash_bulk_data'
ipsec_sad.c:(.text.experimental+0xa28): undefined reference to `rte_hash_lookup_with_hash_bulk_data'
ipsec_sad.c:(.text.experimental+0xa9e): undefined reference to `rte_hash_lookup_with_hash_bulk_data'
  CC config.o
  CC test_bbdev_perf.o
clang: error: linker command failed with exit code 1 (use -v to see invocation)
/root/UB1804-64_K4.15.0_Clang6.0.0/x86_64-native-linuxapp-clang/7222f93613314e26abda8a8c47e1cbe8/dpdk/mk/rte.app.mk:444: recipe for target 'testsad' failed
make[5]: *** [testsad] Error 1
/root/UB1804-64_K4.15.0_Clang6.0.0/x86_64-native-linuxapp-clang/7222f93613314e26abda8a8c47e1cbe8/dpdk/mk/rte.subdir.mk:35: recipe for target 'test-sad' failed
make[4]: *** [test-sad] Error 2
make[4]: *** Waiting for unfinished jobs....
  CC init.o
  INSTALL-APP cmdline_test
  CC resource.o
  INSTALL-MAP cmdline_test.map
--
  LD test
/root/UB1804-64_K4.15.0_Clang6.0.0/x86_64-native-linuxapp-clang/7222f93613314e26abda8a8c47e1cbe8/dpdk/x86_64-native-linuxapp-clang/lib/librte_ipsec.a(ipsec_sad.o): In function `rte_ipsec_sad_lookup':
ipsec_sad.c:(.text.experimental+0x90c): undefined reference to `rte_hash_lookup_with_hash_bulk_data'
ipsec_sad.c:(.text.experimental+0xa28): undefined reference to `rte_hash_lookup_with_hash_bulk_data'
ipsec_sad.c:(.text.experimental+0xa9e): undefined reference to `rte_hash_lookup_with_hash_bulk_data'
clang: error: linker command failed with exit code 1 (use -v to see invocation)
/root/UB1804-64_K4.15.0_Clang6.0.0/x86_64-native-linuxapp-clang/7222f93613314e26abda8a8c47e1cbe8/dpdk/mk/rte.app.mk:444: recipe for target 'test' failed
make[5]: *** [test] Error 1
/root/UB1804-64_K4.15.0_Clang6.0.0/x86_64-native-linuxapp-clang/7222f93613314e26abda8a8c47e1cbe8/dpdk/mk/rte.subdir.mk:35: recipe for target 'test' failed
make[4]: *** [test] Error 2
/root/UB1804-64_K4.15.0_Clang6.0.0/x86_64-native-linuxapp-clang/7222f93613314e26abda8a8c47e1cbe8/dpdk/mk/rte.sdkbuild.mk:46: recipe for target 'app' failed
make[3]: *** [app] Error 2
/root/UB1804-64_K4.15.0_Clang6.0.0/x86_64-native-linuxapp-clang/7222f93613314e26abda8a8c47e1cbe8/dpdk/mk/rte.sdkroot.mk:98: recipe for target 'all' failed
make[2]: *** [all] Error 2
/root/UB1804-64_K4.15.0_Clang6.0.0/x86_64-native-linuxapp-clang/7222f93613314e26abda8a8c47e1cbe8/dpdk/mk/rte.sdkinstall.mk:60: recipe for target 'pre_install' failed
make[1]: *** [pre_install] Error 2
/root/UB1804-64_K4.15.0_Clang6.0.0/x86_64-native-linuxapp-clang/7222f93613314e26abda8a8c47e1cbe8/dpdk/mk/rte.sdkroot.mk:77: recipe for target 'install' failed
make: *** [install] Error 2


*Make Build Failed #5:
OS: UB1804-64
Target: x86_64-native-linuxapp-icc
ld: /root/UB1804-64_K4.15.0_ICC19.0.0/x86_64-native-linuxapp-icc/7222f93613314e26abda8a8c47e1cbe8/dpdk/x86_64-native-linuxapp-icc/lib/librte_ipsec.a(ipsec_sad.o): in function `rte_ipsec_sad_lookup':
ipsec_sad.c:(.text.experimental+0xb77): undefined reference to `rte_hash_lookup_with_hash_bulk_data'
ld: ipsec_sad.c:(.text.experimental+0xe6c): undefined reference to `rte_hash_lookup_with_hash_bulk_data'
ld: ipsec_sad.c:(.text.experimental+0xee8): undefined reference to `rte_hash_lookup_with_hash_bulk_data'
  LD dpdk-pdump
/root/UB1804-64_K4.15.0_ICC19.0.0/x86_64-native-linuxapp-icc/7222f93613314e26abda8a8c47e1cbe8/dpdk/mk/rte.app.mk:444: recipe for target 'testsad' failed
make[5]: *** [testsad] Error 1
/root/UB1804-64_K4.15.0_ICC19.0.0/x86_64-native-linuxapp-icc/7222f93613314e26abda8a8c47e1cbe8/dpdk/mk/rte.subdir.mk:35: recipe for target 'test-sad' failed
make[4]: *** [test-sad] Error 2
make[4]: *** Waiting for unfinished jobs....
  CC comp_perf_test_throughput.o
  CC test_resource.o
  CC runtime.o
  CC pipeline_stub.o
--
  LD test
ld: /root/UB1804-64_K4.15.0_ICC19.0.0/x86_64-native-linuxapp-icc/7222f93613314e26abda8a8c47e1cbe8/dpdk/x86_64-native-linuxapp-icc/lib/librte_ipsec.a(ipsec_sad.o): in function `rte_ipsec_sad_lookup':
ipsec_sad.c:(.text.experimental+0xb77): undefined reference to `rte_hash_lookup_with_hash_bulk_data'
ld: ipsec_sad.c:(.text.experimental+0xe6c): undefined reference to `rte_hash_lookup_with_hash_bulk_data'
ld: ipsec_sad.c:(.text.experimental+0xee8): undefined reference to `rte_hash_lookup_with_hash_bulk_data'
/root/UB1804-64_K4.15.0_ICC19.0.0/x86_64-native-linuxapp-icc/7222f93613314e26abda8a8c47e1cbe8/dpdk/mk/rte.app.mk:444: recipe for target 'test' failed
make[5]: *** [test] Error 1
/root/UB1804-64_K4.15.0_ICC19.0.0/x86_64-native-linuxapp-icc/7222f93613314e26abda8a8c47e1cbe8/dpdk/mk/rte.subdir.mk:35: recipe for target 'test' failed
make[4]: *** [test] Error 2
/root/UB1804-64_K4.15.0_ICC19.0.0/x86_64-native-linuxapp-icc/7222f93613314e26abda8a8c47e1cbe8/dpdk/mk/rte.sdkbuild.mk:46: recipe for target 'app' failed
make[3]: *** [app] Error 2
/root/UB1804-64_K4.15.0_ICC19.0.0/x86_64-native-linuxapp-icc/7222f93613314e26abda8a8c47e1cbe8/dpdk/mk/rte.sdkroot.mk:98: recipe for target 'all' failed
make[2]: *** [all] Error 2
/root/UB1804-64_K4.15.0_ICC19.0.0/x86_64-native-linuxapp-icc/7222f93613314e26abda8a8c47e1cbe8/dpdk/mk/rte.sdkinstall.mk:60: recipe for target 'pre_install' failed
make[1]: *** [pre_install] Error 2
/root/UB1804-64_K4.15.0_ICC19.0.0/x86_64-native-linuxapp-icc/7222f93613314e26abda8a8c47e1cbe8/dpdk/mk/rte.sdkroot.mk:77: recipe for target 'install' failed
make: *** [install] Error 2


*Make Build Failed #6:
OS: CENTOS77-64
Target: x86_64-native-linuxapp-gcc+shared
ipsec_sad.o: In function `__ipsec_sad_lookup':
ipsec_sad.c:(.text+0x213): undefined reference to `rte_hash_lookup_with_hash_bulk_data'
ipsec_sad.c:(.text+0x786): undefined reference to `rte_hash_lookup_with_hash_bulk_data'
ipsec_sad.c:(.text+0x807): undefined reference to `rte_hash_lookup_with_hash_bulk_data'
collect2: error: ld returned 1 exit status
make[5]: *** [librte_ipsec.so.0.200.2] Error 1
make[4]: *** [librte_ipsec] Error 2
make[4]: *** Waiting for unfinished jobs....
  CC rte_port_sym_crypto.o
  CC rte_port_eventdev.o
  LD librte_vhost.so.20.0.2
  INSTALL-LIB librte_vhost.so.20.0.2
  LD librte_port.so.20.0.2
  INSTALL-LIB librte_port.so.20.0.2
make[3]: *** [lib] Error 2
make[2]: *** [all] Error 2
make[1]: *** [pre_install] Error 2
make: *** [install] Error 2


*Make Build Failed #7:
OS: CENTOS77-64
Target: x86_64-native-linuxapp-clang
/root/CENTOS77-64_K3.10.0_Clang3.4.2/x86_64-native-linuxapp-clang/7222f93613314e26abda8a8c47e1cbe8/dpdk/lib/librte_ipsec/ipsec_sad.c:(.text.experimental+0x9fa): undefined reference to `rte_hash_lookup_with_hash_bulk_data'
  CC resource.o
  CC test_bbdev_perf.o
  CC comp_perf_test_verify.o
  CC test_resource.o
clang: error: linker command failed with exit code 1 (use -v to see invocation)
make[5]: *** [testsad] Error 1
make[4]: *** [test-sad] Error 2
make[4]: *** Waiting for unfinished jobs....
  INSTALL-APP testacl
  CC test_prefetch.o
  INSTALL-MAP testacl.map
  CC pipeline_stub.o
--
  LD test
/root/CENTOS77-64_K3.10.0_Clang3.4.2/x86_64-native-linuxapp-clang/7222f93613314e26abda8a8c47e1cbe8/dpdk/x86_64-native-linuxapp-clang/lib/librte_ipsec.a(ipsec_sad.o): In function `rte_ipsec_sad_lookup':
/root/CENTOS77-64_K3.10.0_Clang3.4.2/x86_64-native-linuxapp-clang/7222f93613314e26abda8a8c47e1cbe8/dpdk/lib/librte_ipsec/ipsec_sad.c:(.text.experimental+0x83f): undefined reference to `rte_hash_lookup_with_hash_bulk_data'
/root/CENTOS77-64_K3.10.0_Clang3.4.2/x86_64-native-linuxapp-clang/7222f93613314e26abda8a8c47e1cbe8/dpdk/lib/librte_ipsec/ipsec_sad.c:(.text.experimental+0x980): undefined reference to `rte_hash_lookup_with_hash_bulk_data'
/root/CENTOS77-64_K3.10.0_Clang3.4.2/x86_64-native-linuxapp-clang/7222f93613314e26abda8a8c47e1cbe8/dpdk/lib/librte_ipsec/ipsec_sad.c:(.text.experimental+0x9fa): undefined reference to `rte_hash_lookup_with_hash_bulk_data'
clang: error: linker command failed with exit code 1 (use -v to see invocation)
make[5]: *** [test] Error 1
make[4]: *** [test] Error 2
make[3]: *** [app] Error 2
make[2]: *** [all] Error 2
make[1]: *** [pre_install] Error 2
make: *** [install] Error 2


*Make Build Failed #8:
OS: CENTOS77-64
Target: x86_64-native-linuxapp-gcc
  CC pipeline_acl.o
  CC test_cycles.o
  LD testpipeline
  CC test_mcslock.o
collect2: error: ld returned 1 exit status
make[5]: *** [testsad] Error 1
make[4]: *** [test-sad] Error 2
make[4]: *** Waiting for unfinished jobs....
  CC test_spinlock.o
  CC cmdline_mtr.o
  CC comp_perf_test_cyclecount.o
  CC test_ticketlock.o
--
/root/CENTOS77-64_K3.10.0_GCC4.8.5/x86_64-native-linuxapp-gcc/7222f93613314e26abda8a8c47e1cbe8/dpdk/x86_64-native-linuxapp-gcc/lib/librte_ipsec.a(ipsec_sad.o): In function `__ipsec_sad_lookup':
ipsec_sad.c:(.text+0x1fb): undefined reference to `rte_hash_lookup_with_hash_bulk_data'
ipsec_sad.c:(.text+0x776): undefined reference to `rte_hash_lookup_with_hash_bulk_data'
ipsec_sad.c:(.text+0x7f7): undefined reference to `rte_hash_lookup_with_hash_bulk_data'
collect2: error: ld returned 1 exit status
make[5]: *** [test] Error 1
make[4]: *** [test] Error 2
make[3]: *** [app] Error 2
make[2]: *** [all] Error 2
make[1]: *** [pre_install] Error 2
make: *** [install] Error 2


*Make Build Failed #9:
OS: CENTOS77-64
Target: x86_64-native-linuxapp-gcc+debug
/root/CENTOS77-64_K3.10.0_GCC4.8.5/x86_64-native-linuxapp-gcc+debug/7222f93613314e26abda8a8c47e1cbe8/dpdk/x86_64-native-linuxapp-gcc/lib/librte_ipsec.a(ipsec_sad.o): In function `__ipsec_sad_lookup':
ipsec_sad.c:(.text+0x1fb): undefined reference to `rte_hash_lookup_with_hash_bulk_data'
ipsec_sad.c:(.text+0x776): undefined reference to `rte_hash_lookup_with_hash_bulk_data'
ipsec_sad.c:(.text+0x7f7): undefined reference to `rte_hash_lookup_with_hash_bulk_data'
collect2: error: ld returned 1 exit status
make[5]: *** [testsad] Error 1
make[4]: *** [test-sad] Error 2
make[4]: *** Waiting for unfinished jobs....
  INSTALL-APP dpdk-pdump
  CC parameters.o
  INSTALL-APP testacl
  INSTALL-APP dpdk-procinfo
--
/root/CENTOS77-64_K3.10.0_GCC4.8.5/x86_64-native-linuxapp-gcc+debug/7222f93613314e26abda8a8c47e1cbe8/dpdk/x86_64-native-linuxapp-gcc/lib/librte_ipsec.a(ipsec_sad.o): In function `__ipsec_sad_lookup':
ipsec_sad.c:(.text+0x1fb): undefined reference to `rte_hash_lookup_with_hash_bulk_data'
ipsec_sad.c:(.text+0x776): undefined reference to `rte_hash_lookup_with_hash_bulk_data'
ipsec_sad.c:(.text+0x7f7): undefined reference to `rte_hash_lookup_with_hash_bulk_data'
collect2: error: ld returned 1 exit status
make[5]: *** [test] Error 1
make[4]: *** [test] Error 2
make[3]: *** [app] Error 2
make[2]: *** [all] Error 2
make[1]: *** [pre_install] Error 2
make: *** [install] Error 2


*Make Build Failed #10:
OS: CENTOS80-64
Target: x86_64-native-linuxapp-gcc
ipsec_sad.c:(.text+0x28e): undefined reference to `rte_hash_lookup_with_hash_bulk_data'
ipsec_sad.c:(.text+0x81d): undefined reference to `rte_hash_lookup_with_hash_bulk_data'
ipsec_sad.c:(.text+0x88d): undefined reference to `rte_hash_lookup_with_hash_bulk_data'
ipsec_sad.c:(.text+0xa5c): undefined reference to `rte_hash_lookup_with_hash_bulk_data'
collect2: error: ld returned 1 exit status
make[5]: *** [/root/CENTOS80-64_K4.18.0_GCC8.2.1/x86_64-native-linuxapp-gcc/7222f93613314e26abda8a8c47e1cbe8/dpdk/mk/rte.app.mk:446: testsad] Error 1
make[4]: *** [/root/CENTOS80-64_K4.18.0_GCC8.2.1/x86_64-native-linuxapp-gcc/7222f93613314e26abda8a8c47e1cbe8/dpdk/mk/rte.subdir.mk:37: test-sad] Error 2
make[4]: *** Waiting for unfinished jobs....
  CC runtime.o
  INSTALL-APP dpdk-pdump
  INSTALL-MAP dpdk-pdump.map
  CC comp_perf_test_verify.o
--
ipsec_sad.c:(.text+0x28e): undefined reference to `rte_hash_lookup_with_hash_bulk_data'
ipsec_sad.c:(.text+0x81d): undefined reference to `rte_hash_lookup_with_hash_bulk_data'
ipsec_sad.c:(.text+0x88d): undefined reference to `rte_hash_lookup_with_hash_bulk_data'
ipsec_sad.c:(.text+0xa5c): undefined reference to `rte_hash_lookup_with_hash_bulk_data'
collect2: error: ld returned 1 exit status
make[5]: *** [/root/CENTOS80-64_K4.18.0_GCC8.2.1/x86_64-native-linuxapp-gcc/7222f93613314e26abda8a8c47e1cbe8/dpdk/mk/rte.app.mk:446: test] Error 1
make[4]: *** [/root/CENTOS80-64_K4.18.0_GCC8.2.1/x86_64-native-linuxapp-gcc/7222f93613314e26abda8a8c47e1cbe8/dpdk/mk/rte.subdir.mk:35: test] Error 2
make[3]: *** [/root/CENTOS80-64_K4.18.0_GCC8.2.1/x86_64-native-linuxapp-gcc/7222f93613314e26abda8a8c47e1cbe8/dpdk/mk/rte.sdkbuild.mk:48: app] Error 2
make[2]: *** [/root/CENTOS80-64_K4.18.0_GCC8.2.1/x86_64-native-linuxapp-gcc/7222f93613314e26abda8a8c47e1cbe8/dpdk/mk/rte.sdkroot.mk:99: all] Error 2
make[1]: *** [/root/CENTOS80-64_K4.18.0_GCC8.2.1/x86_64-native-linuxapp-gcc/7222f93613314e26abda8a8c47e1cbe8/dpdk/mk/rte.sdkinstall.mk:61: pre_install] Error 2
make: *** [/root/CENTOS80-64_K4.18.0_GCC8.2.1/x86_64-native-linuxapp-gcc/7222f93613314e26abda8a8c47e1cbe8/dpdk/mk/rte.sdkroot.mk:77: install] Error 2


*Make Build Failed #11:
OS: CENTOS77-64
Target: x86_64-native-linuxapp-icc
ipsec_sad.c:(.text.experimental+0xee8): undefined reference to `rte_hash_lookup_with_hash_bulk_data'
  INSTALL-APP dpdk-procinfo
  INSTALL-MAP dpdk-procinfo.map
  LD dpdk-pdump
== Build app/test-crypto-perf
make[5]: *** [testsad] Error 1
make[4]: *** [test-sad] Error 2
make[4]: *** Waiting for unfinished jobs....
  CC parameters.o
  CC test_resource.o
  CC test_bbdev_perf.o
  CC runtime.o
--
  LD test
/root/CENTOS77-64_K3.10.0_ICC19.0.0/x86_64-native-linuxapp-icc/7222f93613314e26abda8a8c47e1cbe8/dpdk/x86_64-native-linuxapp-icc/lib/librte_ipsec.a(ipsec_sad.o): In function `rte_ipsec_sad_lookup':
ipsec_sad.c:(.text.experimental+0xb77): undefined reference to `rte_hash_lookup_with_hash_bulk_data'
ipsec_sad.c:(.text.experimental+0xe6c): undefined reference to `rte_hash_lookup_with_hash_bulk_data'
ipsec_sad.c:(.text.experimental+0xee8): undefined reference to `rte_hash_lookup_with_hash_bulk_data'
make[5]: *** [test] Error 1
make[4]: *** [test] Error 2
make[3]: *** [app] Error 2
make[2]: *** [all] Error 2
make[1]: *** [pre_install] Error 2
make: *** [install] Error 2


*Make Build Failed #12:
OS: SUSE15-64
Target: x86_64-native-linuxapp-gcc
ipsec_sad.c:(.text+0x27a): undefined reference to `rte_hash_lookup_with_hash_bulk_data'
ipsec_sad.c:(.text+0x921): undefined reference to `rte_hash_lookup_with_hash_bulk_data'
ipsec_sad.c:(.text+0x98b): undefined reference to `rte_hash_lookup_with_hash_bulk_data'
ipsec_sad.c:(.text+0xa6d): undefined reference to `rte_hash_lookup_with_hash_bulk_data'
collect2: error: ld returned 1 exit status
make[5]: *** [/root/SUSE15-64_K4.12.14_GCC7.3.1/x86_64-native-linuxapp-gcc/7222f93613314e26abda8a8c47e1cbe8/dpdk/mk/rte.app.mk:446: testsad] Error 1
make[4]: *** [/root/SUSE15-64_K4.12.14_GCC7.3.1/x86_64-native-linuxapp-gcc/7222f93613314e26abda8a8c47e1cbe8/dpdk/mk/rte.subdir.mk:35: test-sad] Error 2
make[4]: *** Waiting for unfinished jobs....
  INSTALL-MAP dpdk-pdump.map
  CC comp_perf_test_common.o
  CC parameters.o
  CC test_byteorder.o
--
ipsec_sad.c:(.text+0x27a): undefined reference to `rte_hash_lookup_with_hash_bulk_data'
ipsec_sad.c:(.text+0x921): undefined reference to `rte_hash_lookup_with_hash_bulk_data'
ipsec_sad.c:(.text+0x98b): undefined reference to `rte_hash_lookup_with_hash_bulk_data'
ipsec_sad.c:(.text+0xa6d): undefined reference to `rte_hash_lookup_with_hash_bulk_data'
collect2: error: ld returned 1 exit status
make[5]: *** [/root/SUSE15-64_K4.12.14_GCC7.3.1/x86_64-native-linuxapp-gcc/7222f93613314e26abda8a8c47e1cbe8/dpdk/mk/rte.app.mk:446: test] Error 1
make[4]: *** [/root/SUSE15-64_K4.12.14_GCC7.3.1/x86_64-native-linuxapp-gcc/7222f93613314e26abda8a8c47e1cbe8/dpdk/mk/rte.subdir.mk:35: test] Error 2
make[3]: *** [/root/SUSE15-64_K4.12.14_GCC7.3.1/x86_64-native-linuxapp-gcc/7222f93613314e26abda8a8c47e1cbe8/dpdk/mk/rte.sdkbuild.mk:48: app] Error 2
make[2]: *** [/root/SUSE15-64_K4.12.14_GCC7.3.1/x86_64-native-linuxapp-gcc/7222f93613314e26abda8a8c47e1cbe8/dpdk/mk/rte.sdkroot.mk:99: all] Error 2
make[1]: *** [/root/SUSE15-64_K4.12.14_GCC7.3.1/x86_64-native-linuxapp-gcc/7222f93613314e26abda8a8c47e1cbe8/dpdk/mk/rte.sdkinstall.mk:61: pre_install] Error 2
make: *** [/root/SUSE15-64_K4.12.14_GCC7.3.1/x86_64-native-linuxapp-gcc/7222f93613314e26abda8a8c47e1cbe8/dpdk/mk/rte.sdkroot.mk:77: install] Error 2


*Make Build Failed #13:
OS: FC31-64
Target: x86_64-native-linuxapp-gcc
ipsec_sad.c:(.text+0x27c): undefined reference to `rte_hash_lookup_with_hash_bulk_data'
/usr/bin/ld: ipsec_sad.c:(.text+0x825): undefined reference to `rte_hash_lookup_with_hash_bulk_data'
/usr/bin/ld: ipsec_sad.c:(.text+0x89d): undefined reference to `rte_hash_lookup_with_hash_bulk_data'
/usr/bin/ld: ipsec_sad.c:(.text+0xaa9): undefined reference to `rte_hash_lookup_with_hash_bulk_data'
collect2: error: ld returned 1 exit status
make[5]: *** [/root/FC31-64_K5.3.14_GCC9.2.1/x86_64-native-linuxapp-gcc/7222f93613314e26abda8a8c47e1cbe8/dpdk/mk/rte.app.mk:446: testsad] Error 1
make[4]: *** [/root/FC31-64_K5.3.14_GCC9.2.1/x86_64-native-linuxapp-gcc/7222f93613314e26abda8a8c47e1cbe8/dpdk/mk/rte.subdir.mk:35: test-sad] Error 2
make[4]: *** Waiting for unfinished jobs....
  INSTALL-MAP dpdk-procinfo.map
  CC comp_perf_test_cyclecount.o
  CC test_byteorder.o
  CC comp_perf_test_common.o
--
ipsec_sad.c:(.text+0x27c): undefined reference to `rte_hash_lookup_with_hash_bulk_data'
/usr/bin/ld: ipsec_sad.c:(.text+0x825): undefined reference to `rte_hash_lookup_with_hash_bulk_data'
/usr/bin/ld: ipsec_sad.c:(.text+0x89d): undefined reference to `rte_hash_lookup_with_hash_bulk_data'
/usr/bin/ld: ipsec_sad.c:(.text+0xaa9): undefined reference to `rte_hash_lookup_with_hash_bulk_data'
collect2: error: ld returned 1 exit status
make[5]: *** [/root/FC31-64_K5.3.14_GCC9.2.1/x86_64-native-linuxapp-gcc/7222f93613314e26abda8a8c47e1cbe8/dpdk/mk/rte.app.mk:446: test] Error 1
make[4]: *** [/root/FC31-64_K5.3.14_GCC9.2.1/x86_64-native-linuxapp-gcc/7222f93613314e26abda8a8c47e1cbe8/dpdk/mk/rte.subdir.mk:35: test] Error 2
make[3]: *** [/root/FC31-64_K5.3.14_GCC9.2.1/x86_64-native-linuxapp-gcc/7222f93613314e26abda8a8c47e1cbe8/dpdk/mk/rte.sdkbuild.mk:48: app] Error 2
make[2]: *** [/root/FC31-64_K5.3.14_GCC9.2.1/x86_64-native-linuxapp-gcc/7222f93613314e26abda8a8c47e1cbe8/dpdk/mk/rte.sdkroot.mk:99: all] Error 2
make[1]: *** [/root/FC31-64_K5.3.14_GCC9.2.1/x86_64-native-linuxapp-gcc/7222f93613314e26abda8a8c47e1cbe8/dpdk/mk/rte.sdkinstall.mk:61: pre_install] Error 2
make: *** [/root/FC31-64_K5.3.14_GCC9.2.1/x86_64-native-linuxapp-gcc/7222f93613314e26abda8a8c47e1cbe8/dpdk/mk/rte.sdkroot.mk:77: install] Error 2


*Make Build Failed #14:
OS: RHEL77-64
Target: x86_64-native-linuxapp-gcc
/root/RHEL77-64_K3.10.0_GCC4.8.5/x86_64-native-linuxapp-gcc/7222f93613314e26abda8a8c47e1cbe8/dpdk/x86_64-native-linuxapp-gcc/lib/librte_ipsec.a(ipsec_sad.o): In function `__ipsec_sad_lookup':
ipsec_sad.c:(.text+0x1fb): undefined reference to `rte_hash_lookup_with_hash_bulk_data'
ipsec_sad.c:(.text+0x776): undefined reference to `rte_hash_lookup_with_hash_bulk_data'
ipsec_sad.c:(.text+0x7f7): undefined reference to `rte_hash_lookup_with_hash_bulk_data'
collect2: error: ld returned 1 exit status
make[5]: *** [testsad] Error 1
  INSTALL-APP dpdk-procinfo
make[4]: *** [test-sad] Error 2
make[4]: *** Waiting for unfinished jobs....
  CC test_prefetch.o
  INSTALL-MAP dpdk-procinfo.map
  CC cmdline.o
  CC cmdline_flow.o
--
/root/RHEL77-64_K3.10.0_GCC4.8.5/x86_64-native-linuxapp-gcc/7222f93613314e26abda8a8c47e1cbe8/dpdk/x86_64-native-linuxapp-gcc/lib/librte_ipsec.a(ipsec_sad.o): In function `__ipsec_sad_lookup':
ipsec_sad.c:(.text+0x1fb): undefined reference to `rte_hash_lookup_with_hash_bulk_data'
ipsec_sad.c:(.text+0x776): undefined reference to `rte_hash_lookup_with_hash_bulk_data'
ipsec_sad.c:(.text+0x7f7): undefined reference to `rte_hash_lookup_with_hash_bulk_data'
collect2: error: ld returned 1 exit status
make[5]: *** [test] Error 1
make[4]: *** [test] Error 2
make[3]: *** [app] Error 2
make[2]: *** [all] Error 2
make[1]: *** [pre_install] Error 2
make: *** [install] Error 2


*Make Build Failed #15:
OS: SUSE15-64
Target: x86_64-native-linuxapp-clang
  INSTALL-APP dpdk-procinfo
  INSTALL-MAP dpdk-procinfo.map
  INSTALL-APP dpdk-pdump
  INSTALL-MAP dpdk-pdump.map
  CC comp_perf_test_verify.o
clang-5.0.1: error: linker command failed with exit code 1 (use -v to see invocation)
make[5]: *** [/root/SUSE15-64_K4.12.14_Clang5.0.1/x86_64-native-linuxapp-clang/7222f93613314e26abda8a8c47e1cbe8/dpdk/mk/rte.app.mk:446: testsad] Error 1
make[4]: *** [/root/SUSE15-64_K4.12.14_Clang5.0.1/x86_64-native-linuxapp-clang/7222f93613314e26abda8a8c47e1cbe8/dpdk/mk/rte.subdir.mk:35: test-sad] Error 2
make[4]: *** Waiting for unfinished jobs....
== Build app/test-crypto-perf
  CC comp_perf_test_throughput.o
  CC cmdline.o
  CC test_bbdev_vector.o
--
  LD test
/root/SUSE15-64_K4.12.14_Clang5.0.1/x86_64-native-linuxapp-clang/7222f93613314e26abda8a8c47e1cbe8/dpdk/x86_64-native-linuxapp-clang/lib/librte_ipsec.a(ipsec_sad.o): In function `rte_ipsec_sad_lookup':
/root/SUSE15-64_K4.12.14_Clang5.0.1/x86_64-native-linuxapp-clang/7222f93613314e26abda8a8c47e1cbe8/dpdk/lib/librte_ipsec/ipsec_sad.c:(.text.experimental+0x91a): undefined reference to `rte_hash_lookup_with_hash_bulk_data'
/root/SUSE15-64_K4.12.14_Clang5.0.1/x86_64-native-linuxapp-clang/7222f93613314e26abda8a8c47e1cbe8/dpdk/lib/librte_ipsec/ipsec_sad.c:(.text.experimental+0xa3f): undefined reference to `rte_hash_lookup_with_hash_bulk_data'
/root/SUSE15-64_K4.12.14_Clang5.0.1/x86_64-native-linuxapp-clang/7222f93613314e26abda8a8c47e1cbe8/dpdk/lib/librte_ipsec/ipsec_sad.c:(.text.experimental+0xab1): undefined reference to `rte_hash_lookup_with_hash_bulk_data'
clang-5.0.1: error: linker command failed with exit code 1 (use -v to see invocation)
make[5]: *** [/root/SUSE15-64_K4.12.14_Clang5.0.1/x86_64-native-linuxapp-clang/7222f93613314e26abda8a8c47e1cbe8/dpdk/mk/rte.app.mk:446: test] Error 1
make[4]: *** [/root/SUSE15-64_K4.12.14_Clang5.0.1/x86_64-native-linuxapp-clang/7222f93613314e26abda8a8c47e1cbe8/dpdk/mk/rte.subdir.mk:35: test] Error 2
make[3]: *** [/root/SUSE15-64_K4.12.14_Clang5.0.1/x86_64-native-linuxapp-clang/7222f93613314e26abda8a8c47e1cbe8/dpdk/mk/rte.sdkbuild.mk:48: app] Error 2
make[2]: *** [/root/SUSE15-64_K4.12.14_Clang5.0.1/x86_64-native-linuxapp-clang/7222f93613314e26abda8a8c47e1cbe8/dpdk/mk/rte.sdkroot.mk:99: all] Error 2
make[1]: *** [/root/SUSE15-64_K4.12.14_Clang5.0.1/x86_64-native-linuxapp-clang/7222f93613314e26abda8a8c47e1cbe8/dpdk/mk/rte.sdkinstall.mk:61: pre_install] Error 2
make: *** [/root/SUSE15-64_K4.12.14_Clang5.0.1/x86_64-native-linuxapp-clang/7222f93613314e26abda8a8c47e1cbe8/dpdk/mk/rte.sdkroot.mk:77: install] Error 2


*Make Build Failed #16:
OS: RHEL80-64
Target: x86_64-native-linuxapp-gcc
ipsec_sad.c:(.text+0x28e): undefined reference to `rte_hash_lookup_with_hash_bulk_data'
/usr/local/bin/ld: ipsec_sad.c:(.text+0x81d): undefined reference to `rte_hash_lookup_with_hash_bulk_data'
/usr/local/bin/ld: ipsec_sad.c:(.text+0x88d): undefined reference to `rte_hash_lookup_with_hash_bulk_data'
/usr/local/bin/ld: ipsec_sad.c:(.text+0xa5c): undefined reference to `rte_hash_lookup_with_hash_bulk_data'
collect2: error: ld returned 1 exit status
make[5]: *** [/root/RHEL80-64_K3.10.0_GCC8.2.1/x86_64-native-linuxapp-gcc/7222f93613314e26abda8a8c47e1cbe8/dpdk/mk/rte.app.mk:446: testsad] Error 1
== Build app/test-crypto-perf
make[4]: *** [/root/RHEL80-64_K3.10.0_GCC8.2.1/x86_64-native-linuxapp-gcc/7222f93613314e26abda8a8c47e1cbe8/dpdk/mk/rte.subdir.mk:36: test-sad] Error 2
make[4]: *** Waiting for unfinished jobs....
  CC test_bbdev_perf.o
  CC parameters.o
  INSTALL-APP dpdk-pdump
  CC test_prefetch.o
--
ipsec_sad.c:(.text+0x28e): undefined reference to `rte_hash_lookup_with_hash_bulk_data'
/usr/local/bin/ld: ipsec_sad.c:(.text+0x81d): undefined reference to `rte_hash_lookup_with_hash_bulk_data'
/usr/local/bin/ld: ipsec_sad.c:(.text+0x88d): undefined reference to `rte_hash_lookup_with_hash_bulk_data'
/usr/local/bin/ld: ipsec_sad.c:(.text+0xa5c): undefined reference to `rte_hash_lookup_with_hash_bulk_data'
collect2: error: ld returned 1 exit status
make[5]: *** [/root/RHEL80-64_K3.10.0_GCC8.2.1/x86_64-native-linuxapp-gcc/7222f93613314e26abda8a8c47e1cbe8/dpdk/mk/rte.app.mk:446: test] Error 1
make[4]: *** [/root/RHEL80-64_K3.10.0_GCC8.2.1/x86_64-native-linuxapp-gcc/7222f93613314e26abda8a8c47e1cbe8/dpdk/mk/rte.subdir.mk:35: test] Error 2
make[3]: *** [/root/RHEL80-64_K3.10.0_GCC8.2.1/x86_64-native-linuxapp-gcc/7222f93613314e26abda8a8c47e1cbe8/dpdk/mk/rte.sdkbuild.mk:48: app] Error 2
make[2]: *** [/root/RHEL80-64_K3.10.0_GCC8.2.1/x86_64-native-linuxapp-gcc/7222f93613314e26abda8a8c47e1cbe8/dpdk/mk/rte.sdkroot.mk:99: all] Error 2
make[1]: *** [/root/RHEL80-64_K3.10.0_GCC8.2.1/x86_64-native-linuxapp-gcc/7222f93613314e26abda8a8c47e1cbe8/dpdk/mk/rte.sdkinstall.mk:61: pre_install] Error 2
make: *** [/root/RHEL80-64_K3.10.0_GCC8.2.1/x86_64-native-linuxapp-gcc/7222f93613314e26abda8a8c47e1cbe8/dpdk/mk/rte.sdkroot.mk:77: install] Error 2


*Make Build Failed #17:
OS: FC31-64
Target: x86_64-native-linuxapp-clang
ipsec_sad.c:(.text.experimental+0x8f1): undefined reference to `rte_hash_lookup_with_hash_bulk_data'
/usr/bin/ld: ipsec_sad.c:(.text.experimental+0xa31): undefined reference to `rte_hash_lookup_with_hash_bulk_data'
/usr/bin/ld: ipsec_sad.c:(.text.experimental+0xaa7): undefined reference to `rte_hash_lookup_with_hash_bulk_data'
  CC test_bbdev_perf.o
  INSTALL-APP testacl
clang-9: error: linker command failed with exit code 1 (use -v to see invocation)
  INSTALL-MAP testacl.map
make[5]: *** [/root/FC31-64_K5.3.14_Clang9.0.0/x86_64-native-linuxapp-clang/7222f93613314e26abda8a8c47e1cbe8/dpdk/mk/rte.app.mk:446: testsad] Error 1
  CC init.o
  CC resource.o
  CC runtime.o
  CC parameters.o
  CC test_resource.o
  CC comp_perf_test_throughput.o
  CC comp_perf_test_cyclecount.o
  CC cmdline.o
  CC pipeline_stub.o
make[4]: *** [/root/FC31-64_K5.3.14_Clang9.0.0/x86_64-native-linuxapp-clang/7222f93613314e26abda8a8c47e1cbe8/dpdk/mk/rte.subdir.mk:35: test-sad] Error 2
make[4]: *** Waiting for unfinished jobs....
== Build app/test-crypto-perf
  CC pipeline_hash.o
  CC comp_perf_test_common.o
  CC test_prefetch.o
--
  LD test
/usr/bin/ld: /root/FC31-64_K5.3.14_Clang9.0.0/x86_64-native-linuxapp-clang/7222f93613314e26abda8a8c47e1cbe8/dpdk/x86_64-native-linuxapp-clang/lib/librte_ipsec.a(ipsec_sad.o): in function `rte_ipsec_sad_lookup':
ipsec_sad.c:(.text.experimental+0x8f1): undefined reference to `rte_hash_lookup_with_hash_bulk_data'
/usr/bin/ld: ipsec_sad.c:(.text.experimental+0xa31): undefined reference to `rte_hash_lookup_with_hash_bulk_data'
/usr/bin/ld: ipsec_sad.c:(.text.experimental+0xaa7): undefined reference to `rte_hash_lookup_with_hash_bulk_data'
clang-9: error: linker command failed with exit code 1 (use -v to see invocation)
make[5]: *** [/root/FC31-64_K5.3.14_Clang9.0.0/x86_64-native-linuxapp-clang/7222f93613314e26abda8a8c47e1cbe8/dpdk/mk/rte.app.mk:446: test] Error 1
make[4]: *** [/root/FC31-64_K5.3.14_Clang9.0.0/x86_64-native-linuxapp-clang/7222f93613314e26abda8a8c47e1cbe8/dpdk/mk/rte.subdir.mk:35: test] Error 2
make[3]: *** [/root/FC31-64_K5.3.14_Clang9.0.0/x86_64-native-linuxapp-clang/7222f93613314e26abda8a8c47e1cbe8/dpdk/mk/rte.sdkbuild.mk:48: app] Error 2
make[2]: *** [/root/FC31-64_K5.3.14_Clang9.0.0/x86_64-native-linuxapp-clang/7222f93613314e26abda8a8c47e1cbe8/dpdk/mk/rte.sdkroot.mk:99: all] Error 2
make[1]: *** [/root/FC31-64_K5.3.14_Clang9.0.0/x86_64-native-linuxapp-clang/7222f93613314e26abda8a8c47e1cbe8/dpdk/mk/rte.sdkinstall.mk:61: pre_install] Error 2
make: *** [/root/FC31-64_K5.3.14_Clang9.0.0/x86_64-native-linuxapp-clang/7222f93613314e26abda8a8c47e1cbe8/dpdk/mk/rte.sdkroot.mk:77: install] Error 2


*Make Build Failed #18:
OS: UB1604-64
Target: x86_64-native-linuxapp-gcc
/root/UB1604-64_K4.4.0_GCC5.4.0/x86_64-native-linuxapp-gcc/7222f93613314e26abda8a8c47e1cbe8/dpdk/x86_64-native-linuxapp-gcc/lib/librte_ipsec.a(ipsec_sad.o): In function `__ipsec_sad_lookup':
ipsec_sad.c:(.text+0x2da): undefined reference to `rte_hash_lookup_with_hash_bulk_data'
ipsec_sad.c:(.text+0x876): undefined reference to `rte_hash_lookup_with_hash_bulk_data'
ipsec_sad.c:(.text+0x8f4): undefined reference to `rte_hash_lookup_with_hash_bulk_data'
collect2: error: ld returned 1 exit status
/root/UB1604-64_K4.4.0_GCC5.4.0/x86_64-native-linuxapp-gcc/7222f93613314e26abda8a8c47e1cbe8/dpdk/mk/rte.app.mk:444: recipe for target 'testsad' failed
make[5]: *** [testsad] Error 1
/root/UB1604-64_K4.4.0_GCC5.4.0/x86_64-native-linuxapp-gcc/7222f93613314e26abda8a8c47e1cbe8/dpdk/mk/rte.subdir.mk:35: recipe for target 'test-sad' failed
make[4]: *** [test-sad] Error 2
make[4]: *** Waiting for unfinished jobs....
  CC test_bbdev_vector.o
  CC parameters.o
  CC test_byteorder.o
  INSTALL-APP testacl
--
/root/UB1604-64_K4.4.0_GCC5.4.0/x86_64-native-linuxapp-gcc/7222f93613314e26abda8a8c47e1cbe8/dpdk/x86_64-native-linuxapp-gcc/lib/librte_ipsec.a(ipsec_sad.o): In function `__ipsec_sad_lookup':
ipsec_sad.c:(.text+0x2da): undefined reference to `rte_hash_lookup_with_hash_bulk_data'
ipsec_sad.c:(.text+0x876): undefined reference to `rte_hash_lookup_with_hash_bulk_data'
ipsec_sad.c:(.text+0x8f4): undefined reference to `rte_hash_lookup_with_hash_bulk_data'
collect2: error: ld returned 1 exit status
/root/UB1604-64_K4.4.0_GCC5.4.0/x86_64-native-linuxapp-gcc/7222f93613314e26abda8a8c47e1cbe8/dpdk/mk/rte.app.mk:444: recipe for target 'test' failed
make[5]: *** [test] Error 1
/root/UB1604-64_K4.4.0_GCC5.4.0/x86_64-native-linuxapp-gcc/7222f93613314e26abda8a8c47e1cbe8/dpdk/mk/rte.subdir.mk:35: recipe for target 'test' failed
make[4]: *** [test] Error 2
/root/UB1604-64_K4.4.0_GCC5.4.0/x86_64-native-linuxapp-gcc/7222f93613314e26abda8a8c47e1cbe8/dpdk/mk/rte.sdkbuild.mk:46: recipe for target 'app' failed
make[3]: *** [app] Error 2
/root/UB1604-64_K4.4.0_GCC5.4.0/x86_64-native-linuxapp-gcc/7222f93613314e26abda8a8c47e1cbe8/dpdk/mk/rte.sdkroot.mk:98: recipe for target 'all' failed
make[2]: *** [all] Error 2
/root/UB1604-64_K4.4.0_GCC5.4.0/x86_64-native-linuxapp-gcc/7222f93613314e26abda8a8c47e1cbe8/dpdk/mk/rte.sdkinstall.mk:60: recipe for target 'pre_install' failed
make[1]: *** [pre_install] Error 2
/root/UB1604-64_K4.4.0_GCC5.4.0/x86_64-native-linuxapp-gcc/7222f93613314e26abda8a8c47e1cbe8/dpdk/mk/rte.sdkroot.mk:77: recipe for target 'install' failed
make: *** [install] Error 2


*Make Build Failed #19:
OS: UB1804-64
Target: x86_64-native-linuxapp-gcc
ipsec_sad.c:(.text+0x2ba): undefined reference to `rte_hash_lookup_with_hash_bulk_data'
ipsec_sad.c:(.text+0x979): undefined reference to `rte_hash_lookup_with_hash_bulk_data'
ipsec_sad.c:(.text+0x9e3): undefined reference to `rte_hash_lookup_with_hash_bulk_data'
ipsec_sad.c:(.text+0xacd): undefined reference to `rte_hash_lookup_with_hash_bulk_data'
collect2: error: ld returned 1 exit status
/root/UB1804-64_K4.15.0_GCC7.3.0/x86_64-native-linuxapp-gcc/7222f93613314e26abda8a8c47e1cbe8/dpdk/mk/rte.app.mk:444: recipe for target 'testsad' failed
make[5]: *** [testsad] Error 1
/root/UB1804-64_K4.15.0_GCC7.3.0/x86_64-native-linuxapp-gcc/7222f93613314e26abda8a8c47e1cbe8/dpdk/mk/rte.subdir.mk:35: recipe for target 'test-sad' failed
make[4]: *** [test-sad] Error 2
make[4]: *** Waiting for unfinished jobs....
  CC test_barrier.o
  INSTALL-APP testacl
  CC runtime.o
  INSTALL-MAP testacl.map
--
ipsec_sad.c:(.text+0x2ba): undefined reference to `rte_hash_lookup_with_hash_bulk_data'
ipsec_sad.c:(.text+0x979): undefined reference to `rte_hash_lookup_with_hash_bulk_data'
ipsec_sad.c:(.text+0x9e3): undefined reference to `rte_hash_lookup_with_hash_bulk_data'
ipsec_sad.c:(.text+0xacd): undefined reference to `rte_hash_lookup_with_hash_bulk_data'
collect2: error: ld returned 1 exit status
/root/UB1804-64_K4.15.0_GCC7.3.0/x86_64-native-linuxapp-gcc/7222f93613314e26abda8a8c47e1cbe8/dpdk/mk/rte.app.mk:444: recipe for target 'test' failed
make[5]: *** [test] Error 1
/root/UB1804-64_K4.15.0_GCC7.3.0/x86_64-native-linuxapp-gcc/7222f93613314e26abda8a8c47e1cbe8/dpdk/mk/rte.subdir.mk:35: recipe for target 'test' failed
make[4]: *** [test] Error 2
/root/UB1804-64_K4.15.0_GCC7.3.0/x86_64-native-linuxapp-gcc/7222f93613314e26abda8a8c47e1cbe8/dpdk/mk/rte.sdkbuild.mk:46: recipe for target 'app' failed
make[3]: *** [app] Error 2
/root/UB1804-64_K4.15.0_GCC7.3.0/x86_64-native-linuxapp-gcc/7222f93613314e26abda8a8c47e1cbe8/dpdk/mk/rte.sdkroot.mk:98: recipe for target 'all' failed
make[2]: *** [all] Error 2
/root/UB1804-64_K4.15.0_GCC7.3.0/x86_64-native-linuxapp-gcc/7222f93613314e26abda8a8c47e1cbe8/dpdk/mk/rte.sdkinstall.mk:60: recipe for target 'pre_install' failed
make[1]: *** [pre_install] Error 2
/root/UB1804-64_K4.15.0_GCC7.3.0/x86_64-native-linuxapp-gcc/7222f93613314e26abda8a8c47e1cbe8/dpdk/mk/rte.sdkroot.mk:77: recipe for target 'install' failed
make: *** [install] Error 2


*Make Build Failed #20:
OS: FreeBSD1201-64
Target: x86_64-native-bsdapp-gcc+shared
ipsec_sad.c:(.text+0x2ac): undefined reference to `rte_hash_lookup_with_hash_bulk_data'
/usr/local/bin/ld: ipsec_sad.c:(.text+0x862): undefined reference to `rte_hash_lookup_with_hash_bulk_data'
/usr/local/bin/ld: ipsec_sad.c:(.text+0x8ca): undefined reference to `rte_hash_lookup_with_hash_bulk_data'
/usr/local/bin/ld: ipsec_sad.c:(.text+0xb1c): undefined reference to `rte_hash_lookup_with_hash_bulk_data'
collect2: error: ld returned 1 exit status
gmake[5]: *** [/root/FreeBSD1201-64_K12.1_GCC7.3.0/x86_64-native-bsdapp-gcc+shared/7222f93613314e26abda8a8c47e1cbe8/dpdk/mk/rte.lib.mk:100: librte_ipsec.so.0.200.2] Error 1
gmake[4]: *** [/root/FreeBSD1201-64_K12.1_GCC7.3.0/x86_64-native-bsdapp-gcc+shared/7222f93613314e26abda8a8c47e1cbe8/dpdk/mk/rte.subdir.mk:37: librte_ipsec] Error 2
gmake[4]: *** Waiting for unfinished jobs....
  SYMLINK-FILE include/rte_port_ethdev.h
  SYMLINK-FILE include/rte_port.h
  SYMLINK-FILE include/rte_port_ring.h
  SYMLINK-FILE include/rte_port_frag.h
--
  CC rte_port_eventdev.o
  LD librte_bpf.so.0.200.2
  INSTALL-LIB librte_bpf.so.0.200.2
  LD librte_port.so.20.0.2
  INSTALL-LIB librte_port.so.20.0.2
gmake[3]: *** [/root/FreeBSD1201-64_K12.1_GCC7.3.0/x86_64-native-bsdapp-gcc+shared/7222f93613314e26abda8a8c47e1cbe8/dpdk/mk/rte.sdkbuild.mk:48: lib] Error 2
gmake[2]: *** [/root/FreeBSD1201-64_K12.1_GCC7.3.0/x86_64-native-bsdapp-gcc+shared/7222f93613314e26abda8a8c47e1cbe8/dpdk/mk/rte.sdkroot.mk:99: all] Error 2
gmake[1]: *** [/root/FreeBSD1201-64_K12.1_GCC7.3.0/x86_64-native-bsdapp-gcc+shared/7222f93613314e26abda8a8c47e1cbe8/dpdk/mk/rte.sdkinstall.mk:61: pre_install] Error 2
gmake: *** [/root/FreeBSD1201-64_K12.1_GCC7.3.0/x86_64-native-bsdapp-gcc+shared/7222f93613314e26abda8a8c47e1cbe8/dpdk/mk/rte.sdkroot.mk:77: install] Error 2


*Make Build Failed #21:
OS: FreeBSD1201-64
Target: x86_64-native-bsdapp-gcc
ipsec_sad.c:(.text+0x27c): undefined reference to `rte_hash_lookup_with_hash_bulk_data'
/usr/local/bin/ld: ipsec_sad.c:(.text+0x825): undefined reference to `rte_hash_lookup_with_hash_bulk_data'
/usr/local/bin/ld: ipsec_sad.c:(.text+0x89d): undefined reference to `rte_hash_lookup_with_hash_bulk_data'
/usr/local/bin/ld: ipsec_sad.c:(.text+0xaa9): undefined reference to `rte_hash_lookup_with_hash_bulk_data'
collect2: error: ld returned 1 exit status
gmake[5]: *** [/root/FreeBSD1201-64_K12.1_GCC9.2.0/x86_64-native-bsdapp-gcc/7222f93613314e26abda8a8c47e1cbe8/dpdk/mk/rte.app.mk:446: testsad] Error 1
  CC cperf_options_parsing.o
  CC test_bbdev_vector.o
  CC test_resource.o
  CC test_prefetch.o
  CC comp_perf_test_throughput.o
--
  CC cperf_test_vectors.o
  CC test_per_lcore.o
  CC comp_perf_test_cyclecount.o
  CC cperf_test_throughput.o
  CC test_atomic.o
gmake[4]: *** [/root/FreeBSD1201-64_K12.1_GCC9.2.0/x86_64-native-bsdapp-gcc/7222f93613314e26abda8a8c47e1cbe8/dpdk/mk/rte.subdir.mk:35: test-sad] Error 2
gmake[4]: *** Waiting for unfinished jobs....
  CC cperf_test_latency.o
  CC cmdline.o
  CC pipeline_stub.o
== Build app/test-eventdev
--
ipsec_sad.c:(.text+0x27c): undefined reference to `rte_hash_lookup_with_hash_bulk_data'
/usr/local/bin/ld: ipsec_sad.c:(.text+0x825): undefined reference to `rte_hash_lookup_with_hash_bulk_data'
/usr/local/bin/ld: ipsec_sad.c:(.text+0x89d): undefined reference to `rte_hash_lookup_with_hash_bulk_data'
/usr/local/bin/ld: ipsec_sad.c:(.text+0xaa9): undefined reference to `rte_hash_lookup_with_hash_bulk_data'
collect2: error: ld returned 1 exit status
gmake[5]: *** [/root/FreeBSD1201-64_K12.1_GCC9.2.0/x86_64-native-bsdapp-gcc/7222f93613314e26abda8a8c47e1cbe8/dpdk/mk/rte.app.mk:446: test] Error 1
gmake[4]: *** [/root/FreeBSD1201-64_K12.1_GCC9.2.0/x86_64-native-bsdapp-gcc/7222f93613314e26abda8a8c47e1cbe8/dpdk/mk/rte.subdir.mk:35: test] Error 2
gmake[3]: *** [/root/FreeBSD1201-64_K12.1_GCC9.2.0/x86_64-native-bsdapp-gcc/7222f93613314e26abda8a8c47e1cbe8/dpdk/mk/rte.sdkbuild.mk:48: app] Error 2
gmake[2]: *** [/root/FreeBSD1201-64_K12.1_GCC9.2.0/x86_64-native-bsdapp-gcc/7222f93613314e26abda8a8c47e1cbe8/dpdk/mk/rte.sdkroot.mk:99: all] Error 2
gmake[1]: *** [/root/FreeBSD1201-64_K12.1_GCC9.2.0/x86_64-native-bsdapp-gcc/7222f93613314e26abda8a8c47e1cbe8/dpdk/mk/rte.sdkinstall.mk:61: pre_install] Error 2
gmake: *** [/root/FreeBSD1201-64_K12.1_GCC9.2.0/x86_64-native-bsdapp-gcc/7222f93613314e26abda8a8c47e1cbe8/dpdk/mk/rte.sdkroot.mk:77: install] Error 2


*Make Build Failed #22:
OS: FreeBSD1201-64
Target: x86_64-native-bsdapp-clang
                                                  /root/FreeBSD1201-64_K12.1_Clang8.0.1/x86_64-native-bsdapp-clang/7222f93613314e26abda8a8c47e1cbe8/dpdk/x86_64-native-bsdapp-clang/lib/librte_pmd_sfc_efx.a(sfc_mcdi.o)
efx_intr_disable                                  /root/FreeBSD1201-64_K12.1_Clang8.0.1/x86_64-native-bsdapp-clang/7222f93613314e26abda8a8c47e1cbe8/dpdk/x86_64-native-bsdapp-clang/lib/librte_pmd_sfc_efx.a(efx_intr.o)
                                                  /root/FreeBSD1201-64_K12.1_Clang8.0.1/x86_64-native-bsdapp-clang/7222f93613314e26abda8a8c47e1cbe8/dpdk/x86_64-native-bsdapp-clang/lib/librte_pmd_sfc_efx.a(sfc_intr.o)
efx_intr_enable                                   /root/FreeBSD1201-64_K12.1_Clang8.0.1/x86_64-native-bsdapp-clang/7222f93613314e26abda8a8c47e1cbe8/dpdk/x86_64-native-bsdapp-clang/lib/librte_pmd_sfc_efx.a(efx_intr.o)
                                                  /root/FreeBSD1201-64_K12.1_Clang8.0.1/x86_64-native-bsdapp-clang/7222f93613314e26abda8a8c47e1cbe8/dpdk/x86_64-native-bsdapp-clang/lib/librte_pmd_sfc_efx.a(sfc_intr.o)
efx_intr_fatal                                    /root/FreeBSD1201-64_K12.1_Clang8.0.1/x86_64-native-bsdapp-clang/7222f93613314e26abda8a8c47e1cbe8/dpdk/x86_64-native-bsdapp-clang/lib/librte_pmd_sfc_efx.a(efx_intr.o)
                                                  /root/FreeBSD1201-64_K12.1_Clang8.0.1/x86_64-native-bsdapp-clang/7222f93613314e26abda8a8c47e1cbe8/dpdk/x86_64-native-bsdapp-clang/lib/librte_pmd_sfc_efx.a(sfc_intr.o)
efx_intr_status_line                              /root/FreeBSD1201-64_K12.1_Clang8.0.1/x86_64-native-bsdapp-clang/7222f93613314e26abda8a8c47e1cbe8/dpdk/x86_64-native-bsdapp-clang/lib/librte_pmd_sfc_efx.a(efx_intr.o)
                                                  /root/FreeBSD1201-64_K12.1_Clang8.0.1/x86_64-native-bsdapp-clang/7222f93613314e26abda8a8c47e1cbe8/dpdk/x86_64-native-bsdapp-clang/lib/librte_pmd_sfc_efx.a(sfc_intr.o)
efx_intr_status_message                           /root/FreeBSD1201-64_K12.1_Clang8.0.1/x86_64-native-bsdapp-clang/7222f93613314e26abda8a8c47e1cbe8/dpdk/x86_64-native-bsdapp-clang/lib/librte_pmd_sfc_efx.a(efx_intr.o)
                                                  /root/FreeBSD1201-64_K12.1_Clang8.0.1/x86_64-native-bsdapp-clang/7222f93613314e26abda8a8c47e1cbe8/dpdk/x86_64-native-bsdapp-clang/lib/librte_pmd_sfc_efx.a(sfc_intr.o)
--
sfc_ev_qstop                                      /root/FreeBSD1201-64_K12.1_Clang8.0.1/x86_64-native-bsdapp-clang/7222f93613314e26abda8a8c47e1cbe8/dpdk/x86_64-native-bsdapp-clang/lib/librte_pmd_sfc_efx.a(sfc_ev.o)
                                                  /root/FreeBSD1201-64_K12.1_Clang8.0.1/x86_64-native-bsdapp-clang/7222f93613314e26abda8a8c47e1cbe8/dpdk/x86_64-native-bsdapp-clang/lib/librte_pmd_sfc_efx.a(sfc_rx.o)
                                                  /root/FreeBSD1201-64_K12.1_Clang8.0.1/x86_64-native-bsdapp-clang/7222f93613314e26abda8a8c47e1cbe8/dpdk/x86_64-native-bsdapp-clang/lib/librte_pmd_sfc_efx.a(sfc_tx.o)
sfc_rx_qflush_done                                /root/FreeBSD1201-64_K12.1_Clang8.0.1/x86_64-native-bsdapp-clang/7222f93613314e26abda8a8c47e1cbe8/dpdk/x86_64-native-bsdapp-clang/lib/librte_pmd_sfc_efx.a(sfc_rx.o)
                                                  /root/FreeBSD1201-64_K12.1_Clang8.0.1/x86_64-native-bsdapp-clang/7222f93613314e26abda8a8c47e1cbe8/dpdk/x86_64-native-bsdapp-clang/lib/librte_pmd_sfc_efx.a(sfc_ev.o)
sfc_rx_qflush_failed                              /root/FreeBSD1201-64_K12.1_Clang8.0.1/x86_64-native-bsdapp-clang/7222f93613314e26abda8a8c47e1cbe8/dpdk/x86_64-native-bsdapp-clang/lib/librte_pmd_sfc_efx.a(sfc_rx.o)
                                                  /root/FreeBSD1201-64_K12.1_Clang8.0.1/x86_64-native-bsdapp-clang/7222f93613314e26abda8a8c47e1cbe8/dpdk/x86_64-native-bsdapp-clang/lib/librte_pmd_sfc_efx.a(sfc_ev.o)
sfc_rxq_info_by_dp_rxq                            /root/FreeBSD1201-64_K12.1_Clang8.0.1/x86_64-native-bsdapp-clang/7222f93613314e26abda8a8c47e1cbe8/dpdk/x86_64-native-bsdapp-clang/lib/librte_pmd_sfc_efx.a(sfc_rx.o)
                                                  /root/FreeBSD1201-64_K12.1_Clang8.0.1/x86_64-native-bsdapp-clang/7222f93613314e26abda8a8c47e1cbe8/dpdk/x86_64-native-bsdapp-clang/lib/librte_pmd_sfc_efx.a(sfc_ev.o)
sfc_tx_qflush_done                                /root/FreeBSD1201-64_K12.1_Clang8.0.1/x86_64-native-bsdapp-clang/7222f93613314e26abda8a8c47e1cbe8/dpdk/x86_64-native-bsdapp-clang/lib/librte_pmd_sfc_efx.a(sfc_tx.o)
                                                  /root/FreeBSD1201-64_K12.1_Clang8.0.1/x86_64-native-bsdapp-clang/7222f93613314e26abda8a8c47e1cbe8/dpdk/x86_64-native-bsdapp-clang/lib/librte_pmd_sfc_efx.a(sfc_ev.o)
--
                                                  /root/FreeBSD1201-64_K12.1_Clang8.0.1/x86_64-native-bsdapp-clang/7222f93613314e26abda8a8c47e1cbe8/dpdk/x86_64-native-bsdapp-clang/lib/librte_pmd_sfc_efx.a(efx_intr.o)
ef10_intr_disable_unlocked                        /root/FreeBSD1201-64_K12.1_Clang8.0.1/x86_64-native-bsdapp-clang/7222f93613314e26abda8a8c47e1cbe8/dpdk/x86_64-native-bsdapp-clang/lib/librte_pmd_sfc_efx.a(ef10_intr.o)
                                                  /root/FreeBSD1201-64_K12.1_Clang8.0.1/x86_64-native-bsdapp-clang/7222f93613314e26abda8a8c47e1cbe8/dpdk/x86_64-native-bsdapp-clang/lib/librte_pmd_sfc_efx.a(efx_intr.o)
ef10_intr_enable                                  /root/FreeBSD1201-64_K12.1_Clang8.0.1/x86_64-native-bsdapp-clang/7222f93613314e26abda8a8c47e1cbe8/dpdk/x86_64-native-bsdapp-clang/lib/librte_pmd_sfc_efx.a(ef10_intr.o)
                                                  /root/FreeBSD1201-64_K12.1_Clang8.0.1/x86_64-native-bsdapp-clang/7222f93613314e26abda8a8c47e1cbe8/dpdk/x86_64-native-bsdapp-clang/lib/librte_pmd_sfc_efx.a(efx_intr.o)
ef10_intr_fatal                                   /root/FreeBSD1201-64_K12.1_Clang8.0.1/x86_64-native-bsdapp-clang/7222f93613314e26abda8a8c47e1cbe8/dpdk/x86_64-native-bsdapp-clang/lib/librte_pmd_sfc_efx.a(ef10_intr.o)
                                                  /root/FreeBSD1201-64_K12.1_Clang8.0.1/x86_64-native-bsdapp-clang/7222f93613314e26abda8a8c47e1cbe8/dpdk/x86_64-native-bsdapp-clang/lib/librte_pmd_sfc_efx.a(efx_intr.o)
ef10_intr_fini                                    /root/FreeBSD1201-64_K12.1_Clang8.0.1/x86_64-native-bsdapp-clang/7222f93613314e26abda8a8c47e1cbe8/dpdk/x86_64-native-bsdapp-clang/lib/librte_pmd_sfc_efx.a(ef10_intr.o)
                                                  /root/FreeBSD1201-64_K12.1_Clang8.0.1/x86_64-native-bsdapp-clang/7222f93613314e26abda8a8c47e1cbe8/dpdk/x86_64-native-bsdapp-clang/lib/librte_pmd_sfc_efx.a(efx_intr.o)
ef10_intr_init                                    /root/FreeBSD1201-64_K12.1_Clang8.0.1/x86_64-native-bsdapp-clang/7222f93613314e26abda8a8c47e1cbe8/dpdk/x86_64-native-bsdapp-clang/lib/librte_pmd_sfc_efx.a(ef10_intr.o)
                                                  /root/FreeBSD1201-64_K12.1_Clang8.0.1/x86_64-native-bsdapp-clang/7222f93613314e26abda8a8c47e1cbe8/dpdk/x86_64-native-bsdapp-clang/lib/librte_pmd_sfc_efx.a(efx_intr.o)
--
                                                  /root/FreeBSD1201-64_K12.1_Clang8.0.1/x86_64-native-bsdapp-clang/7222f93613314e26abda8a8c47e1cbe8/dpdk/x86_64-native-bsdapp-clang/lib/librte_pmd_sfc_efx.a(sfc_mcdi.o)
efx_intr_disable                                  /root/FreeBSD1201-64_K12.1_Clang8.0.1/x86_64-native-bsdapp-clang/7222f93613314e26abda8a8c47e1cbe8/dpdk/x86_64-native-bsdapp-clang/lib/librte_pmd_sfc_efx.a(efx_intr.o)
                                                  /root/FreeBSD1201-64_K12.1_Clang8.0.1/x86_64-native-bsdapp-clang/7222f93613314e26abda8a8c47e1cbe8/dpdk/x86_64-native-bsdapp-clang/lib/librte_pmd_sfc_efx.a(sfc_intr.o)
efx_intr_enable                                   /root/FreeBSD1201-64_K12.1_Clang8.0.1/x86_64-native-bsdapp-clang/7222f93613314e26abda8a8c47e1cbe8/dpdk/x86_64-native-bsdapp-clang/lib/librte_pmd_sfc_efx.a(efx_intr.o)
                                                  /root/FreeBSD1201-64_K12.1_Clang8.0.1/x86_64-native-bsdapp-clang/7222f93613314e26abda8a8c47e1cbe8/dpdk/x86_64-native-bsdapp-clang/lib/librte_pmd_sfc_efx.a(sfc_intr.o)
efx_intr_fatal                                    /root/FreeBSD1201-64_K12.1_Clang8.0.1/x86_64-native-bsdapp-clang/7222f93613314e26abda8a8c47e1cbe8/dpdk/x86_64-native-bsdapp-clang/lib/librte_pmd_sfc_efx.a(efx_intr.o)
                                                  /root/FreeBSD1201-64_K12.1_Clang8.0.1/x86_64-native-bsdapp-clang/7222f93613314e26abda8a8c47e1cbe8/dpdk/x86_64-native-bsdapp-clang/lib/librte_pmd_sfc_efx.a(sfc_intr.o)
efx_intr_status_line                              /root/FreeBSD1201-64_K12.1_Clang8.0.1/x86_64-native-bsdapp-clang/7222f93613314e26abda8a8c47e1cbe8/dpdk/x86_64-native-bsdapp-clang/lib/librte_pmd_sfc_efx.a(efx_intr.o)
                                                  /root/FreeBSD1201-64_K12.1_Clang8.0.1/x86_64-native-bsdapp-clang/7222f93613314e26abda8a8c47e1cbe8/dpdk/x86_64-native-bsdapp-clang/lib/librte_pmd_sfc_efx.a(sfc_intr.o)
efx_intr_status_message                           /root/FreeBSD1201-64_K12.1_Clang8.0.1/x86_64-native-bsdapp-clang/7222f93613314e26abda8a8c47e1cbe8/dpdk/x86_64-native-bsdapp-clang/lib/librte_pmd_sfc_efx.a(efx_intr.o)
                                                  /root/FreeBSD1201-64_K12.1_Clang8.0.1/x86_64-native-bsdapp-clang/7222f93613314e26abda8a8c47e1cbe8/dpdk/x86_64-native-bsdapp-clang/lib/librte_pmd_sfc_efx.a(sfc_intr.o)
--
sfc_ev_qstop                                      /root/FreeBSD1201-64_K12.1_Clang8.0.1/x86_64-native-bsdapp-clang/7222f93613314e26abda8a8c47e1cbe8/dpdk/x86_64-native-bsdapp-clang/lib/librte_pmd_sfc_efx.a(sfc_ev.o)
                                                  /root/FreeBSD1201-64_K12.1_Clang8.0.1/x86_64-native-bsdapp-clang/7222f93613314e26abda8a8c47e1cbe8/dpdk/x86_64-native-bsdapp-clang/lib/librte_pmd_sfc_efx.a(sfc_rx.o)
                                                  /root/FreeBSD1201-64_K12.1_Clang8.0.1/x86_64-native-bsdapp-clang/7222f93613314e26abda8a8c47e1cbe8/dpdk/x86_64-native-bsdapp-clang/lib/librte_pmd_sfc_efx.a(sfc_tx.o)
sfc_rx_qflush_done                                /root/FreeBSD1201-64_K12.1_Clang8.0.1/x86_64-native-bsdapp-clang/7222f93613314e26abda8a8c47e1cbe8/dpdk/x86_64-native-bsdapp-clang/lib/librte_pmd_sfc_efx.a(sfc_rx.o)
                                                  /root/FreeBSD1201-64_K12.1_Clang8.0.1/x86_64-native-bsdapp-clang/7222f93613314e26abda8a8c47e1cbe8/dpdk/x86_64-native-bsdapp-clang/lib/librte_pmd_sfc_efx.a(sfc_ev.o)
sfc_rx_qflush_failed                              /root/FreeBSD1201-64_K12.1_Clang8.0.1/x86_64-native-bsdapp-clang/7222f93613314e26abda8a8c47e1cbe8/dpdk/x86_64-native-bsdapp-clang/lib/librte_pmd_sfc_efx.a(sfc_rx.o)
                                                  /root/FreeBSD1201-64_K12.1_Clang8.0.1/x86_64-native-bsdapp-clang/7222f93613314e26abda8a8c47e1cbe8/dpdk/x86_64-native-bsdapp-clang/lib/librte_pmd_sfc_efx.a(sfc_ev.o)
sfc_rxq_info_by_dp_rxq                            /root/FreeBSD1201-64_K12.1_Clang8.0.1/x86_64-native-bsdapp-clang/7222f93613314e26abda8a8c47e1cbe8/dpdk/x86_64-native-bsdapp-clang/lib/librte_pmd_sfc_efx.a(sfc_rx.o)
                                                  /root/FreeBSD1201-64_K12.1_Clang8.0.1/x86_64-native-bsdapp-clang/7222f93613314e26abda8a8c47e1cbe8/dpdk/x86_64-native-bsdapp-clang/lib/librte_pmd_sfc_efx.a(sfc_ev.o)
sfc_tx_qflush_done                                /root/FreeBSD1201-64_K12.1_Clang8.0.1/x86_64-native-bsdapp-clang/7222f93613314e26abda8a8c47e1cbe8/dpdk/x86_64-native-bsdapp-clang/lib/librte_pmd_sfc_efx.a(sfc_tx.o)
                                                  /root/FreeBSD1201-64_K12.1_Clang8.0.1/x86_64-native-bsdapp-clang/7222f93613314e26abda8a8c47e1cbe8/dpdk/x86_64-native-bsdapp-clang/lib/librte_pmd_sfc_efx.a(sfc_ev.o)
--
                                                  /root/FreeBSD1201-64_K12.1_Clang8.0.1/x86_64-native-bsdapp-clang/7222f93613314e26abda8a8c47e1cbe8/dpdk/x86_64-native-bsdapp-clang/lib/librte_pmd_sfc_efx.a(efx_intr.o)
ef10_intr_disable_unlocked                        /root/FreeBSD1201-64_K12.1_Clang8.0.1/x86_64-native-bsdapp-clang/7222f93613314e26abda8a8c47e1cbe8/dpdk/x86_64-native-bsdapp-clang/lib/librte_pmd_sfc_efx.a(ef10_intr.o)
                                                  /root/FreeBSD1201-64_K12.1_Clang8.0.1/x86_64-native-bsdapp-clang/7222f93613314e26abda8a8c47e1cbe8/dpdk/x86_64-native-bsdapp-clang/lib/librte_pmd_sfc_efx.a(efx_intr.o)
ef10_intr_enable                                  /root/FreeBSD1201-64_K12.1_Clang8.0.1/x86_64-native-bsdapp-clang/7222f93613314e26abda8a8c47e1cbe8/dpdk/x86_64-native-bsdapp-clang/lib/librte_pmd_sfc_efx.a(ef10_intr.o)
                                                  /root/FreeBSD1201-64_K12.1_Clang8.0.1/x86_64-native-bsdapp-clang/7222f93613314e26abda8a8c47e1cbe8/dpdk/x86_64-native-bsdapp-clang/lib/librte_pmd_sfc_efx.a(efx_intr.o)
ef10_intr_fatal                                   /root/FreeBSD1201-64_K12.1_Clang8.0.1/x86_64-native-bsdapp-clang/7222f93613314e26abda8a8c47e1cbe8/dpdk/x86_64-native-bsdapp-clang/lib/librte_pmd_sfc_efx.a(ef10_intr.o)
                                                  /root/FreeBSD1201-64_K12.1_Clang8.0.1/x86_64-native-bsdapp-clang/7222f93613314e26abda8a8c47e1cbe8/dpdk/x86_64-native-bsdapp-clang/lib/librte_pmd_sfc_efx.a(efx_intr.o)
ef10_intr_fini                                    /root/FreeBSD1201-64_K12.1_Clang8.0.1/x86_64-native-bsdapp-clang/7222f93613314e26abda8a8c47e1cbe8/dpdk/x86_64-native-bsdapp-clang/lib/librte_pmd_sfc_efx.a(ef10_intr.o)
                                                  /root/FreeBSD1201-64_K12.1_Clang8.0.1/x86_64-native-bsdapp-clang/7222f93613314e26abda8a8c47e1cbe8/dpdk/x86_64-native-bsdapp-clang/lib/librte_pmd_sfc_efx.a(efx_intr.o)
ef10_intr_init                                    /root/FreeBSD1201-64_K12.1_Clang8.0.1/x86_64-native-bsdapp-clang/7222f93613314e26abda8a8c47e1cbe8/dpdk/x86_64-native-bsdapp-clang/lib/librte_pmd_sfc_efx.a(ef10_intr.o)
                                                  /root/FreeBSD1201-64_K12.1_Clang8.0.1/x86_64-native-bsdapp-clang/7222f93613314e26abda8a8c47e1cbe8/dpdk/x86_64-native-bsdapp-clang/lib/librte_pmd_sfc_efx.a(efx_intr.o)
--
                                                  /root/FreeBSD1201-64_K12.1_Clang8.0.1/x86_64-native-bsdapp-clang/7222f93613314e26abda8a8c47e1cbe8/dpdk/x86_64-native-bsdapp-clang/lib/librte_rawdev_octeontx2_dma.a(otx2_dpi_rawdev.o)
sdp_rawdev_pci_driver_pmd_info                    /root/FreeBSD1201-64_K12.1_Clang8.0.1/x86_64-native-bsdapp-clang/7222f93613314e26abda8a8c47e1cbe8/dpdk/x86_64-native-bsdapp-clang/lib/librte_rawdev_octeontx2_ep.a(otx2_ep_rawdev.o)
default_sdp_conf                                  /root/FreeBSD1201-64_K12.1_Clang8.0.1/x86_64-native-bsdapp-clang/7222f93613314e26abda8a8c47e1cbe8/dpdk/x86_64-native-bsdapp-clang/lib/librte_rawdev_octeontx2_ep.a(otx2_ep_rawdev.o)
sdp_delete_iqs                                    /root/FreeBSD1201-64_K12.1_Clang8.0.1/x86_64-native-bsdapp-clang/7222f93613314e26abda8a8c47e1cbe8/dpdk/x86_64-native-bsdapp-clang/lib/librte_rawdev_octeontx2_ep.a(otx2_ep_enqdeq.o)
                                                  /root/FreeBSD1201-64_K12.1_Clang8.0.1/x86_64-native-bsdapp-clang/7222f93613314e26abda8a8c47e1cbe8/dpdk/x86_64-native-bsdapp-clang/lib/librte_rawdev_octeontx2_ep.a(otx2_ep_rawdev.o)
sdp_delete_oqs                                    /root/FreeBSD1201-64_K12.1_Clang8.0.1/x86_64-native-bsdapp-clang/7222f93613314e26abda8a8c47e1cbe8/dpdk/x86_64-native-bsdapp-clang/lib/lclang: error: linker command failed with exit code 1 (use -v to see invocation)
gmake[5]: *** [/root/FreeBSD1201-64_K12.1_Clang8.0.1/x86_64-native-bsdapp-clang/7222f93613314e26abda8a8c47e1cbe8/dpdk/mk/rte.app.mk:446: testsad] Error 1
gmake[4]: *** [/root/FreeBSD1201-64_K12.1_Clang8.0.1/x86_64-native-bsdapp-clang/7222f93613314e26abda8a8c47e1cbe8/dpdk/mk/rte.subdir.mk:37: test-sad] Error 2
gmake[4]: *** Waiting for unfinished jobs....
  CC test_bbdev_perf.o
  CC runtime.o
ibrte_rawdev_octeontx2_ep.a(otx2_ep_enqdeq.o)
                                                  /root/FreeBSD1201-64_K12.1_Clang8.0.1/x86_64-native-bsdapp-clang/7222f93613314e26abda8a8c47e1cbe8/dpdk/x86_64-native-bsdapp-clang/lib/librte_rawdev_octeontx2_ep.a(otx2_ep_rawdev.o)
--
                                                  /root/FreeBSD1201-64_K12.1_Clang8.0.1/x86_64-native-bsdapp-clang/7222f93613314e26abda8a8c47e1cbe8/dpdk/x86_64-native-bsdapp-clang/lib/librte_pmd_sfc_efx.a(sfc_mcdi.o)
efx_intr_disable                                  /root/FreeBSD1201-64_K12.1_Clang8.0.1/x86_64-native-bsdapp-clang/7222f93613314e26abda8a8c47e1cbe8/dpdk/x86_64-native-bsdapp-clang/lib/librte_pmd_sfc_efx.a(efx_intr.o)
                                                  /root/FreeBSD1201-64_K12.1_Clang8.0.1/x86_64-native-bsdapp-clang/7222f93613314e26abda8a8c47e1cbe8/dpdk/x86_64-native-bsdapp-clang/lib/librte_pmd_sfc_efx.a(sfc_intr.o)
efx_intr_enable                                   /root/FreeBSD1201-64_K12.1_Clang8.0.1/x86_64-native-bsdapp-clang/7222f93613314e26abda8a8c47e1cbe8/dpdk/x86_64-native-bsdapp-clang/lib/librte_pmd_sfc_efx.a(efx_intr.o)
                                                  /root/FreeBSD1201-64_K12.1_Clang8.0.1/x86_64-native-bsdapp-clang/7222f93613314e26abda8a8c47e1cbe8/dpdk/x86_64-native-bsdapp-clang/lib/librte_pmd_sfc_efx.a(sfc_intr.o)
efx_intr_fatal                                    /root/FreeBSD1201-64_K12.1_Clang8.0.1/x86_64-native-bsdapp-clang/7222f93613314e26abda8a8c47e1cbe8/dpdk/x86_64-native-bsdapp-clang/lib/librte_pmd_sfc_efx.a(efx_intr.o)
                                                  /root/FreeBSD1201-64_K12.1_Clang8.0.1/x86_64-native-bsdapp-clang/7222f93613314e26abda8a8c47e1cbe8/dpdk/x86_64-native-bsdapp-clang/lib/librte_pmd_sfc_efx.a(sfc_intr.o)
efx_intr_status_line                              /root/FreeBSD1201-64_K12.1_Clang8.0.1/x86_64-native-bsdapp-clang/7222f93613314e26abda8a8c47e1cbe8/dpdk/x86_64-native-bsdapp-clang/lib/librte_pmd_sfc_efx.a(efx_intr.o)
                                                  /root/FreeBSD1201-64_K12.1_Clang8.0.1/x86_64-native-bsdapp-clang/7222f93613314e26abda8a8c47e1cbe8/dpdk/x86_64-native-bsdapp-clang/lib/librte_pmd_sfc_efx.a(sfc_intr.o)
efx_intr_status_message                           /root/FreeBSD1201-64_K12.1_Clang8.0.1/x86_64-native-bsdapp-clang/7222f93613314e26abda8a8c47e1cbe8/dpdk/x86_64-native-bsdapp-clang/lib/librte_pmd_sfc_efx.a(efx_intr.o)
                                                  /root/FreeBSD1201-64_K12.1_Clang8.0.1/x86_64-native-bsdapp-clang/7222f93613314e26abda8a8c47e1cbe8/dpdk/x86_64-native-bsdapp-clang/lib/librte_pmd_sfc_efx.a(sfc_intr.o)
--
sfc_ev_qstop                                      /root/FreeBSD1201-64_K12.1_Clang8.0.1/x86_64-native-bsdapp-clang/7222f93613314e26abda8a8c47e1cbe8/dpdk/x86_64-native-bsdapp-clang/lib/librte_pmd_sfc_efx.a(sfc_ev.o)
                                                  /root/FreeBSD1201-64_K12.1_Clang8.0.1/x86_64-native-bsdapp-clang/7222f93613314e26abda8a8c47e1cbe8/dpdk/x86_64-native-bsdapp-clang/lib/librte_pmd_sfc_efx.a(sfc_rx.o)
                                                  /root/FreeBSD1201-64_K12.1_Clang8.0.1/x86_64-native-bsdapp-clang/7222f93613314e26abda8a8c47e1cbe8/dpdk/x86_64-native-bsdapp-clang/lib/librte_pmd_sfc_efx.a(sfc_tx.o)
sfc_rx_qflush_done                                /root/FreeBSD1201-64_K12.1_Clang8.0.1/x86_64-native-bsdapp-clang/7222f93613314e26abda8a8c47e1cbe8/dpdk/x86_64-native-bsdapp-clang/lib/librte_pmd_sfc_efx.a(sfc_rx.o)
                                                  /root/FreeBSD1201-64_K12.1_Clang8.0.1/x86_64-native-bsdapp-clang/7222f93613314e26abda8a8c47e1cbe8/dpdk/x86_64-native-bsdapp-clang/lib/librte_pmd_sfc_efx.a(sfc_ev.o)
sfc_rx_qflush_failed                              /root/FreeBSD1201-64_K12.1_Clang8.0.1/x86_64-native-bsdapp-clang/7222f93613314e26abda8a8c47e1cbe8/dpdk/x86_64-native-bsdapp-clang/lib/librte_pmd_sfc_efx.a(sfc_rx.o)
                                                  /root/FreeBSD1201-64_K12.1_Clang8.0.1/x86_64-native-bsdapp-clang/7222f93613314e26abda8a8c47e1cbe8/dpdk/x86_64-native-bsdapp-clang/lib/librte_pmd_sfc_efx.a(sfc_ev.o)
sfc_rxq_info_by_dp_rxq                            /root/FreeBSD1201-64_K12.1_Clang8.0.1/x86_64-native-bsdapp-clang/7222f93613314e26abda8a8c47e1cbe8/dpdk/x86_64-native-bsdapp-clang/lib/librte_pmd_sfc_efx.a(sfc_rx.o)
                                                  /root/FreeBSD1201-64_K12.1_Clang8.0.1/x86_64-native-bsdapp-clang/7222f93613314e26abda8a8c47e1cbe8/dpdk/x86_64-native-bsdapp-clang/lib/librte_pmd_sfc_efx.a(sfc_ev.o)
sfc_tx_qflush_done                                /root/FreeBSD1201-64_K12.1_Clang8.0.1/x86_64-native-bsdapp-clang/7222f93613314e26abda8a8c47e1cbe8/dpdk/x86_64-native-bsdapp-clang/lib/librte_pmd_sfc_efx.a(sfc_tx.o)
                                                  /root/FreeBSD1201-64_K12.1_Clang8.0.1/x86_64-native-bsdapp-clang/7222f93613314e26abda8a8c47e1cbe8/dpdk/x86_64-native-bsdapp-clang/lib/librte_pmd_sfc_efx.a(sfc_ev.o)
--
                                                  /root/FreeBSD1201-64_K12.1_Clang8.0.1/x86_64-native-bsdapp-clang/7222f93613314e26abda8a8c47e1cbe8/dpdk/x86_64-native-bsdapp-clang/lib/librte_pmd_sfc_efx.a(efx_intr.o)
ef10_intr_disable_unlocked                        /root/FreeBSD1201-64_K12.1_Clang8.0.1/x86_64-native-bsdapp-clang/7222f93613314e26abda8a8c47e1cbe8/dpdk/x86_64-native-bsdapp-clang/lib/librte_pmd_sfc_efx.a(ef10_intr.o)
                                                  /root/FreeBSD1201-64_K12.1_Clang8.0.1/x86_64-native-bsdapp-clang/7222f93613314e26abda8a8c47e1cbe8/dpdk/x86_64-native-bsdapp-clang/lib/librte_pmd_sfc_efx.a(efx_intr.o)
ef10_intr_enable                                  /root/FreeBSD1201-64_K12.1_Clang8.0.1/x86_64-native-bsdapp-clang/7222f93613314e26abda8a8c47e1cbe8/dpdk/x86_64-native-bsdapp-clang/lib/librte_pmd_sfc_efx.a(ef10_intr.o)
                                                  /root/FreeBSD1201-64_K12.1_Clang8.0.1/x86_64-native-bsdapp-clang/7222f93613314e26abda8a8c47e1cbe8/dpdk/x86_64-native-bsdapp-clang/lib/librte_pmd_sfc_efx.a(efx_intr.o)
ef10_intr_fatal                                   /root/FreeBSD1201-64_K12.1_Clang8.0.1/x86_64-native-bsdapp-clang/7222f93613314e26abda8a8c47e1cbe8/dpdk/x86_64-native-bsdapp-clang/lib/librte_pmd_sfc_efx.a(ef10_intr.o)
                                                  /root/FreeBSD1201-64_K12.1_Clang8.0.1/x86_64-native-bsdapp-clang/7222f93613314e26abda8a8c47e1cbe8/dpdk/x86_64-native-bsdapp-clang/lib/librte_pmd_sfc_efx.a(efx_intr.o)
ef10_intr_fini                                    /root/FreeBSD1201-64_K12.1_Clang8.0.1/x86_64-native-bsdapp-clang/7222f93613314e26abda8a8c47e1cbe8/dpdk/x86_64-native-bsdapp-clang/lib/librte_pmd_sfc_efx.a(ef10_intr.o)
                                                  /root/FreeBSD1201-64_K12.1_Clang8.0.1/x86_64-native-bsdapp-clang/7222f93613314e26abda8a8c47e1cbe8/dpdk/x86_64-native-bsdapp-clang/lib/librte_pmd_sfc_efx.a(efx_intr.o)
ef10_intr_init                                    /root/FreeBSD1201-64_K12.1_Clang8.0.1/x86_64-native-bsdapp-clang/7222f93613314e26abda8a8c47e1cbe8/dpdk/x86_64-native-bsdapp-clang/lib/librte_pmd_sfc_efx.a(ef10_intr.o)
                                                  /root/FreeBSD1201-64_K12.1_Clang8.0.1/x86_64-native-bsdapp-clang/7222f93613314e26abda8a8c47e1cbe8/dpdk/x86_64-native-bsdapp-clang/lib/librte_pmd_sfc_efx.a(efx_intr.o)
--
                                                  /root/FreeBSD1201-64_K12.1_Clang8.0.1/x86_64-native-bsdapp-clang/7222f93613314e26abda8a8c47e1cbe8/dpdk/x86_64-native-bsdapp-clang/lib/librte_pmd_sfc_efx.a(sfc_mcdi.o)
efx_intr_disable                                  /root/FreeBSD1201-64_K12.1_Clang8.0.1/x86_64-native-bsdapp-clang/7222f93613314e26abda8a8c47e1cbe8/dpdk/x86_64-native-bsdapp-clang/lib/librte_pmd_sfc_efx.a(efx_intr.o)
                                                  /root/FreeBSD1201-64_K12.1_Clang8.0.1/x86_64-native-bsdapp-clang/7222f93613314e26abda8a8c47e1cbe8/dpdk/x86_64-native-bsdapp-clang/lib/librte_pmd_sfc_efx.a(sfc_intr.o)
efx_intr_enable                                   /root/FreeBSD1201-64_K12.1_Clang8.0.1/x86_64-native-bsdapp-clang/7222f93613314e26abda8a8c47e1cbe8/dpdk/x86_64-native-bsdapp-clang/lib/librte_pmd_sfc_efx.a(efx_intr.o)
                                                  /root/FreeBSD1201-64_K12.1_Clang8.0.1/x86_64-native-bsdapp-clang/7222f93613314e26abda8a8c47e1cbe8/dpdk/x86_64-native-bsdapp-clang/lib/librte_pmd_sfc_efx.a(sfc_intr.o)
efx_intr_fatal                                    /root/FreeBSD1201-64_K12.1_Clang8.0.1/x86_64-native-bsdapp-clang/7222f93613314e26abda8a8c47e1cbe8/dpdk/x86_64-native-bsdapp-clang/lib/librte_pmd_sfc_efx.a(efx_intr.o)
                                                  /root/FreeBSD1201-64_K12.1_Clang8.0.1/x86_64-native-bsdapp-clang/7222f93613314e26abda8a8c47e1cbe8/dpdk/x86_64-native-bsdapp-clang/lib/librte_pmd_sfc_efx.a(sfc_intr.o)
efx_intr_status_line                              /root/FreeBSD1201-64_K12.1_Clang8.0.1/x86_64-native-bsdapp-clang/7222f93613314e26abda8a8c47e1cbe8/dpdk/x86_64-native-bsdapp-clang/lib/librte_pmd_sfc_efx.a(efx_intr.o)
                                                  /root/FreeBSD1201-64_K12.1_Clang8.0.1/x86_64-native-bsdapp-clang/7222f93613314e26abda8a8c47e1cbe8/dpdk/x86_64-native-bsdapp-clang/lib/librte_pmd_sfc_efx.a(sfc_intr.o)
efx_intr_status_message                           /root/FreeBSD1201-64_K12.1_Clang8.0.1/x86_64-native-bsdapp-clang/7222f93613314e26abda8a8c47e1cbe8/dpdk/x86_64-native-bsdapp-clang/lib/librte_pmd_sfc_efx.a(efx_intr.o)
                                                  /root/FreeBSD1201-64_K12.1_Clang8.0.1/x86_64-native-bsdapp-clang/7222f93613314e26abda8a8c47e1cbe8/dpdk/x86_64-native-bsdapp-clang/lib/librte_pmd_sfc_efx.a(sfc_intr.o)
--
sfc_ev_qstop                                      /root/FreeBSD1201-64_K12.1_Clang8.0.1/x86_64-native-bsdapp-clang/7222f93613314e26abda8a8c47e1cbe8/dpdk/x86_64-native-bsdapp-clang/lib/librte_pmd_sfc_efx.a(sfc_ev.o)
                                                  /root/FreeBSD1201-64_K12.1_Clang8.0.1/x86_64-native-bsdapp-clang/7222f93613314e26abda8a8c47e1cbe8/dpdk/x86_64-native-bsdapp-clang/lib/librte_pmd_sfc_efx.a(sfc_rx.o)
                                                  /root/FreeBSD1201-64_K12.1_Clang8.0.1/x86_64-native-bsdapp-clang/7222f93613314e26abda8a8c47e1cbe8/dpdk/x86_64-native-bsdapp-clang/lib/librte_pmd_sfc_efx.a(sfc_tx.o)
sfc_rx_qflush_done                                /root/FreeBSD1201-64_K12.1_Clang8.0.1/x86_64-native-bsdapp-clang/7222f93613314e26abda8a8c47e1cbe8/dpdk/x86_64-native-bsdapp-clang/lib/librte_pmd_sfc_efx.a(sfc_rx.o)
                                                  /root/FreeBSD1201-64_K12.1_Clang8.0.1/x86_64-native-bsdapp-clang/7222f93613314e26abda8a8c47e1cbe8/dpdk/x86_64-native-bsdapp-clang/lib/librte_pmd_sfc_efx.a(sfc_ev.o)
sfc_rx_qflush_failed                              /root/FreeBSD1201-64_K12.1_Clang8.0.1/x86_64-native-bsdapp-clang/7222f93613314e26abda8a8c47e1cbe8/dpdk/x86_64-native-bsdapp-clang/lib/librte_pmd_sfc_efx.a(sfc_rx.o)
                                                  /root/FreeBSD1201-64_K12.1_Clang8.0.1/x86_64-native-bsdapp-clang/7222f93613314e26abda8a8c47e1cbe8/dpdk/x86_64-native-bsdapp-clang/lib/librte_pmd_sfc_efx.a(sfc_ev.o)
sfc_rxq_info_by_dp_rxq                            /root/FreeBSD1201-64_K12.1_Clang8.0.1/x86_64-native-bsdapp-clang/7222f93613314e26abda8a8c47e1cbe8/dpdk/x86_64-native-bsdapp-clang/lib/librte_pmd_sfc_efx.a(sfc_rx.o)
                                                  /root/FreeBSD1201-64_K12.1_Clang8.0.1/x86_64-native-bsdapp-clang/7222f93613314e26abda8a8c47e1cbe8/dpdk/x86_64-native-bsdapp-clang/lib/librte_pmd_sfc_efx.a(sfc_ev.o)
sfc_tx_qflush_done                                /root/FreeBSD1201-64_K12.1_Clang8.0.1/x86_64-native-bsdapp-clang/7222f93613314e26abda8a8c47e1cbe8/dpdk/x86_64-native-bsdapp-clang/lib/librte_pmd_sfc_efx.a(sfc_tx.o)
                                                  /root/FreeBSD1201-64_K12.1_Clang8.0.1/x86_64-native-bsdapp-clang/7222f93613314e26abda8a8c47e1cbe8/dpdk/x86_64-native-bsdapp-clang/lib/librte_pmd_sfc_efx.a(sfc_ev.o)
--
                                                  /root/FreeBSD1201-64_K12.1_Clang8.0.1/x86_64-native-bsdapp-clang/7222f93613314e26abda8a8c47e1cbe8/dpdk/x86_64-native-bsdapp-clang/lib/librte_pmd_sfc_efx.a(efx_intr.o)
ef10_intr_disable_unlocked                        /root/FreeBSD1201-64_K12.1_Clang8.0.1/x86_64-native-bsdapp-clang/7222f93613314e26abda8a8c47e1cbe8/dpdk/x86_64-native-bsdapp-clang/lib/librte_pmd_sfc_efx.a(ef10_intr.o)
                                                  /root/FreeBSD1201-64_K12.1_Clang8.0.1/x86_64-native-bsdapp-clang/7222f93613314e26abda8a8c47e1cbe8/dpdk/x86_64-native-bsdapp-clang/lib/librte_pmd_sfc_efx.a(efx_intr.o)
ef10_intr_enable                                  /root/FreeBSD1201-64_K12.1_Clang8.0.1/x86_64-native-bsdapp-clang/7222f93613314e26abda8a8c47e1cbe8/dpdk/x86_64-native-bsdapp-clang/lib/librte_pmd_sfc_efx.a(ef10_intr.o)
                                                  /root/FreeBSD1201-64_K12.1_Clang8.0.1/x86_64-native-bsdapp-clang/7222f93613314e26abda8a8c47e1cbe8/dpdk/x86_64-native-bsdapp-clang/lib/librte_pmd_sfc_efx.a(efx_intr.o)
ef10_intr_fatal                                   /root/FreeBSD1201-64_K12.1_Clang8.0.1/x86_64-native-bsdapp-clang/7222f93613314e26abda8a8c47e1cbe8/dpdk/x86_64-native-bsdapp-clang/lib/librte_pmd_sfc_efx.a(ef10_intr.o)
                                                  /root/FreeBSD1201-64_K12.1_Clang8.0.1/x86_64-native-bsdapp-clang/7222f93613314e26abda8a8c47e1cbe8/dpdk/x86_64-native-bsdapp-clang/lib/librte_pmd_sfc_efx.a(efx_intr.o)
ef10_intr_fini                                    /root/FreeBSD1201-64_K12.1_Clang8.0.1/x86_64-native-bsdapp-clang/7222f93613314e26abda8a8c47e1cbe8/dpdk/x86_64-native-bsdapp-clang/lib/librte_pmd_sfc_efx.a(ef10_intr.o)
                                                  /root/FreeBSD1201-64_K12.1_Clang8.0.1/x86_64-native-bsdapp-clang/7222f93613314e26abda8a8c47e1cbe8/dpdk/x86_64-native-bsdapp-clang/lib/librte_pmd_sfc_efx.a(efx_intr.o)
ef10_intr_init                                    /root/FreeBSD1201-64_K12.1_Clang8.0.1/x86_64-native-bsdapp-clang/7222f93613314e26abda8a8c47e1cbe8/dpdk/x86_64-native-bsdapp-clang/lib/librte_pmd_sfc_efx.a(ef10_intr.o)
                                                  /root/FreeBSD1201-64_K12.1_Clang8.0.1/x86_64-native-bsdapp-clang/7222f93613314e26abda8a8c47e1cbe8/dpdk/x86_64-native-bsdapp-clang/lib/librte_pmd_sfc_efx.a(efx_intr.o)
--
                                                  /root/FreeBSD1201-64_K12.1_Clang8.0.1/x86_64-native-bsdapp-clang/7222f93613314e26abda8a8c47e1cbe8/dpdk/x86_64-native-bsdapp-clang/lib/librte_pmd_sfc_efx.a(sfc_mcdi.o)
efx_intr_disable                                  /root/FreeBSD1201-64_K12.1_Clang8.0.1/x86_64-native-bsdapp-clang/7222f93613314e26abda8a8c47e1cbe8/dpdk/x86_64-native-bsdapp-clang/lib/librte_pmd_sfc_efx.a(efx_intr.o)
                                                  /root/FreeBSD1201-64_K12.1_Clang8.0.1/x86_64-native-bsdapp-clang/7222f93613314e26abda8a8c47e1cbe8/dpdk/x86_64-native-bsdapp-clang/lib/librte_pmd_sfc_efx.a(sfc_intr.o)
efx_intr_enable                                   /root/FreeBSD1201-64_K12.1_Clang8.0.1/x86_64-native-bsdapp-clang/7222f93613314e26abda8a8c47e1cbe8/dpdk/x86_64-native-bsdapp-clang/lib/librte_pmd_sfc_efx.a(efx_intr.o)
                                                  /root/FreeBSD1201-64_K12.1_Clang8.0.1/x86_64-native-bsdapp-clang/7222f93613314e26abda8a8c47e1cbe8/dpdk/x86_64-native-bsdapp-clang/lib/librte_pmd_sfc_efx.a(sfc_intr.o)
efx_intr_fatal                                    /root/FreeBSD1201-64_K12.1_Clang8.0.1/x86_64-native-bsdapp-clang/7222f93613314e26abda8a8c47e1cbe8/dpdk/x86_64-native-bsdapp-clang/lib/librte_pmd_sfc_efx.a(efx_intr.o)
                                                  /root/FreeBSD1201-64_K12.1_Clang8.0.1/x86_64-native-bsdapp-clang/7222f93613314e26abda8a8c47e1cbe8/dpdk/x86_64-native-bsdapp-clang/lib/librte_pmd_sfc_efx.a(sfc_intr.o)
efx_intr_status_line                              /root/FreeBSD1201-64_K12.1_Clang8.0.1/x86_64-native-bsdapp-clang/7222f93613314e26abda8a8c47e1cbe8/dpdk/x86_64-native-bsdapp-clang/lib/librte_pmd_sfc_efx.a(efx_intr.o)
                                                  /root/FreeBSD1201-64_K12.1_Clang8.0.1/x86_64-native-bsdapp-clang/7222f93613314e26abda8a8c47e1cbe8/dpdk/x86_64-native-bsdapp-clang/lib/librte_pmd_sfc_efx.a(sfc_intr.o)
efx_intr_status_message                           /root/FreeBSD1201-64_K12.1_Clang8.0.1/x86_64-native-bsdapp-clang/7222f93613314e26abda8a8c47e1cbe8/dpdk/x86_64-native-bsdapp-clang/lib/librte_pmd_sfc_efx.a(efx_intr.o)
                                                  /root/FreeBSD1201-64_K12.1_Clang8.0.1/x86_64-native-bsdapp-clang/7222f93613314e26abda8a8c47e1cbe8/dpdk/x86_64-native-bsdapp-clang/lib/librte_pmd_sfc_efx.a(sfc_intr.o)
--
sfc_ev_qstop                                      /root/FreeBSD1201-64_K12.1_Clang8.0.1/x86_64-native-bsdapp-clang/7222f93613314e26abda8a8c47e1cbe8/dpdk/x86_64-native-bsdapp-clang/lib/librte_pmd_sfc_efx.a(sfc_ev.o)
                                                  /root/FreeBSD1201-64_K12.1_Clang8.0.1/x86_64-native-bsdapp-clang/7222f93613314e26abda8a8c47e1cbe8/dpdk/x86_64-native-bsdapp-clang/lib/librte_pmd_sfc_efx.a(sfc_rx.o)
                                                  /root/FreeBSD1201-64_K12.1_Clang8.0.1/x86_64-native-bsdapp-clang/7222f93613314e26abda8a8c47e1cbe8/dpdk/x86_64-native-bsdapp-clang/lib/librte_pmd_sfc_efx.a(sfc_tx.o)
sfc_rx_qflush_done                                /root/FreeBSD1201-64_K12.1_Clang8.0.1/x86_64-native-bsdapp-clang/7222f93613314e26abda8a8c47e1cbe8/dpdk/x86_64-native-bsdapp-clang/lib/librte_pmd_sfc_efx.a(sfc_rx.o)
                                                  /root/FreeBSD1201-64_K12.1_Clang8.0.1/x86_64-native-bsdapp-clang/7222f93613314e26abda8a8c47e1cbe8/dpdk/x86_64-native-bsdapp-clang/lib/librte_pmd_sfc_efx.a(sfc_ev.o)
sfc_rx_qflush_failed                              /root/FreeBSD1201-64_K12.1_Clang8.0.1/x86_64-native-bsdapp-clang/7222f93613314e26abda8a8c47e1cbe8/dpdk/x86_64-native-bsdapp-clang/lib/librte_pmd_sfc_efx.a(sfc_rx.o)
                                                  /root/FreeBSD1201-64_K12.1_Clang8.0.1/x86_64-native-bsdapp-clang/7222f93613314e26abda8a8c47e1cbe8/dpdk/x86_64-native-bsdapp-clang/lib/librte_pmd_sfc_efx.a(sfc_ev.o)
sfc_rxq_info_by_dp_rxq                            /root/FreeBSD1201-64_K12.1_Clang8.0.1/x86_64-native-bsdapp-clang/7222f93613314e26abda8a8c47e1cbe8/dpdk/x86_64-native-bsdapp-clang/lib/librte_pmd_sfc_efx.a(sfc_rx.o)
                                                  /root/FreeBSD1201-64_K12.1_Clang8.0.1/x86_64-native-bsdapp-clang/7222f93613314e26abda8a8c47e1cbe8/dpdk/x86_64-native-bsdapp-clang/lib/librte_pmd_sfc_efx.a(sfc_ev.o)
sfc_tx_qflush_done                                /root/FreeBSD1201-64_K12.1_Clang8.0.1/x86_64-native-bsdapp-clang/7222f93613314e26abda8a8c47e1cbe8/dpdk/x86_64-native-bsdapp-clang/lib/librte_pmd_sfc_efx.a(sfc_tx.o)
                                                  /root/FreeBSD1201-64_K12.1_Clang8.0.1/x86_64-native-bsdapp-clang/7222f93613314e26abda8a8c47e1cbe8/dpdk/x86_64-native-bsdapp-clang/lib/librte_pmd_sfc_efx.a(sfc_ev.o)
--
                                                  /root/FreeBSD1201-64_K12.1_Clang8.0.1/x86_64-native-bsdapp-clang/7222f93613314e26abda8a8c47e1cbe8/dpdk/x86_64-native-bsdapp-clang/lib/librte_pmd_sfc_efx.a(efx_intr.o)
ef10_intr_disable_unlocked                        /root/FreeBSD1201-64_K12.1_Clang8.0.1/x86_64-native-bsdapp-clang/7222f93613314e26abda8a8c47e1cbe8/dpdk/x86_64-native-bsdapp-clang/lib/librte_pmd_sfc_efx.a(ef10_intr.o)
                                                  /root/FreeBSD1201-64_K12.1_Clang8.0.1/x86_64-native-bsdapp-clang/7222f93613314e26abda8a8c47e1cbe8/dpdk/x86_64-native-bsdapp-clang/lib/librte_pmd_sfc_efx.a(efx_intr.o)
ef10_intr_enable                                  /root/FreeBSD1201-64_K12.1_Clang8.0.1/x86_64-native-bsdapp-clang/7222f93613314e26abda8a8c47e1cbe8/dpdk/x86_64-native-bsdapp-clang/lib/librte_pmd_sfc_efx.a(ef10_intr.o)
                                                  /root/FreeBSD1201-64_K12.1_Clang8.0.1/x86_64-native-bsdapp-clang/7222f93613314e26abda8a8c47e1cbe8/dpdk/x86_64-native-bsdapp-clang/lib/librte_pmd_sfc_efx.a(efx_intr.o)
ef10_intr_fatal                                   /root/FreeBSD1201-64_K12.1_Clang8.0.1/x86_64-native-bsdapp-clang/7222f93613314e26abda8a8c47e1cbe8/dpdk/x86_64-native-bsdapp-clang/lib/librte_pmd_sfc_efx.a(ef10_intr.o)
                                                  /root/FreeBSD1201-64_K12.1_Clang8.0.1/x86_64-native-bsdapp-clang/7222f93613314e26abda8a8c47e1cbe8/dpdk/x86_64-native-bsdapp-clang/lib/librte_pmd_sfc_efx.a(efx_intr.o)
ef10_intr_fini                                    /root/FreeBSD1201-64_K12.1_Clang8.0.1/x86_64-native-bsdapp-clang/7222f93613314e26abda8a8c47e1cbe8/dpdk/x86_64-native-bsdapp-clang/lib/librte_pmd_sfc_efx.a(ef10_intr.o)
                                                  /root/FreeBSD1201-64_K12.1_Clang8.0.1/x86_64-native-bsdapp-clang/7222f93613314e26abda8a8c47e1cbe8/dpdk/x86_64-native-bsdapp-clang/lib/librte_pmd_sfc_efx.a(efx_intr.o)
ef10_intr_init                                    /root/FreeBSD1201-64_K12.1_Clang8.0.1/x86_64-native-bsdapp-clang/7222f93613314e26abda8a8c47e1cbe8/dpdk/x86_64-native-bsdapp-clang/lib/librte_pmd_sfc_efx.a(ef10_intr.o)
                                                  /root/FreeBSD1201-64_K12.1_Clang8.0.1/x86_64-native-bsdapp-clang/7222f93613314e26abda8a8c47e1cbe8/dpdk/x86_64-native-bsdapp-clang/lib/librte_pmd_sfc_efx.a(efx_intr.o)
--
                                                  /root/FreeBSD1201-64_K12.1_Clang8.0.1/x86_64-native-bsdapp-clang/7222f93613314e26abda8a8c47e1cbe8/dpdk/x86_64-native-bsdapp-clang/lib/librte_pmd_sfc_efx.a(sfc_mcdi.o)
efx_intr_disable                                  /root/FreeBSD1201-64_K12.1_Clang8.0.1/x86_64-native-bsdapp-clang/7222f93613314e26abda8a8c47e1cbe8/dpdk/x86_64-native-bsdapp-clang/lib/librte_pmd_sfc_efx.a(efx_intr.o)
                                                  /root/FreeBSD1201-64_K12.1_Clang8.0.1/x86_64-native-bsdapp-clang/7222f93613314e26abda8a8c47e1cbe8/dpdk/x86_64-native-bsdapp-clang/lib/librte_pmd_sfc_efx.a(sfc_intr.o)
efx_intr_enable                                   /root/FreeBSD1201-64_K12.1_Clang8.0.1/x86_64-native-bsdapp-clang/7222f93613314e26abda8a8c47e1cbe8/dpdk/x86_64-native-bsdapp-clang/lib/librte_pmd_sfc_efx.a(efx_intr.o)
                                                  /root/FreeBSD1201-64_K12.1_Clang8.0.1/x86_64-native-bsdapp-clang/7222f93613314e26abda8a8c47e1cbe8/dpdk/x86_64-native-bsdapp-clang/lib/librte_pmd_sfc_efx.a(sfc_intr.o)
efx_intr_fatal                                    /root/FreeBSD1201-64_K12.1_Clang8.0.1/x86_64-native-bsdapp-clang/7222f93613314e26abda8a8c47e1cbe8/dpdk/x86_64-native-bsdapp-clang/lib/librte_pmd_sfc_efx.a(efx_intr.o)
                                                  /root/FreeBSD1201-64_K12.1_Clang8.0.1/x86_64-native-bsdapp-clang/7222f93613314e26abda8a8c47e1cbe8/dpdk/x86_64-native-bsdapp-clang/lib/librte_pmd_sfc_efx.a(sfc_intr.o)
efx_intr_status_line                              /root/FreeBSD1201-64_K12.1_Clang8.0.1/x86_64-native-bsdapp-clang/7222f93613314e26abda8a8c47e1cbe8/dpdk/x86_64-native-bsdapp-clang/lib/librte_pmd_sfc_efx.a(efx_intr.o)
                                                  /root/FreeBSD1201-64_K12.1_Clang8.0.1/x86_64-native-bsdapp-clang/7222f93613314e26abda8a8c47e1cbe8/dpdk/x86_64-native-bsdapp-clang/lib/librte_pmd_sfc_efx.a(sfc_intr.o)
efx_intr_status_message                           /root/FreeBSD1201-64_K12.1_Clang8.0.1/x86_64-native-bsdapp-clang/7222f93613314e26abda8a8c47e1cbe8/dpdk/x86_64-native-bsdapp-clang/lib/librte_pmd_sfc_efx.a(efx_intr.o)
                                                  /root/FreeBSD1201-64_K12.1_Clang8.0.1/x86_64-native-bsdapp-clang/7222f93613314e26abda8a8c47e1cbe8/dpdk/x86_64-native-bsdapp-clang/lib/librte_pmd_sfc_efx.a(sfc_intr.o)
--
sfc_ev_qstop                                      /root/FreeBSD1201-64_K12.1_Clang8.0.1/x86_64-native-bsdapp-clang/7222f93613314e26abda8a8c47e1cbe8/dpdk/x86_64-native-bsdapp-clang/lib/librte_pmd_sfc_efx.a(sfc_ev.o)
                                                  /root/FreeBSD1201-64_K12.1_Clang8.0.1/x86_64-native-bsdapp-clang/7222f93613314e26abda8a8c47e1cbe8/dpdk/x86_64-native-bsdapp-clang/lib/librte_pmd_sfc_efx.a(sfc_rx.o)
                                                  /root/FreeBSD1201-64_K12.1_Clang8.0.1/x86_64-native-bsdapp-clang/7222f93613314e26abda8a8c47e1cbe8/dpdk/x86_64-native-bsdapp-clang/lib/librte_pmd_sfc_efx.a(sfc_tx.o)
sfc_rx_qflush_done                                /root/FreeBSD1201-64_K12.1_Clang8.0.1/x86_64-native-bsdapp-clang/7222f93613314e26abda8a8c47e1cbe8/dpdk/x86_64-native-bsdapp-clang/lib/librte_pmd_sfc_efx.a(sfc_rx.o)
                                                  /root/FreeBSD1201-64_K12.1_Clang8.0.1/x86_64-native-bsdapp-clang/7222f93613314e26abda8a8c47e1cbe8/dpdk/x86_64-native-bsdapp-clang/lib/librte_pmd_sfc_efx.a(sfc_ev.o)
sfc_rx_qflush_failed                              /root/FreeBSD1201-64_K12.1_Clang8.0.1/x86_64-native-bsdapp-clang/7222f93613314e26abda8a8c47e1cbe8/dpdk/x86_64-native-bsdapp-clang/lib/librte_pmd_sfc_efx.a(sfc_rx.o)
                                                  /root/FreeBSD1201-64_K12.1_Clang8.0.1/x86_64-native-bsdapp-clang/7222f93613314e26abda8a8c47e1cbe8/dpdk/x86_64-native-bsdapp-clang/lib/librte_pmd_sfc_efx.a(sfc_ev.o)
sfc_rxq_info_by_dp_rxq                            /root/FreeBSD1201-64_K12.1_Clang8.0.1/x86_64-native-bsdapp-clang/7222f93613314e26abda8a8c47e1cbe8/dpdk/x86_64-native-bsdapp-clang/lib/librte_pmd_sfc_efx.a(sfc_rx.o)
                                                  /root/FreeBSD1201-64_K12.1_Clang8.0.1/x86_64-native-bsdapp-clang/7222f93613314e26abda8a8c47e1cbe8/dpdk/x86_64-native-bsdapp-clang/lib/librte_pmd_sfc_efx.a(sfc_ev.o)
sfc_tx_qflush_done                                /root/FreeBSD1201-64_K12.1_Clang8.0.1/x86_64-native-bsdapp-clang/7222f93613314e26abda8a8c47e1cbe8/dpdk/x86_64-native-bsdapp-clang/lib/librte_pmd_sfc_efx.a(sfc_tx.o)
                                                  /root/FreeBSD1201-64_K12.1_Clang8.0.1/x86_64-native-bsdapp-clang/7222f93613314e26abda8a8c47e1cbe8/dpdk/x86_64-native-bsdapp-clang/lib/librte_pmd_sfc_efx.a(sfc_ev.o)
--
                                                  /root/FreeBSD1201-64_K12.1_Clang8.0.1/x86_64-native-bsdapp-clang/7222f93613314e26abda8a8c47e1cbe8/dpdk/x86_64-native-bsdapp-clang/lib/librte_pmd_sfc_efx.a(efx_intr.o)
ef10_intr_disable_unlocked                        /root/FreeBSD1201-64_K12.1_Clang8.0.1/x86_64-native-bsdapp-clang/7222f93613314e26abda8a8c47e1cbe8/dpdk/x86_64-native-bsdapp-clang/lib/librte_pmd_sfc_efx.a(ef10_intr.o)
                                                  /root/FreeBSD1201-64_K12.1_Clang8.0.1/x86_64-native-bsdapp-clang/7222f93613314e26abda8a8c47e1cbe8/dpdk/x86_64-native-bsdapp-clang/lib/librte_pmd_sfc_efx.a(efx_intr.o)
ef10_intr_enable                                  /root/FreeBSD1201-64_K12.1_Clang8.0.1/x86_64-native-bsdapp-clang/7222f93613314e26abda8a8c47e1cbe8/dpdk/x86_64-native-bsdapp-clang/lib/librte_pmd_sfc_efx.a(ef10_intr.o)
                                                  /root/FreeBSD1201-64_K12.1_Clang8.0.1/x86_64-native-bsdapp-clang/7222f93613314e26abda8a8c47e1cbe8/dpdk/x86_64-native-bsdapp-clang/lib/librte_pmd_sfc_efx.a(efx_intr.o)
ef10_intr_fatal                                   /root/FreeBSD1201-64_K12.1_Clang8.0.1/x86_64-native-bsdapp-clang/7222f93613314e26abda8a8c47e1cbe8/dpdk/x86_64-native-bsdapp-clang/lib/librte_pmd_sfc_efx.a(ef10_intr.o)
                                                  /root/FreeBSD1201-64_K12.1_Clang8.0.1/x86_64-native-bsdapp-clang/7222f93613314e26abda8a8c47e1cbe8/dpdk/x86_64-native-bsdapp-clang/lib/librte_pmd_sfc_efx.a(efx_intr.o)
ef10_intr_fini                                    /root/FreeBSD1201-64_K12.1_Clang8.0.1/x86_64-native-bsdapp-clang/7222f93613314e26abda8a8c47e1cbe8/dpdk/x86_64-native-bsdapp-clang/lib/librte_pmd_sfc_efx.a(ef10_intr.o)
                                                  /root/FreeBSD1201-64_K12.1_Clang8.0.1/x86_64-native-bsdapp-clang/7222f93613314e26abda8a8c47e1cbe8/dpdk/x86_64-native-bsdapp-clang/lib/librte_pmd_sfc_efx.a(efx_intr.o)
ef10_intr_init                                    /root/FreeBSD1201-64_K12.1_Clang8.0.1/x86_64-native-bsdapp-clang/7222f93613314e26abda8a8c47e1cbe8/dpdk/x86_64-native-bsdapp-clang/lib/librte_pmd_sfc_efx.a(ef10_intr.o)
                                                  /root/FreeBSD1201-64_K12.1_Clang8.0.1/x86_64-native-bsdapp-clang/7222f93613314e26abda8a8c47e1cbe8/dpdk/x86_64-native-bsdapp-clang/lib/librte_pmd_sfc_efx.a(efx_intr.o)
--
                                                  /root/FreeBSD1201-64_K12.1_Clang8.0.1/x86_64-native-bsdapp-clang/7222f93613314e26abda8a8c47e1cbe8/dpdk/x86_64-native-bsdapp-clang/lib/librte_pmd_sfc_efx.a(sfc_mcdi.o)
efx_intr_disable                                  /root/FreeBSD1201-64_K12.1_Clang8.0.1/x86_64-native-bsdapp-clang/7222f93613314e26abda8a8c47e1cbe8/dpdk/x86_64-native-bsdapp-clang/lib/librte_pmd_sfc_efx.a(efx_intr.o)
                                                  /root/FreeBSD1201-64_K12.1_Clang8.0.1/x86_64-native-bsdapp-clang/7222f93613314e26abda8a8c47e1cbe8/dpdk/x86_64-native-bsdapp-clang/lib/librte_pmd_sfc_efx.a(sfc_intr.o)
efx_intr_enable                                   /root/FreeBSD1201-64_K12.1_Clang8.0.1/x86_64-native-bsdapp-clang/7222f93613314e26abda8a8c47e1cbe8/dpdk/x86_64-native-bsdapp-clang/lib/librte_pmd_sfc_efx.a(efx_intr.o)
                                                  /root/FreeBSD1201-64_K12.1_Clang8.0.1/x86_64-native-bsdapp-clang/7222f93613314e26abda8a8c47e1cbe8/dpdk/x86_64-native-bsdapp-clang/lib/librte_pmd_sfc_efx.a(sfc_intr.o)
efx_intr_fatal                                    /root/FreeBSD1201-64_K12.1_Clang8.0.1/x86_64-native-bsdapp-clang/7222f93613314e26abda8a8c47e1cbe8/dpdk/x86_64-native-bsdapp-clang/lib/librte_pmd_sfc_efx.a(efx_intr.o)
                                                  /root/FreeBSD1201-64_K12.1_Clang8.0.1/x86_64-native-bsdapp-clang/7222f93613314e26abda8a8c47e1cbe8/dpdk/x86_64-native-bsdapp-clang/lib/librte_pmd_sfc_efx.a(sfc_intr.o)
efx_intr_status_line                              /root/FreeBSD1201-64_K12.1_Clang8.0.1/x86_64-native-bsdapp-clang/7222f93613314e26abda8a8c47e1cbe8/dpdk/x86_64-native-bsdapp-clang/lib/librte_pmd_sfc_efx.a(efx_intr.o)
                                                  /root/FreeBSD1201-64_K12.1_Clang8.0.1/x86_64-native-bsdapp-clang/7222f93613314e26abda8a8c47e1cbe8/dpdk/x86_64-native-bsdapp-clang/lib/librte_pmd_sfc_efx.a(sfc_intr.o)
efx_intr_status_message                           /root/FreeBSD1201-64_K12.1_Clang8.0.1/x86_64-native-bsdapp-clang/7222f93613314e26abda8a8c47e1cbe8/dpdk/x86_64-native-bsdapp-clang/lib/librte_pmd_sfc_efx.a(efx_intr.o)
                                                  /root/FreeBSD1201-64_K12.1_Clang8.0.1/x86_64-native-bsdapp-clang/7222f93613314e26abda8a8c47e1cbe8/dpdk/x86_64-native-bsdapp-clang/lib/librte_pmd_sfc_efx.a(sfc_intr.o)
--
sfc_ev_qstop                                      /root/FreeBSD1201-64_K12.1_Clang8.0.1/x86_64-native-bsdapp-clang/7222f93613314e26abda8a8c47e1cbe8/dpdk/x86_64-native-bsdapp-clang/lib/librte_pmd_sfc_efx.a(sfc_ev.o)
                                                  /root/FreeBSD1201-64_K12.1_Clang8.0.1/x86_64-native-bsdapp-clang/7222f93613314e26abda8a8c47e1cbe8/dpdk/x86_64-native-bsdapp-clang/lib/librte_pmd_sfc_efx.a(sfc_rx.o)
                                                  /root/FreeBSD1201-64_K12.1_Clang8.0.1/x86_64-native-bsdapp-clang/7222f93613314e26abda8a8c47e1cbe8/dpdk/x86_64-native-bsdapp-clang/lib/librte_pmd_sfc_efx.a(sfc_tx.o)
sfc_rx_qflush_done                                /root/FreeBSD1201-64_K12.1_Clang8.0.1/x86_64-native-bsdapp-clang/7222f93613314e26abda8a8c47e1cbe8/dpdk/x86_64-native-bsdapp-clang/lib/librte_pmd_sfc_efx.a(sfc_rx.o)
                                                  /root/FreeBSD1201-64_K12.1_Clang8.0.1/x86_64-native-bsdapp-clang/7222f93613314e26abda8a8c47e1cbe8/dpdk/x86_64-native-bsdapp-clang/lib/librte_pmd_sfc_efx.a(sfc_ev.o)
sfc_rx_qflush_failed                              /root/FreeBSD1201-64_K12.1_Clang8.0.1/x86_64-native-bsdapp-clang/7222f93613314e26abda8a8c47e1cbe8/dpdk/x86_64-native-bsdapp-clang/lib/librte_pmd_sfc_efx.a(sfc_rx.o)
                                                  /root/FreeBSD1201-64_K12.1_Clang8.0.1/x86_64-native-bsdapp-clang/7222f93613314e26abda8a8c47e1cbe8/dpdk/x86_64-native-bsdapp-clang/lib/librte_pmd_sfc_efx.a(sfc_ev.o)
sfc_rxq_info_by_dp_rxq                            /root/FreeBSD1201-64_K12.1_Clang8.0.1/x86_64-native-bsdapp-clang/7222f93613314e26abda8a8c47e1cbe8/dpdk/x86_64-native-bsdapp-clang/lib/librte_pmd_sfc_efx.a(sfc_rx.o)
                                                  /root/FreeBSD1201-64_K12.1_Clang8.0.1/x86_64-native-bsdapp-clang/7222f93613314e26abda8a8c47e1cbe8/dpdk/x86_64-native-bsdapp-clang/lib/librte_pmd_sfc_efx.a(sfc_ev.o)
sfc_tx_qflush_done                                /root/FreeBSD1201-64_K12.1_Clang8.0.1/x86_64-native-bsdapp-clang/7222f93613314e26abda8a8c47e1cbe8/dpdk/x86_64-native-bsdapp-clang/lib/librte_pmd_sfc_efx.a(sfc_tx.o)
                                                  /root/FreeBSD1201-64_K12.1_Clang8.0.1/x86_64-native-bsdapp-clang/7222f93613314e26abda8a8c47e1cbe8/dpdk/x86_64-native-bsdapp-clang/lib/librte_pmd_sfc_efx.a(sfc_ev.o)
--
                                                  /root/FreeBSD1201-64_K12.1_Clang8.0.1/x86_64-native-bsdapp-clang/7222f93613314e26abda8a8c47e1cbe8/dpdk/x86_64-native-bsdapp-clang/lib/librte_pmd_sfc_efx.a(efx_intr.o)
ef10_intr_disable_unlocked                        /root/FreeBSD1201-64_K12.1_Clang8.0.1/x86_64-native-bsdapp-clang/7222f93613314e26abda8a8c47e1cbe8/dpdk/x86_64-native-bsdapp-clang/lib/librte_pmd_sfc_efx.a(ef10_intr.o)
                                                  /root/FreeBSD1201-64_K12.1_Clang8.0.1/x86_64-native-bsdapp-clang/7222f93613314e26abda8a8c47e1cbe8/dpdk/x86_64-native-bsdapp-clang/lib/librte_pmd_sfc_efx.a(efx_intr.o)
ef10_intr_enable                                  /root/FreeBSD1201-64_K12.1_Clang8.0.1/x86_64-native-bsdapp-clang/7222f93613314e26abda8a8c47e1cbe8/dpdk/x86_64-native-bsdapp-clang/lib/librte_pmd_sfc_efx.a(ef10_intr.o)
                                                  /root/FreeBSD1201-64_K12.1_Clang8.0.1/x86_64-native-bsdapp-clang/7222f93613314e26abda8a8c47e1cbe8/dpdk/x86_64-native-bsdapp-clang/lib/librte_pmd_sfc_efx.a(efx_intr.o)
ef10_intr_fatal                                   /root/FreeBSD1201-64_K12.1_Clang8.0.1/x86_64-native-bsdapp-clang/7222f93613314e26abda8a8c47e1cbe8/dpdk/x86_64-native-bsdapp-clang/lib/librte_pmd_sfc_efx.a(ef10_intr.o)
                                                  /root/FreeBSD1201-64_K12.1_Clang8.0.1/x86_64-native-bsdapp-clang/7222f93613314e26abda8a8c47e1cbe8/dpdk/x86_64-native-bsdapp-clang/lib/librte_pmd_sfc_efx.a(efx_intr.o)
ef10_intr_fini                                    /root/FreeBSD1201-64_K12.1_Clang8.0.1/x86_64-native-bsdapp-clang/7222f93613314e26abda8a8c47e1cbe8/dpdk/x86_64-native-bsdapp-clang/lib/librte_pmd_sfc_efx.a(ef10_intr.o)
                                                  /root/FreeBSD1201-64_K12.1_Clang8.0.1/x86_64-native-bsdapp-clang/7222f93613314e26abda8a8c47e1cbe8/dpdk/x86_64-native-bsdapp-clang/lib/librte_pmd_sfc_efx.a(efx_intr.o)
ef10_intr_init                                    /root/FreeBSD1201-64_K12.1_Clang8.0.1/x86_64-native-bsdapp-clang/7222f93613314e26abda8a8c47e1cbe8/dpdk/x86_64-native-bsdapp-clang/lib/librte_pmd_sfc_efx.a(ef10_intr.o)
                                                  /root/FreeBSD1201-64_K12.1_Clang8.0.1/x86_64-native-bsdapp-clang/7222f93613314e26abda8a8c47e1cbe8/dpdk/x86_64-native-bsdapp-clang/lib/librte_pmd_sfc_efx.a(efx_intr.o)
--
                                                  /root/FreeBSD1201-64_K12.1_Clang8.0.1/x86_64-native-bsdapp-clang/7222f93613314e26abda8a8c47e1cbe8/dpdk/x86_64-native-bsdapp-clang/lib/librte_pmd_sfc_efx.a(sfc_mcdi.o)
efx_intr_disable                                  /root/FreeBSD1201-64_K12.1_Clang8.0.1/x86_64-native-bsdapp-clang/7222f93613314e26abda8a8c47e1cbe8/dpdk/x86_64-native-bsdapp-clang/lib/librte_pmd_sfc_efx.a(efx_intr.o)
                                                  /root/FreeBSD1201-64_K12.1_Clang8.0.1/x86_64-native-bsdapp-clang/7222f93613314e26abda8a8c47e1cbe8/dpdk/x86_64-native-bsdapp-clang/lib/librte_pmd_sfc_efx.a(sfc_intr.o)
efx_intr_enable                                   /root/FreeBSD1201-64_K12.1_Clang8.0.1/x86_64-native-bsdapp-clang/7222f93613314e26abda8a8c47e1cbe8/dpdk/x86_64-native-bsdapp-clang/lib/librte_pmd_sfc_efx.a(efx_intr.o)
                                                  /root/FreeBSD1201-64_K12.1_Clang8.0.1/x86_64-native-bsdapp-clang/7222f93613314e26abda8a8c47e1cbe8/dpdk/x86_64-native-bsdapp-clang/lib/librte_pmd_sfc_efx.a(sfc_intr.o)
efx_intr_fatal                                    /root/FreeBSD1201-64_K12.1_Clang8.0.1/x86_64-native-bsdapp-clang/7222f93613314e26abda8a8c47e1cbe8/dpdk/x86_64-native-bsdapp-clang/lib/librte_pmd_sfc_efx.a(efx_intr.o)
                                                  /root/FreeBSD1201-64_K12.1_Clang8.0.1/x86_64-native-bsdapp-clang/7222f93613314e26abda8a8c47e1cbe8/dpdk/x86_64-native-bsdapp-clang/lib/librte_pmd_sfc_efx.a(sfc_intr.o)
efx_intr_status_line                              /root/FreeBSD1201-64_K12.1_Clang8.0.1/x86_64-native-bsdapp-clang/7222f93613314e26abda8a8c47e1cbe8/dpdk/x86_64-native-bsdapp-clang/lib/librte_pmd_sfc_efx.a(efx_intr.o)
                                                  /root/FreeBSD1201-64_K12.1_Clang8.0.1/x86_64-native-bsdapp-clang/7222f93613314e26abda8a8c47e1cbe8/dpdk/x86_64-native-bsdapp-clang/lib/librte_pmd_sfc_efx.a(sfc_intr.o)
efx_intr_status_message                           /root/FreeBSD1201-64_K12.1_Clang8.0.1/x86_64-native-bsdapp-clang/7222f93613314e26abda8a8c47e1cbe8/dpdk/x86_64-native-bsdapp-clang/lib/librte_pmd_sfc_efx.a(efx_intr.o)
                                                  /root/FreeBSD1201-64_K12.1_Clang8.0.1/x86_64-native-bsdapp-clang/7222f93613314e26abda8a8c47e1cbe8/dpdk/x86_64-native-bsdapp-clang/lib/librte_pmd_sfc_efx.a(sfc_intr.o)
--
sfc_ev_qstop                                      /root/FreeBSD1201-64_K12.1_Clang8.0.1/x86_64-native-bsdapp-clang/7222f93613314e26abda8a8c47e1cbe8/dpdk/x86_64-native-bsdapp-clang/lib/librte_pmd_sfc_efx.a(sfc_ev.o)
                                                  /root/FreeBSD1201-64_K12.1_Clang8.0.1/x86_64-native-bsdapp-clang/7222f93613314e26abda8a8c47e1cbe8/dpdk/x86_64-native-bsdapp-clang/lib/librte_pmd_sfc_efx.a(sfc_rx.o)
                                                  /root/FreeBSD1201-64_K12.1_Clang8.0.1/x86_64-native-bsdapp-clang/7222f93613314e26abda8a8c47e1cbe8/dpdk/x86_64-native-bsdapp-clang/lib/librte_pmd_sfc_efx.a(sfc_tx.o)
sfc_rx_qflush_done                                /root/FreeBSD1201-64_K12.1_Clang8.0.1/x86_64-native-bsdapp-clang/7222f93613314e26abda8a8c47e1cbe8/dpdk/x86_64-native-bsdapp-clang/lib/librte_pmd_sfc_efx.a(sfc_rx.o)
                                                  /root/FreeBSD1201-64_K12.1_Clang8.0.1/x86_64-native-bsdapp-clang/7222f93613314e26abda8a8c47e1cbe8/dpdk/x86_64-native-bsdapp-clang/lib/librte_pmd_sfc_efx.a(sfc_ev.o)
sfc_rx_qflush_failed                              /root/FreeBSD1201-64_K12.1_Clang8.0.1/x86_64-native-bsdapp-clang/7222f93613314e26abda8a8c47e1cbe8/dpdk/x86_64-native-bsdapp-clang/lib/librte_pmd_sfc_efx.a(sfc_rx.o)
                                                  /root/FreeBSD1201-64_K12.1_Clang8.0.1/x86_64-native-bsdapp-clang/7222f93613314e26abda8a8c47e1cbe8/dpdk/x86_64-native-bsdapp-clang/lib/librte_pmd_sfc_efx.a(sfc_ev.o)
sfc_rxq_info_by_dp_rxq                            /root/FreeBSD1201-64_K12.1_Clang8.0.1/x86_64-native-bsdapp-clang/7222f93613314e26abda8a8c47e1cbe8/dpdk/x86_64-native-bsdapp-clang/lib/librte_pmd_sfc_efx.a(sfc_rx.o)
                                                  /root/FreeBSD1201-64_K12.1_Clang8.0.1/x86_64-native-bsdapp-clang/7222f93613314e26abda8a8c47e1cbe8/dpdk/x86_64-native-bsdapp-clang/lib/librte_pmd_sfc_efx.a(sfc_ev.o)
sfc_tx_qflush_done                                /root/FreeBSD1201-64_K12.1_Clang8.0.1/x86_64-native-bsdapp-clang/7222f93613314e26abda8a8c47e1cbe8/dpdk/x86_64-native-bsdapp-clang/lib/librte_pmd_sfc_efx.a(sfc_tx.o)
                                                  /root/FreeBSD1201-64_K12.1_Clang8.0.1/x86_64-native-bsdapp-clang/7222f93613314e26abda8a8c47e1cbe8/dpdk/x86_64-native-bsdapp-clang/lib/librte_pmd_sfc_efx.a(sfc_ev.o)
--
                                                  /root/FreeBSD1201-64_K12.1_Clang8.0.1/x86_64-native-bsdapp-clang/7222f93613314e26abda8a8c47e1cbe8/dpdk/x86_64-native-bsdapp-clang/lib/librte_pmd_sfc_efx.a(efx_intr.o)
ef10_intr_disable_unlocked                        /root/FreeBSD1201-64_K12.1_Clang8.0.1/x86_64-native-bsdapp-clang/7222f93613314e26abda8a8c47e1cbe8/dpdk/x86_64-native-bsdapp-clang/lib/librte_pmd_sfc_efx.a(ef10_intr.o)
                                                  /root/FreeBSD1201-64_K12.1_Clang8.0.1/x86_64-native-bsdapp-clang/7222f93613314e26abda8a8c47e1cbe8/dpdk/x86_64-native-bsdapp-clang/lib/librte_pmd_sfc_efx.a(efx_intr.o)
ef10_intr_enable                                  /root/FreeBSD1201-64_K12.1_Clang8.0.1/x86_64-native-bsdapp-clang/7222f93613314e26abda8a8c47e1cbe8/dpdk/x86_64-native-bsdapp-clang/lib/librte_pmd_sfc_efx.a(ef10_intr.o)
                                                  /root/FreeBSD1201-64_K12.1_Clang8.0.1/x86_64-native-bsdapp-clang/7222f93613314e26abda8a8c47e1cbe8/dpdk/x86_64-native-bsdapp-clang/lib/librte_pmd_sfc_efx.a(efx_intr.o)
ef10_intr_fatal                                   /root/FreeBSD1201-64_K12.1_Clang8.0.1/x86_64-native-bsdapp-clang/7222f93613314e26abda8a8c47e1cbe8/dpdk/x86_64-native-bsdapp-clang/lib/librte_pmd_sfc_efx.a(ef10_intr.o)
                                                  /root/FreeBSD1201-64_K12.1_Clang8.0.1/x86_64-native-bsdapp-clang/7222f93613314e26abda8a8c47e1cbe8/dpdk/x86_64-native-bsdapp-clang/lib/librte_pmd_sfc_efx.a(efx_intr.o)
ef10_intr_fini                                    /root/FreeBSD1201-64_K12.1_Clang8.0.1/x86_64-native-bsdapp-clang/7222f93613314e26abda8a8c47e1cbe8/dpdk/x86_64-native-bsdapp-clang/lib/librte_pmd_sfc_efx.a(ef10_intr.o)
                                                  /root/FreeBSD1201-64_K12.1_Clang8.0.1/x86_64-native-bsdapp-clang/7222f93613314e26abda8a8c47e1cbe8/dpdk/x86_64-native-bsdapp-clang/lib/librte_pmd_sfc_efx.a(efx_intr.o)
ef10_intr_init                                    /root/FreeBSD1201-64_K12.1_Clang8.0.1/x86_64-native-bsdapp-clang/7222f93613314e26abda8a8c47e1cbe8/dpdk/x86_64-native-bsdapp-clang/lib/librte_pmd_sfc_efx.a(ef10_intr.o)
                                                  /root/FreeBSD1201-64_K12.1_Clang8.0.1/x86_64-native-bsdapp-clang/7222f93613314e26abda8a8c47e1cbe8/dpdk/x86_64-native-bsdapp-clang/lib/librte_pmd_sfc_efx.a(efx_intr.o)
--
>>>               ipsec_sad.o:(rte_ipsec_sad_lookup) in archive /root/FreeBSD1201-64_K12.1_Clang8.0.1/x86_64-native-bsdapp-clang/7222f93613314e26abda8a8c47e1cbe8/dpdk/x86_64-native-bsdapp-clang/lib/librte_ipsec.a

ld: error: undefined symbol: rte_hash_lookup_with_hash_bulk_data
>>> referenced by ipsec_sad.c
>>>               ipsec_sad.o:(rte_ipsec_sad_lookup) in archive /root/FreeBSD1201-64_K12.1_Clang8.0.1/x86_64-native-bsdapp-clang/7222f93613314e26abda8a8c47e1cbe8/dpdk/x86_64-native-bsdapp-clang/lib/librte_ipsec.a
clang: error: linker command failed with exit code 1 (use -v to see invocation)
gmake[5]: *** [/root/FreeBSD1201-64_K12.1_Clang8.0.1/x86_64-native-bsdapp-clang/7222f93613314e26abda8a8c47e1cbe8/dpdk/mk/rte.app.mk:446: test] Error 1
gmake[4]: *** [/root/FreeBSD1201-64_K12.1_Clang8.0.1/x86_64-native-bsdapp-clang/7222f93613314e26abda8a8c47e1cbe8/dpdk/mk/rte.subdir.mk:35: test] Error 2
gmake[3]: *** [/root/FreeBSD1201-64_K12.1_Clang8.0.1/x86_64-native-bsdapp-clang/7222f93613314e26abda8a8c47e1cbe8/dpdk/mk/rte.sdkbuild.mk:48: app] Error 2
gmake[2]: *** [/root/FreeBSD1201-64_K12.1_Clang8.0.1/x86_64-native-bsdapp-clang/7222f93613314e26abda8a8c47e1cbe8/dpdk/mk/rte.sdkroot.mk:99: all] Error 2
gmake[1]: *** [/root/FreeBSD1201-64_K12.1_Clang8.0.1/x86_64-native-bsdapp-clang/7222f93613314e26abda8a8c47e1cbe8/dpdk/mk/rte.sdkinstall.mk:61: pre_install] Error 2
gmake: *** [/root/FreeBSD1201-64_K12.1_Clang8.0.1/x86_64-native-bsdapp-clang/7222f93613314e26abda8a8c47e1cbe8/dpdk/mk/rte.sdkroot.mk:77: install] Error 2


*Make Build Failed #23:
OS: FreeBSD1201-64
Target: x86_64-native-bsdapp-gcc+debug
ipsec_sad.c:(.text+0x27c): undefined reference to `rte_hash_lookup_with_hash_bulk_data'
/usr/local/bin/ld: ipsec_sad.c:(.text+0x825): undefined reference to `rte_hash_lookup_with_hash_bulk_data'
/usr/local/bin/ld: ipsec_sad.c:(.text+0x89d): undefined reference to `rte_hash_lookup_with_hash_bulk_data'
/usr/local/bin/ld: ipsec_sad.c:(.text+0xaa9): undefined reference to `rte_hash_lookup_with_hash_bulk_data'
collect2: error: ld returned 1 exit status
gmake[5]: *** [/root/FreeBSD1201-64_K12.1_GCC7.3.0/x86_64-native-bsdapp-gcc+debug/7222f93613314e26abda8a8c47e1cbe8/dpdk/mk/rte.app.mk:446: testsad] Error 1
gmake[4]: *** [/root/FreeBSD1201-64_K12.1_GCC7.3.0/x86_64-native-bsdapp-gcc+debug/7222f93613314e26abda8a8c47e1cbe8/dpdk/mk/rte.subdir.mk:37: test-sad] Error 2
gmake[4]: *** Waiting for unfinished jobs....
  CC init.o
  INSTALL-APP testacl
  CC cperf_options_parsing.o
  CC comp_perf_test_verify.o
--
ipsec_sad.c:(.text+0x27c): undefined reference to `rte_hash_lookup_with_hash_bulk_data'
/usr/local/bin/ld: ipsec_sad.c:(.text+0x825): undefined reference to `rte_hash_lookup_with_hash_bulk_data'
/usr/local/bin/ld: ipsec_sad.c:(.text+0x89d): undefined reference to `rte_hash_lookup_with_hash_bulk_data'
/usr/local/bin/ld: ipsec_sad.c:(.text+0xaa9): undefined reference to `rte_hash_lookup_with_hash_bulk_data'
collect2: error: ld returned 1 exit status
gmake[5]: *** [/root/FreeBSD1201-64_K12.1_GCC7.3.0/x86_64-native-bsdapp-gcc+debug/7222f93613314e26abda8a8c47e1cbe8/dpdk/mk/rte.app.mk:446: test] Error 1
gmake[4]: *** [/root/FreeBSD1201-64_K12.1_GCC7.3.0/x86_64-native-bsdapp-gcc+debug/7222f93613314e26abda8a8c47e1cbe8/dpdk/mk/rte.subdir.mk:35: test] Error 2
gmake[3]: *** [/root/FreeBSD1201-64_K12.1_GCC7.3.0/x86_64-native-bsdapp-gcc+debug/7222f93613314e26abda8a8c47e1cbe8/dpdk/mk/rte.sdkbuild.mk:48: app] Error 2
gmake[2]: *** [/root/FreeBSD1201-64_K12.1_GCC7.3.0/x86_64-native-bsdapp-gcc+debug/7222f93613314e26abda8a8c47e1cbe8/dpdk/mk/rte.sdkroot.mk:99: all] Error 2
gmake[1]: *** [/root/FreeBSD1201-64_K12.1_GCC7.3.0/x86_64-native-bsdapp-gcc+debug/7222f93613314e26abda8a8c47e1cbe8/dpdk/mk/rte.sdkinstall.mk:61: pre_install] Error 2
gmake: *** [/root/FreeBSD1201-64_K12.1_GCC7.3.0/x86_64-native-bsdapp-gcc+debug/7222f93613314e26abda8a8c47e1cbe8/dpdk/mk/rte.sdkroot.mk:77: install] Error 2

*Meson Build Failed #1:
OS: CENTOS77-64
Target:./build-gcc-static
FAILED: lib/76b5a35@@rte_ipsec@sta/librte_ipsec_ipsec_sad.c.o 
gcc -Ilib/76b5a35@@rte_ipsec@sta -Ilib -I../lib -Ilib/librte_ipsec -I../lib/librte_ipsec -I. -I../ -Iconfig -I../config -Ilib/librte_eal/common/include -I../lib/librte_eal/common/include -I../lib/librte_eal/linux/eal/include -Ilib/librte_eal/common -I../lib/librte_eal/common -Ilib/librte_eal/common/include/arch/x86 -I../lib/librte_eal/common/include/arch/x86 -Ilib/librte_eal -I../lib/librte_eal -Ilib/librte_kvargs -I../lib/librte_kvargs -Ilib/librte_mbuf -I../lib/librte_mbuf -Ilib/librte_mempool -I../lib/librte_mempool -Ilib/librte_ring -I../lib/librte_ring -Ilib/librte_net -I../lib/librte_net -Ilib/librte_cryptodev -I../lib/librte_cryptodev -Ilib/librte_security -I../lib/librte_security -Ilib/librte_hash -I../lib/librte_hash -pipe -D_FILE_OFFSET_BITS=64 -Wall -Winvalid-pch -Werror -O2 -g -include rte_config.h -Wextra -Wcast-qual -Wdeprecated -Wformat-nonliteral -Wformat-security -Wmissing-declarations -Wmissing-prototypes -Wnested-externs -Wold-style-definition -Wpointer-arith -Wsign-compare -Wstrict-prototypes -Wundef -Wwrite-strings -Wno-missing-field-initializers -D_GNU_SOURCE -fPIC -march=native -DALLOW_EXPERIMENTAL_API -MD -MQ 'lib/76b5a35@@rte_ipsec@sta/librte_ipsec_ipsec_sad.c.o' -MF 'lib/76b5a35@@rte_ipsec@sta/librte_ipsec_ipsec_sad.c.o.d' -o 'lib/76b5a35@@rte_ipsec@sta/librte_ipsec_ipsec_sad.c.o' -c ../lib/librte_ipsec/ipsec_sad.c
../lib/librte_ipsec/ipsec_sad.c: In function ‘__ipsec_sad_lookup’:
../lib/librte_ipsec/ipsec_sad.c:464:2: error: implicit declaration of function ‘rte_hash_lookup_with_hash_bulk_data’ [-Werror=implicit-function-declaration]
  rte_hash_lookup_with_hash_bulk_data(sad->hash[RTE_IPSEC_SAD_SPI_ONLY],
  ^
../lib/librte_ipsec/ipsec_sad.c:464:2: error: nested extern declaration of ‘rte_hash_lookup_with_hash_bulk_data’ [-Werror=nested-externs]
cc1: all warnings being treated as errors
[354/2238] Generating symbol file 'lib/76b5a35@@rte_sched@sha/librte_sched.so.20.0.2.symbols'.
[355/2238] Compiling C object 'lib/76b5a35@@rte_ipsec@sta/librte_ipsec_esp_outb.c.o'.
[356/2238] Compiling C object 'lib/76b5a35@@rte_vhost@sta/librte_vhost_vhost_crypto.c.o'.
[357/2238] Compiling C object 'lib/76b5a35@@rte_ipsec@sta/librte_ipsec_esp_inb.c.o'.
[358/2238] Compiling C object 'lib/76b5a35@@rte_vhost@sta/librte_vhost_virtio_net.c.o'.
ninja: build stopped: subcommand failed




*Meson Build Failed #2:
OS: UB1604-32
Target:./build-gcc-static
FAILED: lib/76b5a35@@rte_ipsec@sta/librte_ipsec_ipsec_sad.c.o 
gcc -Ilib/76b5a35@@rte_ipsec@sta -Ilib -I../lib -Ilib/librte_ipsec -I../lib/librte_ipsec -I. -I../ -Iconfig -I../config -Ilib/librte_eal/common/include -I../lib/librte_eal/common/include -I../lib/librte_eal/linux/eal/include -Ilib/librte_eal/common -I../lib/librte_eal/common -Ilib/librte_eal/common/include/arch/x86 -I../lib/librte_eal/common/include/arch/x86 -Ilib/librte_eal -I../lib/librte_eal -Ilib/librte_kvargs -I../lib/librte_kvargs -Ilib/librte_mbuf -I../lib/librte_mbuf -Ilib/librte_mempool -I../lib/librte_mempool -Ilib/librte_ring -I../lib/librte_ring -Ilib/librte_net -I../lib/librte_net -Ilib/librte_cryptodev -I../lib/librte_cryptodev -Ilib/librte_security -I../lib/librte_security -Ilib/librte_hash -I../lib/librte_hash -fdiagnostics-color=always -pipe -D_FILE_OFFSET_BITS=64 -Wall -Winvalid-pch -Werror -O2 -g -include rte_config.h -Wextra -Wcast-qual -Wdeprecated -Wformat-nonliteral -Wformat-security -Wmissing-declarations -Wmissing-prototypes -Wnested-externs -Wold-style-definition -Wpointer-arith -Wsign-compare -Wstrict-prototypes -Wundef -Wwrite-strings -Wno-missing-field-initializers -Wno-pointer-to-int-cast -D_GNU_SOURCE -fPIC -march=native -DALLOW_EXPERIMENTAL_API -MD -MQ 'lib/76b5a35@@rte_ipsec@sta/librte_ipsec_ipsec_sad.c.o' -MF 'lib/76b5a35@@rte_ipsec@sta/librte_ipsec_ipsec_sad.c.o.d' -o 'lib/76b5a35@@rte_ipsec@sta/librte_ipsec_ipsec_sad.c.o' -c ../lib/librte_ipsec/ipsec_sad.c
../lib/librte_ipsec/ipsec_sad.c: In function ‘__ipsec_sad_lookup’:
../lib/librte_ipsec/ipsec_sad.c:464:2: error: implicit declaration of function ‘rte_hash_lookup_with_hash_bulk_data’ [-Werror=implicit-function-declaration]
  rte_hash_lookup_with_hash_bulk_data(sad->hash[RTE_IPSEC_SAD_SPI_ONLY],
  ^
../lib/librte_ipsec/ipsec_sad.c:464:2: error: nested extern declaration of ‘rte_hash_lookup_with_hash_bulk_data’ [-Werror=nested-externs]
cc1: all warnings being treated as errors
[349/1972] Compiling C object 'lib/76b5a35@@rte_vhost@sta/librte_vhost_vhost_crypto.c.o'.
[350/1972] Compiling C object 'lib/76b5a35@@rte_ipsec@sta/librte_ipsec_esp_inb.c.o'.
[351/1972] Compiling C object 'lib/76b5a35@@rte_fib@sta/librte_fib_rte_fib6.c.o'.
[352/1972] Compiling C object 'lib/76b5a35@@rte_ipsec@sta/librte_ipsec_esp_outb.c.o'.
[353/1972] Compiling C object 'lib/76b5a35@@rte_vhost@sta/librte_vhost_virtio_net.c.o'.
ninja: build stopped: subcommand failed




*Meson Build Failed #3:
OS: FC31-64
Target:./build-gcc-static
FAILED: lib/76b5a35@@rte_ipsec@sta/librte_ipsec_ipsec_sad.c.o 
gcc -Ilib/76b5a35@@rte_ipsec@sta -Ilib -I../lib -Ilib/librte_ipsec -I../lib/librte_ipsec -I. -I../ -Iconfig -I../config -Ilib/librte_eal/common/include -I../lib/librte_eal/common/include -I../lib/librte_eal/linux/eal/include -Ilib/librte_eal/common -I../lib/librte_eal/common -Ilib/librte_eal/common/include/arch/x86 -I../lib/librte_eal/common/include/arch/x86 -Ilib/librte_eal -I../lib/librte_eal -Ilib/librte_kvargs -I../lib/librte_kvargs -Ilib/librte_mbuf -I../lib/librte_mbuf -Ilib/librte_mempool -I../lib/librte_mempool -Ilib/librte_ring -I../lib/librte_ring -Ilib/librte_net -I../lib/librte_net -Ilib/librte_cryptodev -I../lib/librte_cryptodev -Ilib/librte_security -I../lib/librte_security -Ilib/librte_hash -I../lib/librte_hash -fdiagnostics-color=always -pipe -D_FILE_OFFSET_BITS=64 -Wall -Winvalid-pch -Werror -O2 -g -include rte_config.h -Wextra -Wcast-qual -Wdeprecated -Wformat-nonliteral -Wformat-security -Wmissing-declarations -Wmissing-prototypes -Wnested-externs -Wold-style-definition -Wpointer-arith -Wsign-compare -Wstrict-prototypes -Wundef -Wwrite-strings -Wno-address-of-packed-member -Wno-packed-not-aligned -Wno-missing-field-initializers -D_GNU_SOURCE -fPIC -march=native -Wno-format-truncation -DALLOW_EXPERIMENTAL_API -MD -MQ 'lib/76b5a35@@rte_ipsec@sta/librte_ipsec_ipsec_sad.c.o' -MF 'lib/76b5a35@@rte_ipsec@sta/librte_ipsec_ipsec_sad.c.o.d' -o 'lib/76b5a35@@rte_ipsec@sta/librte_ipsec_ipsec_sad.c.o' -c ../lib/librte_ipsec/ipsec_sad.c
../lib/librte_ipsec/ipsec_sad.c: In function ‘__ipsec_sad_lookup’:
../lib/librte_ipsec/ipsec_sad.c:464:2: error: implicit declaration of function ‘rte_hash_lookup_with_hash_bulk_data’; did you mean ‘rte_hash_lookup_with_hash_data’? [-Werror=implicit-function-declaration]
  464 |  rte_hash_lookup_with_hash_bulk_data(sad->hash[RTE_IPSEC_SAD_SPI_ONLY],
      |  ^~~~~~~~~~~~~~~~~~~~~~~~~~~~~~~~~~~
      |  rte_hash_lookup_with_hash_data
../lib/librte_ipsec/ipsec_sad.c:464:2: error: nested extern declaration of ‘rte_hash_lookup_with_hash_bulk_data’ [-Werror=nested-externs]
cc1: all warnings being treated as errors
[356/2247] Compiling C object 'lib/76b5a35@@rte_ipsec@sta/librte_ipsec_ses.c.o'.
[357/2247] Compiling C object 'lib/76b5a35@@rte_fib@sta/librte_fib_rte_fib6.c.o'.
[358/2247] Compiling C object 'lib/76b5a35@@rte_vhost@sta/librte_vhost_vhost_crypto.c.o'.
[359/2247] Compiling C object 'lib/76b5a35@@rte_fib@sta/librte_fib_dir24_8.c.o'.
[360/2247] Compiling C object 'lib/76b5a35@@rte_ipsec@sta/librte_ipsec_esp_inb.c.o'.
[361/2247] Compiling C object 'lib/76b5a35@@rte_ipsec@sta/librte_ipsec_esp_outb.c.o'.
[362/2247] Compiling C object 'lib/76b5a35@@rte_vhost@sta/librte_vhost_virtio_net.c.o'.
ninja: build stopped: subcommand failed




*Meson Build Failed #4:
OS: UB1804-64
Target:./build-gcc-static
FAILED: lib/76b5a35@@rte_ipsec@sta/librte_ipsec_ipsec_sad.c.o 
gcc -Ilib/76b5a35@@rte_ipsec@sta -Ilib -I../lib -Ilib/librte_ipsec -I../lib/librte_ipsec -I. -I../ -Iconfig -I../config -Ilib/librte_eal/common/include -I../lib/librte_eal/common/include -I../lib/librte_eal/linux/eal/include -Ilib/librte_eal/common -I../lib/librte_eal/common -Ilib/librte_eal/common/include/arch/x86 -I../lib/librte_eal/common/include/arch/x86 -Ilib/librte_eal -I../lib/librte_eal -Ilib/librte_kvargs -I../lib/librte_kvargs -Ilib/librte_mbuf -I../lib/librte_mbuf -Ilib/librte_mempool -I../lib/librte_mempool -Ilib/librte_ring -I../lib/librte_ring -Ilib/librte_net -I../lib/librte_net -Ilib/librte_cryptodev -I../lib/librte_cryptodev -Ilib/librte_security -I../lib/librte_security -Ilib/librte_hash -I../lib/librte_hash -fdiagnostics-color=always -pipe -D_FILE_OFFSET_BITS=64 -Wall -Winvalid-pch -Werror -O2 -g -include rte_config.h -Wextra -Wcast-qual -Wdeprecated -Wformat-nonliteral -Wformat-security -Wmissing-declarations -Wmissing-prototypes -Wnested-externs -Wold-style-definition -Wpointer-arith -Wsign-compare -Wstrict-prototypes -Wundef -Wwrite-strings -Wno-missing-field-initializers -D_GNU_SOURCE -fPIC -march=native -mno-avx512f -Wno-format-truncation -DALLOW_EXPERIMENTAL_API -MD -MQ 'lib/76b5a35@@rte_ipsec@sta/librte_ipsec_ipsec_sad.c.o' -MF 'lib/76b5a35@@rte_ipsec@sta/librte_ipsec_ipsec_sad.c.o.d' -o 'lib/76b5a35@@rte_ipsec@sta/librte_ipsec_ipsec_sad.c.o' -c ../lib/librte_ipsec/ipsec_sad.c
../lib/librte_ipsec/ipsec_sad.c: In function ‘__ipsec_sad_lookup’:
../lib/librte_ipsec/ipsec_sad.c:464:2: error: implicit declaration of function ‘rte_hash_lookup_with_hash_bulk_data’; did you mean ‘rte_hash_lookup_with_hash_data’? [-Werror=implicit-function-declaration]
  rte_hash_lookup_with_hash_bulk_data(sad->hash[RTE_IPSEC_SAD_SPI_ONLY],
  ^~~~~~~~~~~~~~~~~~~~~~~~~~~~~~~~~~~
  rte_hash_lookup_with_hash_data
../lib/librte_ipsec/ipsec_sad.c:464:2: error: nested extern declaration of ‘rte_hash_lookup_with_hash_bulk_data’ [-Werror=nested-externs]
cc1: all warnings being treated as errors
[357/2160] Compiling C object 'lib/76b5a35@@rte_fib@sta/librte_fib_rte_fib.c.o'.
[358/2160] Compiling C object 'lib/76b5a35@@rte_fib@sta/librte_fib_dir24_8.c.o'.
[359/2160] Compiling C object 'lib/76b5a35@@rte_ipsec@sta/librte_ipsec_esp_outb.c.o'.
[360/2160] Compiling C object 'lib/76b5a35@@rte_fib@sta/librte_fib_rte_fib6.c.o'.
[361/2160] Compiling C object 'lib/76b5a35@@rte_vhost@sta/librte_vhost_virtio_net.c.o'.
ninja: build stopped: subcommand failed




*Meson Build Failed #5:
OS: SUSE15-64
Target:./build-gcc-static
FAILED: lib/76b5a35@@rte_ipsec@sta/librte_ipsec_ipsec_sad.c.o 
gcc -Ilib/76b5a35@@rte_ipsec@sta -Ilib -I../lib -Ilib/librte_ipsec -I../lib/librte_ipsec -I. -I../ -Iconfig -I../config -Ilib/librte_eal/common/include -I../lib/librte_eal/common/include -I../lib/librte_eal/linux/eal/include -Ilib/librte_eal/common -I../lib/librte_eal/common -Ilib/librte_eal/common/include/arch/x86 -I../lib/librte_eal/common/include/arch/x86 -Ilib/librte_eal -I../lib/librte_eal -Ilib/librte_kvargs -I../lib/librte_kvargs -Ilib/librte_mbuf -I../lib/librte_mbuf -Ilib/librte_mempool -I../lib/librte_mempool -Ilib/librte_ring -I../lib/librte_ring -Ilib/librte_net -I../lib/librte_net -Ilib/librte_cryptodev -I../lib/librte_cryptodev -Ilib/librte_security -I../lib/librte_security -Ilib/librte_hash -I../lib/librte_hash -fdiagnostics-color=always -pipe -D_FILE_OFFSET_BITS=64 -Wall -Winvalid-pch -Werror -O2 -g -include rte_config.h -Wextra -Wcast-qual -Wdeprecated -Wformat-nonliteral -Wformat-security -Wmissing-declarations -Wmissing-prototypes -Wnested-externs -Wold-style-definition -Wpointer-arith -Wsign-compare -Wstrict-prototypes -Wundef -Wwrite-strings -Wno-missing-field-initializers -D_GNU_SOURCE -fPIC -march=native -Wno-format-truncation -DALLOW_EXPERIMENTAL_API -MD -MQ 'lib/76b5a35@@rte_ipsec@sta/librte_ipsec_ipsec_sad.c.o' -MF 'lib/76b5a35@@rte_ipsec@sta/librte_ipsec_ipsec_sad.c.o.d' -o 'lib/76b5a35@@rte_ipsec@sta/librte_ipsec_ipsec_sad.c.o' -c ../lib/librte_ipsec/ipsec_sad.c
../lib/librte_ipsec/ipsec_sad.c: In function ‘__ipsec_sad_lookup’:
../lib/librte_ipsec/ipsec_sad.c:464:2: error: implicit declaration of function ‘rte_hash_lookup_with_hash_bulk_data’; did you mean ‘rte_hash_lookup_with_hash_data’? [-Werror=implicit-function-declaration]
  rte_hash_lookup_with_hash_bulk_data(sad->hash[RTE_IPSEC_SAD_SPI_ONLY],
  ^~~~~~~~~~~~~~~~~~~~~~~~~~~~~~~~~~~
  rte_hash_lookup_with_hash_data
../lib/librte_ipsec/ipsec_sad.c:464:2: error: nested extern declaration of ‘rte_hash_lookup_with_hash_bulk_data’ [-Werror=nested-externs]
cc1: all warnings being treated as errors
[357/2150] Compiling C object 'lib/76b5a35@@rte_ipsec@sta/librte_ipsec_sa.c.o'.
[358/2150] Generating symbol file 'lib/76b5a35@@rte_sched@sha/librte_sched.so.20.0.2.symbols'.
[359/2150] Compiling C object 'lib/76b5a35@@rte_fib@sta/librte_fib_dir24_8.c.o'.
[360/2150] Compiling C object 'lib/76b5a35@@rte_ipsec@sta/librte_ipsec_esp_inb.c.o'.
[361/2150] Compiling C object 'lib/76b5a35@@rte_vhost@sta/librte_vhost_vhost_crypto.c.o'.
[362/2150] Compiling C object 'lib/76b5a35@@rte_ipsec@sta/librte_ipsec_esp_outb.c.o'.
[363/2150] Compiling C object 'lib/76b5a35@@rte_vhost@sta/librte_vhost_virtio_net.c.o'.
ninja: build stopped: subcommand failed




*Meson Build Failed #6:
OS: FreeBSD1201-64
Target:./build-gcc-static
FAILED: lib/76b5a35@@rte_ipsec@sta/librte_ipsec_ipsec_sad.c.o 
gcc -Ilib/76b5a35@@rte_ipsec@sta -Ilib -I../lib -Ilib/librte_ipsec -I../lib/librte_ipsec -I. -I../ -Iconfig -I../config -Ilib/librte_eal/common/include -I../lib/librte_eal/common/include -I../lib/librte_eal/freebsd/eal/include -Ilib/librte_eal/common -I../lib/librte_eal/common -Ilib/librte_eal/common/include/arch/x86 -I../lib/librte_eal/common/include/arch/x86 -Ilib/librte_eal -I../lib/librte_eal -Ilib/librte_kvargs -I../lib/librte_kvargs -Ilib/librte_mbuf -I../lib/librte_mbuf -Ilib/librte_mempool -I../lib/librte_mempool -Ilib/librte_ring -I../lib/librte_ring -Ilib/librte_net -I../lib/librte_net -Ilib/librte_cryptodev -I../lib/librte_cryptodev -Ilib/librte_security -I../lib/librte_security -Ilib/librte_hash -I../lib/librte_hash -fdiagnostics-color=always -pipe -D_FILE_OFFSET_BITS=64 -Wall -Winvalid-pch -Werror -O2 -g -include rte_config.h -Wextra -Wcast-qual -Wdeprecated -Wformat-nonliteral -Wformat-security -Wmissing-declarations -Wmissing-prototypes -Wnested-externs -Wold-style-definition -Wpointer-arith -Wsign-compare -Wstrict-prototypes -Wundef -Wwrite-strings -Wno-address-of-packed-member -Wno-packed-not-aligned -Wno-missing-field-initializers -D_GNU_SOURCE -D__BSD_VISIBLE -fPIC -march=native -Wno-format-truncation -DALLOW_EXPERIMENTAL_API -MD -MQ 'lib/76b5a35@@rte_ipsec@sta/librte_ipsec_ipsec_sad.c.o' -MF 'lib/76b5a35@@rte_ipsec@sta/librte_ipsec_ipsec_sad.c.o.d' -o 'lib/76b5a35@@rte_ipsec@sta/librte_ipsec_ipsec_sad.c.o' -c ../lib/librte_ipsec/ipsec_sad.c
../lib/librte_ipsec/ipsec_sad.c: In function '__ipsec_sad_lookup':
../lib/librte_ipsec/ipsec_sad.c:464:2: error: implicit declaration of function 'rte_hash_lookup_with_hash_bulk_data'; did you mean 'rte_hash_lookup_with_hash_data'? [-Werror=implicit-function-declaration]
  464 |  rte_hash_lookup_with_hash_bulk_data(sad->hash[RTE_IPSEC_SAD_SPI_ONLY],
      |  ^~~~~~~~~~~~~~~~~~~~~~~~~~~~~~~~~~~
      |  rte_hash_lookup_with_hash_data
../lib/librte_ipsec/ipsec_sad.c:464:2: error: nested extern declaration of 'rte_hash_lookup_with_hash_bulk_data' [-Werror=nested-externs]
cc1: all warnings being treated as errors
[358/1639] Compiling C object 'lib/76b5a35@@rte_fib@sta/librte_fib_rte_fib6.c.o'.
[359/1639] Compiling C object 'lib/76b5a35@@rte_fib@sta/librte_fib_dir24_8.c.o'.
[360/1639] Compiling C object 'lib/76b5a35@@rte_fib@sta/librte_fib_trie.c.o'.
[361/1639] Compiling C object 'lib/76b5a35@@rte_port@sta/librte_port_rte_port_fd.c.o'.
[362/1639] Compiling C object 'lib/76b5a35@@rte_port@sta/librte_port_rte_port_ethdev.c.o'.
ninja: build stopped: subcommand failed



DPDK STV team

^ permalink raw reply	[flat|nested] only message in thread

only message in thread, other threads:[~2020-03-10  8:50 UTC | newest]

Thread overview: (only message) (download: mbox.gz / follow: Atom feed)
-- links below jump to the message on this page --
2020-03-10  8:50 [dpdk-test-report] |FAILURE| pw66462ipsec: use hash lookup with hash sigs in sad lookup sys_stv

automatic DPDK test reports

This inbox may be cloned and mirrored by anyone:

	git clone --mirror https://inbox.dpdk.org/test-report/0 test-report/git/0.git

	# If you have public-inbox 1.1+ installed, you may
	# initialize and index your mirror using the following commands:
	public-inbox-init -V2 test-report test-report/ https://inbox.dpdk.org/test-report \
		test-report@dpdk.org
	public-inbox-index test-report

Example config snippet for mirrors.
Newsgroup available over NNTP:
	nntp://inbox.dpdk.org/inbox.dpdk.test-report


AGPL code for this site: git clone https://public-inbox.org/public-inbox.git