automatic DPDK test reports
 help / color / mirror / Atom feed
* [dpdk-test-report]  |FAILURE| pw66505[v2, 2/4] if_proxy: add library documentation
@ 2020-03-11  1:10 sys_stv
  0 siblings, 0 replies; 2+ messages in thread
From: sys_stv @ 2020-03-11  1:10 UTC (permalink / raw)
  To: test-report

[-- Attachment #1: Type: text/plain, Size: 29041 bytes --]

Test-Label: Intel-compilation
Test-Status: FAILURE
http://dpdk.org/patch/66505

_Compilation issues_

Submitter: Andrzej Ostruszka <aostruszka@marvell.com>
Date: 2020-03-10 11:10:35
Reply_mail: 20200310111037.31451-3-aostruszka@marvell.com
DPDK git baseline: Repo:dpdk, CommitID: 44c775feb491106d472c1a44433c6427a3fb3b3b

Makefile build Summary: 23 Builds Done, 22 Successful, 1 Failures

Meson build Summary: 8 Builds Done, 2 Successful, 6 Failures

               +==============================================+===========+==========+
               |                   Makefile                   |   Meson   | Document |
+----------------+------+-------+------+------------+-----------+-----------+----------+
| os             | gcc  | clang | icc  | gcc+shared | gcc+debug | gcc/clang | pdf/html |
+----------------+------+-------+------+------------+-----------+-----------+----------+
| RHEL80-64      | pass |       |      |            |           |           |          |
| UB1804-64      | pass | pass  | pass |            |           | FAIL      | pass     |
| UB1604-32      | pass |       |      |            |           | FAIL      |          |
| CENTOS77-64    | pass | pass  | pass | FAIL       | pass      | FAIL      |          |
| UB1604-64      | pass | pass  |      |            |           |           |          |
| WIN10-64       |      |       |      |            |           | pass      |          |
| UB1910-64      | pass |       |      |            |           |           |          |
| FC31-64        | pass | pass  |      |            |           | FAIL      |          |
| CENTOS80-64    | pass |       |      |            |           |           |          |
| FreeBSD1201-64 | pass | pass  |      | pass       | pass      | FAIL      |          |
| RHEL77-64      | pass |       |      |            |           |           |          |
| SUSE15-64      | pass | pass  |      |            |           | FAIL      |          |
+----------------+------+-------+------+------------+-----------+-----------+----------+

Test environment and configuration as below:

** Makefile build **


OS: UB1804-64
	Kernel Version: 4.15.0-20-generic
	CPU info: Intel(R) Xeon(R) CPU E5-2699 v3 @ 2.30GHz
	GCC Version: gcc (Ubuntu 7.3.0-16ubuntu3) 7.3.0
	Clang Version: 6.0.0-1ubuntu2 (tags/RELEASE_600/final)
	x86_64-native-linuxapp-clang
	x86_64-native-linuxapp-icc
	x86_64-native-linuxapp-gcc


OS: UB1604-32
	Kernel Version: 4.4.0-131-generic
	CPU info: Intel(R) Xeon(R) CPU E5-2699 v3 @ 2.30GHz
	GCC Version: gcc (Ubuntu 5.4.0-6ubuntu1~16.04.11) 5.4.0 20160609
	Clang Version: 3.8.0-2ubuntu4 (tags/RELEASE_380/final)
	i686-native-linuxapp-gcc


OS: CENTOS77-64
	Kernel Version: 3.10.0-1062.9.1.el7.x86_64
	CPU info: Intel(R) Xeon(R) CPU E5-2699 v4 @ 2.20GHz
	GCC Version: gcc (GCC) 4.8.5 20150623 (Red Hat 4.8.5-39)
	Clang Version: 3.4.2 (tags/RELEASE_34/dot2-final)
	x86_64-native-linuxapp-gcc+debug
	x86_64-native-linuxapp-clang
	x86_64-native-linuxapp-gcc
	x86_64-native-linuxapp-gcc+shared
	x86_64-native-linuxapp-icc


OS: UB1910-64
	Kernel Version: 5.3.0-18-generic
	CPU info: Intel(R) Xeon(R) CPU E5-2699 v3 @ 2.30GHz
	GCC Version: gcc (Ubuntu 9.2.1-9ubuntu2) 9.2.1 20191008
	Clang Version: 9.0.0-2 (tags/RELEASE_900/final)
	x86_64-native-linuxapp-gcc


OS: CENTOS80-64
	Kernel Version: 4.18.0-80.11.2.el8_0.x86_64
	CPU info: Intel(R) Xeon(R) CPU E5-2699 v4 @ 2.20GHz
	GCC Version: gcc (GCC) 8.2.1 20180905 (Red Hat 8.2.1-3)
	Clang Version: 7.0.1 (tags/RELEASE_701/final)
	x86_64-native-linuxapp-gcc


OS: UB1604-64
	Kernel Version: 4.4.0-170-generic
	CPU info: Intel(R) Xeon(R) CPU E5-2699 v3 @ 2.30GHz
	GCC Version: gcc (Ubuntu 5.4.0-6ubuntu1~16.04.12) 5.4.0 20160609
	Clang Version: 3.8.0-2ubuntu4 (tags/RELEASE_380/final)
	x86_64-native-linuxapp-clang
	x86_64-native-linuxapp-gcc


OS: FC31-64
	Kernel Version: 5.3.15-300.fc31.x86_64
	CPU info: Intel(R) Xeon(R) CPU E5-2699 v4 @ 2.20GHz
	GCC Version: gcc (GCC) 9.2.1 20190827 (Red Hat 9.2.1-1)
	Clang Version: 9.0.0 (Fedora 9.0.0-1.fc31)
	x86_64-native-linuxapp-gcc
	x86_64-native-linuxapp-clang


OS: RHEL80-64
	Kernel Version: 4.18.0-80.el8.x86_64
	CPU info: Intel(R) Xeon(R) CPU E5-2699 v4 @ 2.20GHz
	GCC Version: gcc (GCC) 8.2.1 20180905 (Red Hat 8.2.1-3)
	Clang Version: 6.0.1 (tags/RELEASE_601/final)
	x86_64-native-linuxapp-gcc


OS: FreeBSD1201-64
	Kernel Version: 12.1-RELEASE
	CPU info: Intel(R) Xeon(R) CPU E5-2699 v4 @ 2.20GHz (2194.95-MHz K8-class CPU)
	GCC Version: gcc (FreeBSD Ports Collection) 9.2.0
	Clang Version: 8.0.1 (tags/RELEASE_801/final 366581) (based on LLVM 8.0.1)
	x86_64-native-bsdapp-gcc
	x86_64-native-bsdapp-clang
	x86_64-native-bsdapp-gcc+debug
	x86_64-native-bsdapp-gcc+shared


OS: RHEL77-64
	Kernel Version: 3.10.0-1062.9.1.el7.x86_64
	CPU info: Intel(R) Xeon(R) CPU E5-2699 v4 @ 2.20GHz
	GCC Version: gcc (GCC) 4.8.5 20150623 (Red Hat 4.8.5-39)
	Clang Version: 3.4.2 (tags/RELEASE_34/dot2-final)
	x86_64-native-linuxapp-gcc


OS: SUSE15-64
	Kernel Version: 4.12.14-lp150.11-default
	CPU info: Intel(R) Xeon(R) CPU E5-2699 v4 @ 2.20GHz
	GCC Version: gcc (SUSE Linux) 7.3.1 20180323 [gcc-7-branch revision 258812]
	Clang Version: 5.0.1 (tags/RELEASE_501/final 312548)
	x86_64-native-linuxapp-gcc
	x86_64-native-linuxapp-clang


** Meson build **


OS: UB1804-64
	Kernel Version: 4.15.0-20-generic
	CPU info: Intel(R) Xeon(R) CPU E5-2699 v4 @ 2.20GHz
	GCC Version: gcc (Ubuntu 7.3.0-27ubuntu1~18.04) 7.3.0
	Clang Version: 6.0.0-1ubuntu2 (tags/RELEASE_600/final)
	x86_64-native-linuxapp-doc
	./build-gcc-static
	./build-gcc-shared
	./build-clang-static
	./build-clang-shared
	./build-x86-default


OS: UB1604-32
	Kernel Version: 4.4.0-131-generic
	CPU info: Intel(R) Xeon(R) CPU E5-2699 v4 @ 2.20GHz
	GCC Version: gcc (Ubuntu 5.4.0-6ubuntu1~16.04.11) 5.4.0 20160609
	Clang Version: 3.8.0-2ubuntu4 (tags/RELEASE_380/final)
	./build-gcc-static
	./build-gcc-shared
	./build-clang-static
	./build-clang-shared
	./build-x86-default


OS: CENTOS77-64
	Kernel Version: 3.10.0-1062.12.1.el7.x86_64
	CPU info: Intel(R) Xeon(R) CPU E5-2699 v4 @ 2.20GHz
	GCC Version: gcc (GCC) 4.8.5 20150623 (Red Hat 4.8.5-39)
	Clang Version: 3.4.2 (tags/RELEASE_34/dot2-final)
	./build-gcc-static
	./build-gcc-shared
	./build-clang-static
	./build-clang-shared
	./build-x86-default


OS: WIN10-64
	Kernel Version: N/A
	CPU info: N/A
	GCC Version: N/A
	Clang Version: Clang 8.0.0
	x86_64-windows-clang


OS: FC31-64
	Kernel Version: 5.4.18-200.fc31.x86_64
	CPU info: Intel(R) Xeon(R) CPU E5-2699 v4 @ 2.20GHz
	GCC Version: gcc (GCC) 9.2.1 20190827 (Red Hat 9.2.1-1)
	Clang Version: 9.0.0 (Fedora 9.0.0-1.fc31)
	./build-gcc-static
	./build-gcc-shared
	./build-clang-static
	./build-clang-shared
	./build-x86-default


OS: FreeBSD1201-64
	Kernel Version: 12.1-RELEASE
	CPU info: Intel(R) Xeon(R) CPU E5-2699 v4 @ 2.20GHz (2194.98-MHz K8-class CPU)
	GCC Version: gcc (FreeBSD Ports Collection) 9.2.0
	Clang Version: 8.0.1 (tags/RELEASE_801/final 366581) (based on LLVM 8.0.1)
	./build-gcc-static
	./build-gcc-shared
	./build-clang-static
	./build-clang-shared
	./build-x86-default


OS: SUSE15-64
	Kernel Version: 4.12.14-lp150.12.82-default
	CPU info: Intel(R) Xeon(R) CPU E5-2699 v4 @ 2.20GHz
	GCC Version: gcc (SUSE Linux) 7.4.1 20190905 [gcc-7-branch revision 275407]
	Clang Version: 5.0.1 (tags/RELEASE_501/final 312548)
	./build-gcc-static
	./build-gcc-shared
	./build-clang-static
	./build-clang-shared
	./build-x86-default


*Make Build Failed #1:
OS: CENTOS77-64
Target: x86_64-native-linuxapp-gcc+shared
  MKRES test_resource_c.res.o
  LD test
test_if_proxy.o: In function `test_if_proxy':
test_if_proxy.c:(.text+0xc04): undefined reference to `rte_ifpx_queue_add'
collect2: error: ld returned 1 exit status
make[5]: *** [test] Error 1
make[4]: *** [test] Error 2
make[3]: *** [app] Error 2
make[2]: *** [all] Error 2
make[1]: *** [pre_install] Error 2
make: *** [install] Error 2

*Meson Build Failed #1:
OS: UB1604-32
Target:./build-gcc-static
FAILED: lib/76b5a35@@rte_if_proxy@sta/librte_if_proxy_linux_if_proxy.c.o 
gcc -Ilib/76b5a35@@rte_if_proxy@sta -Ilib -I../lib -Ilib/librte_if_proxy -I../lib/librte_if_proxy -I. -I../ -Iconfig -I../config -Ilib/librte_eal/common/include -I../lib/librte_eal/common/include -I../lib/librte_eal/linux/eal/include -Ilib/librte_eal/common -I../lib/librte_eal/common -Ilib/librte_eal/common/include/arch/x86 -I../lib/librte_eal/common/include/arch/x86 -Ilib/librte_eal -I../lib/librte_eal -Ilib/librte_kvargs -I../lib/librte_kvargs -Ilib/librte_ethdev -I../lib/librte_ethdev -Ilib/librte_net -I../lib/librte_net -Ilib/librte_mbuf -I../lib/librte_mbuf -Ilib/librte_mempool -I../lib/librte_mempool -Ilib/librte_ring -I../lib/librte_ring -Ilib/librte_meter -I../lib/librte_meter -fdiagnostics-color=always -pipe -D_FILE_OFFSET_BITS=64 -Wall -Winvalid-pch -Werror -O2 -g -include rte_config.h -Wextra -Wcast-qual -Wdeprecated -Wformat-nonliteral -Wformat-security -Wmissing-declarations -Wmissing-prototypes -Wnested-externs -Wold-style-definition -Wpointer-arith -Wsign-compare -Wstrict-prototypes -Wundef -Wwrite-strings -Wno-missing-field-initializers -Wno-pointer-to-int-cast -D_GNU_SOURCE -fPIC -march=native -DALLOW_EXPERIMENTAL_API -MD -MQ 'lib/76b5a35@@rte_if_proxy@sta/librte_if_proxy_linux_if_proxy.c.o' -MF 'lib/76b5a35@@rte_if_proxy@sta/librte_if_proxy_linux_if_proxy.c.o.d' -o 'lib/76b5a35@@rte_if_proxy@sta/librte_if_proxy_linux_if_proxy.c.o' -c ../lib/librte_if_proxy/linux/if_proxy.c
In file included from ../lib/librte_if_proxy/linux/if_proxy.c:4:0:
../lib/librte_if_proxy/linux/if_proxy.c: In function ‘if_proxy_intr_callback’:
../lib/librte_if_proxy/if_proxy_priv.h:12:44: error: format ‘%ld’ expects argument of type ‘long int’, but argument 5 has type ‘ssize_t {aka int}’ [-Werror=format=]
  rte_log(RTE_LOG_ ## level, ifpx_log_type, "%s(): " fmt "\n", \
                                            ^
../lib/librte_if_proxy/linux/if_proxy.c:384:3: note: in expansion of macro ‘IFPX_LOG’
   IFPX_LOG(ERR, "Failed to read netlink msg: %ld (errno %d)",
   ^
../lib/librte_if_proxy/if_proxy_priv.h:12:44: error: format ‘%lu’ expects argument of type ‘long unsigned int’, but argument 5 has type ‘ssize_t {aka int}’ [-Werror=format=]
  rte_log(RTE_LOG_ ## level, ifpx_log_type, "%s(): " fmt "\n", \
                                            ^
../lib/librte_if_proxy/linux/if_proxy.c:392:2: note: in expansion of macro ‘IFPX_LOG’
  IFPX_LOG(DEBUG, "Read %lu bytes (buf %lu) from %u/%u", len,
  ^
../lib/librte_if_proxy/if_proxy_priv.h:12:44: error: format ‘%lu’ expects argument of type ‘long unsigned int’, but argument 6 has type ‘unsigned int’ [-Werror=format=]
  rte_log(RTE_LOG_ ## level, ifpx_log_type, "%s(): " fmt "\n", \
                                            ^
../lib/librte_if_proxy/linux/if_proxy.c:392:2: note: in expansion of macro ‘IFPX_LOG’
  IFPX_LOG(DEBUG, "Read %lu bytes (buf %lu) from %u/%u", len,
  ^
../lib/librte_if_proxy/if_proxy_priv.h:12:44: error: format ‘%ld’ expects argument of type ‘long int’, but argument 5 has type ‘ssize_t {aka int}’ [-Werror=format=]
  rte_log(RTE_LOG_ ## level, ifpx_log_type, "%s(): " fmt "\n", \
                                            ^
../lib/librte_if_proxy/linux/if_proxy.c:444:2: note: in expansion of macro ‘IFPX_LOG’
  IFPX_LOG(DEBUG, "Finished msg loop: %ld bytes left", len);
  ^
cc1: all warnings being treated as errors
[240/1982] Compiling C object 'lib/76b5a35@@rte_if_proxy@sta/librte_if_proxy_if_proxy_common.c.o'.
[241/1982] Generating gso.exp_chk with a meson_exe.py custom command.
[242/1982] Generating symbol file 'lib/76b5a35@@rte_eventdev@sha/librte_eventdev.so.20.0.2.symbols'.
[243/1982] Compiling C object 'lib/76b5a35@@rte_ip_frag@sta/librte_ip_frag_rte_ipv4_fragmentation.c.o'.
[244/1982] Compiling C object 'lib/76b5a35@@rte_ip_frag@sta/librte_ip_frag_rte_ipv6_fragmentation.c.o'.
ninja: build stopped: subcommand failed




*Meson Build Failed #2:
OS: CENTOS77-64
Target:./build-gcc-static
FAILED: examples/c590b3c@@dpdk-l3fwd-ifpx@exe/l3fwd-ifpx_l3fwd.c.o 
gcc -Iexamples/c590b3c@@dpdk-l3fwd-ifpx@exe -Iexamples -I../examples -Iexamples/l3fwd-ifpx -I../examples/l3fwd-ifpx -I. -I../ -Iconfig -I../config -Ilib/librte_eal/common/include -I../lib/librte_eal/common/include -I../lib/librte_eal/linux/eal/include -Ilib/librte_eal/common -I../lib/librte_eal/common -Ilib/librte_eal/common/include/arch/x86 -I../lib/librte_eal/common/include/arch/x86 -Ilib/librte_eal -I../lib/librte_eal -Ilib/librte_kvargs -I../lib/librte_kvargs -Ilib/librte_mempool -I../lib/librte_mempool -Ilib/librte_ring -I../lib/librte_ring -Ilib/librte_net -I../lib/librte_net -Ilib/librte_mbuf -I../lib/librte_mbuf -Ilib/librte_ethdev -I../lib/librte_ethdev -Ilib/librte_meter -I../lib/librte_meter -Ilib/librte_cmdline -I../lib/librte_cmdline -Ilib/librte_hash -I../lib/librte_hash -Ilib/librte_lpm -I../lib/librte_lpm -Ilib/librte_if_proxy -I../lib/librte_if_proxy -pipe -D_FILE_OFFSET_BITS=64 -Wall -Winvalid-pch -Werror -O2 -g -include rte_config.h -Wextra -Wcast-qual -Wdeprecated -Wformat-nonliteral -Wformat-security -Wmissing-declarations -Wmissing-prototypes -Wnested-externs -Wold-style-definition -Wpointer-arith -Wsign-compare -Wstrict-prototypes -Wundef -Wwrite-strings -Wno-missing-field-initializers -D_GNU_SOURCE -march=native -DALLOW_EXPERIMENTAL_API -MD -MQ 'examples/c590b3c@@dpdk-l3fwd-ifpx@exe/l3fwd-ifpx_l3fwd.c.o' -MF 'examples/c590b3c@@dpdk-l3fwd-ifpx@exe/l3fwd-ifpx_l3fwd.c.o.d' -o 'examples/c590b3c@@dpdk-l3fwd-ifpx@exe/l3fwd-ifpx_l3fwd.c.o' -c ../examples/l3fwd-ifpx/l3fwd.c
../examples/l3fwd-ifpx/l3fwd.c: In function ‘addr6_del’:
../examples/l3fwd-ifpx/l3fwd.c:378:2: error: passing argument 2 of ‘rte_lpm6_delete’ discards ‘const’ qualifier from pointer target type [-Werror]
  rte_lpm6_delete(ipv6_routes, ev->ip, 128);
  ^
In file included from ../examples/l3fwd-ifpx/l3fwd.c:34:0:
../lib/librte_lpm/rte_lpm6.h:132:1: note: expected ‘uint8_t *’ but argument is of type ‘const uint8_t *’
 rte_lpm6_delete(struct rte_lpm6 *lpm, uint8_t *ip, uint8_t depth);
 ^
../examples/l3fwd-ifpx/l3fwd.c: In function ‘route6_del’:
../examples/l3fwd-ifpx/l3fwd.c:394:2: error: passing argument 2 of ‘rte_lpm6_delete’ discards ‘const’ qualifier from pointer target type [-Werror]
  rte_lpm6_delete(ipv6_routes, ev->ip, ev->depth);
  ^
In file included from ../examples/l3fwd-ifpx/l3fwd.c:34:0:
../lib/librte_lpm/rte_lpm6.h:132:1: note: expected ‘uint8_t *’ but argument is of type ‘const uint8_t *’
 rte_lpm6_delete(struct rte_lpm6 *lpm, uint8_t *ip, uint8_t depth);
 ^
cc1: all warnings being treated as errors
[2113/2248] Compiling C object 'examples/c590b3c@@dpdk-l3fwd@exe/l3fwd_l3fwd_lpm.c.o'.
[2114/2248] Generating rte_pmd_octeontx2_event.pmd.c with a custom command.
[2115/2248] Compiling C object 'examples/c590b3c@@dpdk-l2fwd-crypto@exe/l2fwd-crypto_main.c.o'.
[2116/2248] Compiling C object 'examples/c590b3c@@dpdk-l3fwd-power@exe/l3fwd-power_main.c.o'.
[2117/2248] Compiling C object 'app/test/3062f5d@@dpdk-test@exe/test_ring.c.o'.
ninja: build stopped: subcommand failed




*Meson Build Failed #3:
OS: FC31-64
Target:./build-gcc-static
FAILED: examples/c590b3c@@dpdk-l3fwd-ifpx@exe/l3fwd-ifpx_l3fwd.c.o 
gcc -Iexamples/c590b3c@@dpdk-l3fwd-ifpx@exe -Iexamples -I../examples -Iexamples/l3fwd-ifpx -I../examples/l3fwd-ifpx -I. -I../ -Iconfig -I../config -Ilib/librte_eal/common/include -I../lib/librte_eal/common/include -I../lib/librte_eal/linux/eal/include -Ilib/librte_eal/common -I../lib/librte_eal/common -Ilib/librte_eal/common/include/arch/x86 -I../lib/librte_eal/common/include/arch/x86 -Ilib/librte_eal -I../lib/librte_eal -Ilib/librte_kvargs -I../lib/librte_kvargs -Ilib/librte_mempool -I../lib/librte_mempool -Ilib/librte_ring -I../lib/librte_ring -Ilib/librte_net -I../lib/librte_net -Ilib/librte_mbuf -I../lib/librte_mbuf -Ilib/librte_ethdev -I../lib/librte_ethdev -Ilib/librte_meter -I../lib/librte_meter -Ilib/librte_cmdline -I../lib/librte_cmdline -Ilib/librte_hash -I../lib/librte_hash -Ilib/librte_lpm -I../lib/librte_lpm -Ilib/librte_if_proxy -I../lib/librte_if_proxy -fdiagnostics-color=always -pipe -D_FILE_OFFSET_BITS=64 -Wall -Winvalid-pch -Werror -O2 -g -include rte_config.h -Wextra -Wcast-qual -Wdeprecated -Wformat-nonliteral -Wformat-security -Wmissing-declarations -Wmissing-prototypes -Wnested-externs -Wold-style-definition -Wpointer-arith -Wsign-compare -Wstrict-prototypes -Wundef -Wwrite-strings -Wno-address-of-packed-member -Wno-packed-not-aligned -Wno-missing-field-initializers -D_GNU_SOURCE -march=native -Wno-format-truncation -DALLOW_EXPERIMENTAL_API -MD -MQ 'examples/c590b3c@@dpdk-l3fwd-ifpx@exe/l3fwd-ifpx_l3fwd.c.o' -MF 'examples/c590b3c@@dpdk-l3fwd-ifpx@exe/l3fwd-ifpx_l3fwd.c.o.d' -o 'examples/c590b3c@@dpdk-l3fwd-ifpx@exe/l3fwd-ifpx_l3fwd.c.o' -c ../examples/l3fwd-ifpx/l3fwd.c
../examples/l3fwd-ifpx/l3fwd.c: In function ‘addr6_del’:
../examples/l3fwd-ifpx/l3fwd.c:378:33: error: passing argument 2 of ‘rte_lpm6_delete’ discards ‘const’ qualifier from pointer target type [-Werror=discarded-qualifiers]
  378 |  rte_lpm6_delete(ipv6_routes, ev->ip, 128);
      |                               ~~^~~~
In file included from ../examples/l3fwd-ifpx/l3fwd.c:34:
../lib/librte_lpm/rte_lpm6.h:132:48: note: expected ‘uint8_t *’ {aka ‘unsigned char *’} but argument is of type ‘const uint8_t *’ {aka ‘const unsigned char *’}
  132 | rte_lpm6_delete(struct rte_lpm6 *lpm, uint8_t *ip, uint8_t depth);
      |                                       ~~~~~~~~~^~
../examples/l3fwd-ifpx/l3fwd.c: In function ‘route6_del’:
../examples/l3fwd-ifpx/l3fwd.c:394:33: error: passing argument 2 of ‘rte_lpm6_delete’ discards ‘const’ qualifier from pointer target type [-Werror=discarded-qualifiers]
  394 |  rte_lpm6_delete(ipv6_routes, ev->ip, ev->depth);
      |                               ~~^~~~
In file included from ../examples/l3fwd-ifpx/l3fwd.c:34:
../lib/librte_lpm/rte_lpm6.h:132:48: note: expected ‘uint8_t *’ {aka ‘unsigned char *’} but argument is of type ‘const uint8_t *’ {aka ‘const unsigned char *’}
  132 | rte_lpm6_delete(struct rte_lpm6 *lpm, uint8_t *ip, uint8_t depth);
      |                                       ~~~~~~~~~^~
cc1: all warnings being treated as errors
[2126/2257] Compiling C object 'examples/c590b3c@@dpdk-link_status_interrupt@exe/link_status_interrupt_main.c.o'.
[2127/2257] Compiling C object 'examples/c590b3c@@dpdk-l3fwd-power@exe/l3fwd-power_main.c.o'.
[2128/2257] Compiling C object 'examples/c590b3c@@dpdk-packet_ordering@exe/packet_ordering_main.c.o'.
[2129/2257] Compiling C object 'examples/c590b3c@@dpdk-ntb@exe/ntb_ntb_fwd.c.o'.
[2130/2257] Compiling C object 'drivers/a715181@@tmp_rte_pmd_octeontx2_event@sta/event_octeontx2_otx2_worker.c.o'.
[2131/2257] Compiling C object 'drivers/a715181@@tmp_rte_pmd_octeontx2_event@sta/event_octeontx2_otx2_worker_dual.c.o'.
[2132/2257] Compiling C object 'app/test/3062f5d@@dpdk-test@exe/test_ring.c.o'.
ninja: build stopped: subcommand failed




*Meson Build Failed #4:
OS: UB1804-64
Target:./build-gcc-static
FAILED: examples/c590b3c@@dpdk-l3fwd-ifpx@exe/l3fwd-ifpx_l3fwd.c.o 
gcc -Iexamples/c590b3c@@dpdk-l3fwd-ifpx@exe -Iexamples -I../examples -Iexamples/l3fwd-ifpx -I../examples/l3fwd-ifpx -I. -I../ -Iconfig -I../config -Ilib/librte_eal/common/include -I../lib/librte_eal/common/include -I../lib/librte_eal/linux/eal/include -Ilib/librte_eal/common -I../lib/librte_eal/common -Ilib/librte_eal/common/include/arch/x86 -I../lib/librte_eal/common/include/arch/x86 -Ilib/librte_eal -I../lib/librte_eal -Ilib/librte_kvargs -I../lib/librte_kvargs -Ilib/librte_mempool -I../lib/librte_mempool -Ilib/librte_ring -I../lib/librte_ring -Ilib/librte_net -I../lib/librte_net -Ilib/librte_mbuf -I../lib/librte_mbuf -Ilib/librte_ethdev -I../lib/librte_ethdev -Ilib/librte_meter -I../lib/librte_meter -Ilib/librte_cmdline -I../lib/librte_cmdline -Ilib/librte_hash -I../lib/librte_hash -Ilib/librte_lpm -I../lib/librte_lpm -Ilib/librte_if_proxy -I../lib/librte_if_proxy -fdiagnostics-color=always -pipe -D_FILE_OFFSET_BITS=64 -Wall -Winvalid-pch -Werror -O2 -g -include rte_config.h -Wextra -Wcast-qual -Wdeprecated -Wformat-nonliteral -Wformat-security -Wmissing-declarations -Wmissing-prototypes -Wnested-externs -Wold-style-definition -Wpointer-arith -Wsign-compare -Wstrict-prototypes -Wundef -Wwrite-strings -Wno-missing-field-initializers -D_GNU_SOURCE -march=native -mno-avx512f -Wno-format-truncation -DALLOW_EXPERIMENTAL_API -MD -MQ 'examples/c590b3c@@dpdk-l3fwd-ifpx@exe/l3fwd-ifpx_l3fwd.c.o' -MF 'examples/c590b3c@@dpdk-l3fwd-ifpx@exe/l3fwd-ifpx_l3fwd.c.o.d' -o 'examples/c590b3c@@dpdk-l3fwd-ifpx@exe/l3fwd-ifpx_l3fwd.c.o' -c ../examples/l3fwd-ifpx/l3fwd.c
../examples/l3fwd-ifpx/l3fwd.c: In function ‘addr6_del’:
../examples/l3fwd-ifpx/l3fwd.c:378:31: error: passing argument 2 of ‘rte_lpm6_delete’ discards ‘const’ qualifier from pointer target type [-Werror=discarded-qualifiers]
  rte_lpm6_delete(ipv6_routes, ev->ip, 128);
                               ^~
In file included from ../examples/l3fwd-ifpx/l3fwd.c:34:0:
../lib/librte_lpm/rte_lpm6.h:132:1: note: expected ‘uint8_t * {aka unsigned char *}’ but argument is of type ‘const uint8_t * {aka const unsigned char *}’
 rte_lpm6_delete(struct rte_lpm6 *lpm, uint8_t *ip, uint8_t depth);
 ^~~~~~~~~~~~~~~
../examples/l3fwd-ifpx/l3fwd.c: In function ‘route6_del’:
../examples/l3fwd-ifpx/l3fwd.c:394:31: error: passing argument 2 of ‘rte_lpm6_delete’ discards ‘const’ qualifier from pointer target type [-Werror=discarded-qualifiers]
  rte_lpm6_delete(ipv6_routes, ev->ip, ev->depth);
                               ^~
In file included from ../examples/l3fwd-ifpx/l3fwd.c:34:0:
../lib/librte_lpm/rte_lpm6.h:132:1: note: expected ‘uint8_t * {aka unsigned char *}’ but argument is of type ‘const uint8_t * {aka const unsigned char *}’
 rte_lpm6_delete(struct rte_lpm6 *lpm, uint8_t *ip, uint8_t depth);
 ^~~~~~~~~~~~~~~
cc1: all warnings being treated as errors
[2079/2170] Linking target examples/dpdk-l2fwd-event.
[2080/2170] Linking target examples/dpdk-l3fwd.
[2081/2170] Compiling C object 'examples/c590b3c@@dpdk-l3fwd-acl@exe/l3fwd-acl_main.c.o'.
[2082/2170] Compiling C object 'examples/c590b3c@@dpdk-ntb@exe/ntb_ntb_fwd.c.o'.
[2083/2170] Compiling C object 'examples/c590b3c@@dpdk-l3fwd-power@exe/l3fwd-power_main.c.o'.
ninja: build stopped: subcommand failed




*Meson Build Failed #5:
OS: FreeBSD1201-64
Target:./build-gcc-static
Message: Skipping example "kni"
Library pqos found: NO
Message: Skipping example "l2fwd-cat"
Library rt found: YES

examples/meson.build:93:4: ERROR: Problem encountered: Missing dependency "if_proxy" for example "l3fwd-ifpx"

A full log can be found at /root/FreeBSD1201-64_K12.1_GCC9.2.0/x86_64-native-bsdapp-gcc/fa7a50db395c47e79f7d6aeb4abbd710/dpdk/build-gcc-static/meson-logs/meson-log.txt
ninja -C ./build-gcc-static
ninja: Entering directory `./build-gcc-static'
ninja: error: loading 'build.ninja': No such file or directory
--
Message: Skipping example "kni"
Library pqos found: NO
Message: Skipping example "l2fwd-cat"
Library rt found: YES

examples/meson.build:93:4: ERROR: Problem encountered: Missing dependency "if_proxy" for example "l3fwd-ifpx"

A full log can be found at /root/FreeBSD1201-64_K12.1_GCC9.2.0/x86_64-native-bsdapp-gcc/fa7a50db395c47e79f7d6aeb4abbd710/dpdk/build-gcc-shared/meson-logs/meson-log.txt
ninja -C ./build-gcc-shared
ninja: Entering directory `./build-gcc-shared'
ninja: error: loading 'build.ninja': No such file or directory
--
Message: Skipping example "kni"
Library pqos found: NO
Message: Skipping example "l2fwd-cat"
Library rt found: YES

examples/meson.build:93:4: ERROR: Problem encountered: Missing dependency "if_proxy" for example "l3fwd-ifpx"

A full log can be found at /root/FreeBSD1201-64_K12.1_GCC9.2.0/x86_64-native-bsdapp-gcc/fa7a50db395c47e79f7d6aeb4abbd710/dpdk/build-clang-static/meson-logs/meson-log.txt
ninja -C ./build-clang-static
ninja: Entering directory `./build-clang-static'
ninja: error: loading 'build.ninja': No such file or directory
--
Message: Skipping example "kni"
Library pqos found: NO
Message: Skipping example "l2fwd-cat"
Library rt found: YES

examples/meson.build:93:4: ERROR: Problem encountered: Missing dependency "if_proxy" for example "l3fwd-ifpx"

A full log can be found at /root/FreeBSD1201-64_K12.1_GCC9.2.0/x86_64-native-bsdapp-gcc/fa7a50db395c47e79f7d6aeb4abbd710/dpdk/build-clang-shared/meson-logs/meson-log.txt
ninja -C ./build-clang-shared
ninja: Entering directory `./build-clang-shared'
ninja: error: loading 'build.ninja': No such file or directory
--
Message: Skipping example "kni"
Library pqos found: NO
Message: Skipping example "l2fwd-cat"
Library rt found: YES

examples/meson.build:93:4: ERROR: Problem encountered: Missing dependency "if_proxy" for example "l3fwd-ifpx"

A full log can be found at /root/FreeBSD1201-64_K12.1_GCC9.2.0/x86_64-native-bsdapp-gcc/fa7a50db395c47e79f7d6aeb4abbd710/dpdk/build-x86-default/meson-logs/meson-log.txt
ninja -C ./build-x86-default
ninja: Entering directory `./build-x86-default'
ninja: error: loading 'build.ninja': No such file or directory


*Meson Build Failed #6:
OS: SUSE15-64
Target:./build-gcc-static
FAILED: examples/c590b3c@@dpdk-l3fwd-ifpx@exe/l3fwd-ifpx_l3fwd.c.o 
gcc -Iexamples/c590b3c@@dpdk-l3fwd-ifpx@exe -Iexamples -I../examples -Iexamples/l3fwd-ifpx -I../examples/l3fwd-ifpx -I. -I../ -Iconfig -I../config -Ilib/librte_eal/common/include -I../lib/librte_eal/common/include -I../lib/librte_eal/linux/eal/include -Ilib/librte_eal/common -I../lib/librte_eal/common -Ilib/librte_eal/common/include/arch/x86 -I../lib/librte_eal/common/include/arch/x86 -Ilib/librte_eal -I../lib/librte_eal -Ilib/librte_kvargs -I../lib/librte_kvargs -Ilib/librte_mempool -I../lib/librte_mempool -Ilib/librte_ring -I../lib/librte_ring -Ilib/librte_net -I../lib/librte_net -Ilib/librte_mbuf -I../lib/librte_mbuf -Ilib/librte_ethdev -I../lib/librte_ethdev -Ilib/librte_meter -I../lib/librte_meter -Ilib/librte_cmdline -I../lib/librte_cmdline -Ilib/librte_hash -I../lib/librte_hash -Ilib/librte_lpm -I../lib/librte_lpm -Ilib/librte_if_proxy -I../lib/librte_if_proxy -fdiagnostics-color=always -pipe -D_FILE_OFFSET_BITS=64 -Wall -Winvalid-pch -Werror -O2 -g -include rte_config.h -Wextra -Wcast-qual -Wdeprecated -Wformat-nonliteral -Wformat-security -Wmissing-declarations -Wmissing-prototypes -Wnested-externs -Wold-style-definition -Wpointer-arith -Wsign-compare -Wstrict-prototypes -Wundef -Wwrite-strings -Wno-missing-field-initializers -D_GNU_SOURCE -march=native -Wno-format-truncation -DALLOW_EXPERIMENTAL_API -MD -MQ 'examples/c590b3c@@dpdk-l3fwd-ifpx@exe/l3fwd-ifpx_l3fwd.c.o' -MF 'examples/c590b3c@@dpdk-l3fwd-ifpx@exe/l3fwd-ifpx_l3fwd.c.o.d' -o 'examples/c590b3c@@dpdk-l3fwd-ifpx@exe/l3fwd-ifpx_l3fwd.c.o' -c ../examples/l3fwd-ifpx/l3fwd.c
../examples/l3fwd-ifpx/l3fwd.c: In function ‘addr6_del’:
../examples/l3fwd-ifpx/l3fwd.c:378:31: error: passing argument 2 of ‘rte_lpm6_delete’ discards ‘const’ qualifier from pointer target type [-Werror=discarded-qualifiers]
  rte_lpm6_delete(ipv6_routes, ev->ip, 128);
                               ^~
In file included from ../examples/l3fwd-ifpx/l3fwd.c:34:0:
../lib/librte_lpm/rte_lpm6.h:132:1: note: expected ‘uint8_t * {aka unsigned char *}’ but argument is of type ‘const uint8_t * {aka const unsigned char *}’
 rte_lpm6_delete(struct rte_lpm6 *lpm, uint8_t *ip, uint8_t depth);
 ^~~~~~~~~~~~~~~
../examples/l3fwd-ifpx/l3fwd.c: In function ‘route6_del’:
../examples/l3fwd-ifpx/l3fwd.c:394:31: error: passing argument 2 of ‘rte_lpm6_delete’ discards ‘const’ qualifier from pointer target type [-Werror=discarded-qualifiers]
  rte_lpm6_delete(ipv6_routes, ev->ip, ev->depth);
                               ^~
In file included from ../examples/l3fwd-ifpx/l3fwd.c:34:0:
../lib/librte_lpm/rte_lpm6.h:132:1: note: expected ‘uint8_t * {aka unsigned char *}’ but argument is of type ‘const uint8_t * {aka const unsigned char *}’
 rte_lpm6_delete(struct rte_lpm6 *lpm, uint8_t *ip, uint8_t depth);
 ^~~~~~~~~~~~~~~
cc1: all warnings being treated as errors
[2027/2160] Compiling C object 'examples/c590b3c@@dpdk-mp_client@exe/multi_process_client_server_mp_mp_client_client.c.o'.
[2028/2160] Compiling C object 'examples/c590b3c@@dpdk-l3fwd@exe/l3fwd_l3fwd_event.c.o'.
[2029/2160] Compiling C object 'examples/c590b3c@@dpdk-mp_server@exe/multi_process_client_server_mp_mp_server_main.c.o'.
[2030/2160] Compiling C object 'examples/c590b3c@@dpdk-l3fwd@exe/l3fwd_l3fwd_em.c.o'.
[2031/2160] Compiling C object 'drivers/a715181@@tmp_rte_pmd_octeontx2_event@sta/event_octeontx2_otx2_worker.c.o'.
[2032/2160] Compiling C object 'drivers/a715181@@tmp_rte_pmd_octeontx2_event@sta/event_octeontx2_otx2_worker_dual.c.o'.
[2033/2160] Compiling C object 'app/test/3062f5d@@dpdk-test@exe/test_ring.c.o'.
ninja: build stopped: subcommand failed



DPDK STV team

^ permalink raw reply	[flat|nested] 2+ messages in thread
* [dpdk-test-report]  |FAILURE| pw66505[v2, 2/4] if_proxy: add library documentation
@ 2020-03-11  3:19 sys_stv
  0 siblings, 0 replies; 2+ messages in thread
From: sys_stv @ 2020-03-11  3:19 UTC (permalink / raw)
  To: test-report

[-- Attachment #1: Type: text/plain, Size: 484 bytes --]

Test-Label: Intel-compilation
Test-Status: FAILURE
http://dpdk.org/patch/66505

_apply issues_

Submitter: Andrzej Ostruszka <aostruszka@marvell.com>
Date: 2020-03-10 11:10:35
Reply_mail: 20200310111037.31451-3-aostruszka@marvell.com
DPDK git baseline:
	Repo:dpdk, CommitID: 44c775feb491106d472c1a44433c6427a3fb3b3b

*Repo: dpdk
F: lib/librte_if_proxy/

Test Applications
-----------------

error: patch failed: MAINTAINERS:1472
error: MAINTAINERS: patch does not apply

DPDK STV team

^ permalink raw reply	[flat|nested] 2+ messages in thread

end of thread, other threads:[~2020-03-11  3:19 UTC | newest]

Thread overview: 2+ messages (download: mbox.gz / follow: Atom feed)
-- links below jump to the message on this page --
2020-03-11  1:10 [dpdk-test-report] |FAILURE| pw66505[v2, 2/4] if_proxy: add library documentation sys_stv
2020-03-11  3:19 sys_stv

automatic DPDK test reports

This inbox may be cloned and mirrored by anyone:

	git clone --mirror https://inbox.dpdk.org/test-report/0 test-report/git/0.git

	# If you have public-inbox 1.1+ installed, you may
	# initialize and index your mirror using the following commands:
	public-inbox-init -V2 test-report test-report/ https://inbox.dpdk.org/test-report \
		test-report@dpdk.org
	public-inbox-index test-report

Example config snippet for mirrors.
Newsgroup available over NNTP:
	nntp://inbox.dpdk.org/inbox.dpdk.test-report


AGPL code for this site: git clone https://public-inbox.org/public-inbox.git